httpd-users mailing list archives

Site index · List index
Message view « Date » · « Thread »
Top « Date » · « Thread »
From Dror Braznitzki <Dro...@yellowpages.co.il>
Subject Apache 1.3.22 installation problem on SunOS 5.7
Date Mon, 07 Jan 2002 15:38:18 GMT
While trying to install Apache 1.3.22 on a SunOs 5.7 machine I get this
error after starting the 'make' stage :

===> src
make[1]: Entering directory
`/raid/AMDOCS/dpzuser.wu06/apps/apache/3Servers/src/httpd_docs/apache_1.3.22
'
make[2]: Entering directory
`/raid/AMDOCS/dpzuser.wu06/apps/apache/3Servers/src/httpd_docs/apache_1.3.22
/src'
===> src/os/unix
make[3]: Nothing to be done for `all'.
<=== src/os/unix
===> src/ap
make[3]: Nothing to be done for `all'.
<=== src/ap
===> src/main
gcc -c  -I../os/unix -I../include   -DSOLARIS2=270 -DNO_DL_NEEDED `../apaci`
alloc.c
gcc -c  -I../os/unix -I../include   -DSOLARIS2=270 -DNO_DL_NEEDED `../apaci`
buff.c
gcc -c  -I../os/unix -I../include   -DSOLARIS2=270 -DNO_DL_NEEDED `../apaci`
http_config.c
gcc -c  -I../os/unix -I../include   -DSOLARIS2=270 -DNO_DL_NEEDED `../apaci`
http_core.c
gcc -c  -I../os/unix -I../include   -DSOLARIS2=270 -DNO_DL_NEEDED `../apaci`
http_log.c
gcc -c  -I../os/unix -I../include   -DSOLARIS2=270 -DNO_DL_NEEDED `../apaci`
http_main.c
gcc -c  -I../os/unix -I../include   -DSOLARIS2=270 -DNO_DL_NEEDED `../apaci`
http_protocol.c
gcc -c  -I../os/unix -I../include   -DSOLARIS2=270 -DNO_DL_NEEDED `../apaci`
http_request.c
gcc -c  -I../os/unix -I../include   -DSOLARIS2=270 -DNO_DL_NEEDED `../apaci`
http_vhost.c
gcc -c  -I../os/unix -I../include   -DSOLARIS2=270 -DNO_DL_NEEDED `../apaci`
util.c
util.c: In function `ap_find_token':
util.c:1410: `test_char_table' undeclared (first use in this function)
util.c:1410: (Each undeclared identifier is reported only once
util.c:1410: for each function it appears in.)
util.c:1410: `T_HTTP_TOKEN_STOP' undeclared (first use in this function)
util.c: In function `ap_escape_shell_cmd':
util.c:1469: `test_char_table' undeclared (first use in this function)
util.c:1469: `T_ESCAPE_SHELL_CMD' undeclared (first use in this function)
util.c: In function `ap_escape_path_segment':
util.c:1596: `test_char_table' undeclared (first use in this function)
util.c:1596: `T_ESCAPE_PATH_SEGMENT' undeclared (first use in this function)
util.c: In function `ap_os_escape_path':
util.c:1625: `test_char_table' undeclared (first use in this function)
util.c:1625: `T_OS_ESCAPE_PATH' undeclared (first use in this function)
make[3]: *** [util.o] Error 1
make[2]: *** [subdirs] Error 1
make[2]: Leaving directory
`/raid/AMDOCS/dpzuser.wu06/apps/apache/3Servers/src/httpd_docs/apache_1.3.22
/src'
make[1]: *** [build-std] Error 2
make[1]: Leaving directory
`/raid/AMDOCS/dpzuser.wu06/apps/apache/3Servers/src/httpd_docs/apache_1.3.22
'
make: *** [build] Error 2

While searching all around the net, I found a few instances of this problem,
but no answer, can anyone help

Thanx,

Dror B





**********************************************************************
This email and any files transmitted with it are confidential and
intended solely for the use of the individual or entity to whom they
are addressed. If you have received this email in error please notify
the system manager.

This footnote also confirms that this email message has been swept by
MIMEsweeper for the presence of computer viruses.

www.yellowpages.co.il
**********************************************************************


Mime
View raw message