incubator-nuvem-dev mailing list archives

Site index · List index
Message view « Date » · « Thread »
Top « Date » · « Thread »
From john pradeep <yehohan...@gmail.com>
Subject Re: Nuvem build errors
Date Thu, 02 Jun 2011 16:21:02 GMT
Hi Pasindu,
I noticed this error couple of days back, I corrected all the errors, I will
commit them in an hour.


Thanks,
John


On Thu, Jun 2, 2011 at 9:35 PM, Pasindu Gunarathne
<pasindu.gsoc@gmail.com>wrote:

> Hi all,
>
> I got source codes from here
> http://svn.apache.org/repos/asf/incubator/nuvem/trunk/ and tried to
> build the project with Maven but getting following errors. Can someone
> help me to solve these errors I use Apache Maven 2.2.1 on Java
> 1.6.0_22.
>
>
>
> Thanks ,
>
> Pasindu Madubashana
>
>
>
> T E S T S
> -------------------------------------------------------
> Running org.apache.nuvem.cloud.xmpp.impl.GooglePresenceServletTestCase
> Tests run: 1, Failures: 0, Errors: 1, Skipped: 0, Time elapsed: 0.061
> sec <<< FAILURE!
>
> initializationError(org.apache.nuvem.cloud.xmpp.impl.GooglePresenceServletTestCase)
>  Time elapsed: 0.006 sec  <<< ERROR!
> java.lang.Exception: No runnable methods
>        at
> org.junit.runners.BlockJUnit4ClassRunner.validateInstanceMethods(BlockJUnit4ClassRunner.java:171)
>        at
> org.junit.runners.BlockJUnit4ClassRunner.collectInitializationErrors(BlockJUnit4ClassRunner.java:115)
>        at org.junit.runners.ParentRunner.validate(ParentRunner.java:269)
>        at org.junit.runners.ParentRunner.<init>(ParentRunner.java:66)
>        at
> org.junit.runners.BlockJUnit4ClassRunner.<init>(BlockJUnit4ClassRunner.java:59)
>        at
> org.junit.internal.builders.JUnit4Builder.runnerForClass(JUnit4Builder.java:13)
>        at
> org.junit.runners.model.RunnerBuilder.safeRunnerForClass(RunnerBuilder.java:57)
>        at
> org.junit.internal.builders.AllDefaultPossibilitiesBuilder.runnerForClass(AllDefaultPossibilitiesBuilder.java:29)
>        at
> org.junit.runners.model.RunnerBuilder.safeRunnerForClass(RunnerBuilder.java:57)
>        at
> org.junit.internal.requests.ClassRequest.getRunner(ClassRequest.java:24)
>        at
> org.apache.maven.surefire.junit4.JUnit4TestSet.execute(JUnit4TestSet.java:51)
>        at
> org.apache.maven.surefire.suite.AbstractDirectoryTestSuite.executeTestSet(AbstractDirectoryTestSuite.java:115)
>        at
> org.apache.maven.surefire.suite.AbstractDirectoryTestSuite.execute(AbstractDirectoryTestSuite.java:102)
>        at org.apache.maven.surefire.Surefire.run(Surefire.java:180)
>        at sun.reflect.NativeMethodAccessorImpl.invoke0(Native Method)
>        at
> sun.reflect.NativeMethodAccessorImpl.invoke(NativeMethodAccessorImpl.java:39)
>        at
> sun.reflect.DelegatingMethodAccessorImpl.invoke(DelegatingMethodAccessorImpl.java:25)
>        at java.lang.reflect.Method.invoke(Method.java:597)
>        at
> org.apache.maven.surefire.booter.SurefireBooter.runSuitesInProcess(SurefireBooter.java:350)
>        at
> org.apache.maven.surefire.booter.SurefireBooter.main(SurefireBooter.java:1021)
>
> Running org.apache.nuvem.cloud.xmpp.impl.GoogleXMPPEndPointTestCase
> Jun 2, 2011 9:22:39 PM
> org.apache.nuvem.cloud.xmpp.impl.GoogleXMPPEndPoint sendMessage
> INFO: user offline...
> Jun 2, 2011 9:22:39 PM
> org.apache.nuvem.cloud.xmpp.impl.GoogleXMPPEndPoint sendMessage
> INFO: user online...
> Jun 2, 2011 9:22:39 PM
> org.apache.nuvem.cloud.xmpp.impl.GoogleXMPPEndPoint sendMessage
> INFO: com.google.appengine.api.xmpp.SendResponse@513bd574
> Tests run: 7, Failures: 0, Errors: 0, Skipped: 0, Time elapsed: 0.15 sec
> Running
> org.apache.nuvem.cloud.data.impl.MemcacheDocumentServiceImplTestCase
> Tests run: 2, Failures: 0, Errors: 2, Skipped: 0, Time elapsed: 0.128
> sec <<< FAILURE!
> get(org.apache.nuvem.cloud.data.impl.MemcacheDocumentServiceImplTestCase)
>  Time elapsed: 0.114 sec  <<< ERROR!
> java.lang.NoClassDefFoundError:
> com/google/appengine/tools/development/RequestEndListener
>        at java.lang.ClassLoader.defineClass1(Native Method)
>        at java.lang.ClassLoader.defineClassCond(ClassLoader.java:632)
>        at java.lang.ClassLoader.defineClass(ClassLoader.java:616)
>        at
> java.security.SecureClassLoader.defineClass(SecureClassLoader.java:141)
>        at java.net.URLClassLoader.defineClass(URLClassLoader.java:283)
>        at java.net.URLClassLoader.access$000(URLClassLoader.java:58)
>        at java.net.URLClassLoader$1.run(URLClassLoader.java:197)
>        at java.security.AccessController.doPrivileged(Native Method)
>        at java.net.URLClassLoader.findClass(URLClassLoader.java:190)
>        at java.lang.ClassLoader.loadClass(ClassLoader.java:307)
>        at sun.misc.Launcher$AppClassLoader.loadClass(Launcher.java:301)
>        at java.lang.ClassLoader.loadClass(ClassLoader.java:248)
>        at java.lang.Class.forName0(Native Method)
>        at java.lang.Class.forName(Class.java:247)
>        at sun.misc.Service$LazyIterator.next(Service.java:271)
>        at
> com.google.appengine.tools.development.ApiProxyLocalImpl.startServices(ApiProxyLocalImpl.java:378)
>        at
> com.google.appengine.tools.development.ApiProxyLocalImpl.access$600(ApiProxyLocalImpl.java:42)
>        at
> com.google.appengine.tools.development.ApiProxyLocalImpl$2.run(ApiProxyLocalImpl.java:363)
>        at
> com.google.appengine.tools.development.ApiProxyLocalImpl$2.run(ApiProxyLocalImpl.java:361)
>        at java.security.AccessController.doPrivileged(Native Method)
>        at
> com.google.appengine.tools.development.ApiProxyLocalImpl.getService(ApiProxyLocalImpl.java:360)
>        at
> com.google.appengine.tools.development.ApiProxyLocalImpl$AsyncApiCall.call(ApiProxyLocalImpl.java:282)
>        at
> com.google.appengine.tools.development.ApiProxyLocalImpl$AsyncApiCall.call(ApiProxyLocalImpl.java:265)
>        at
> java.util.concurrent.Executors$PrivilegedCallable$1.run(Executors.java:463)
>        at java.security.AccessController.doPrivileged(Native Method)
>        at
> java.util.concurrent.Executors$PrivilegedCallable.call(Executors.java:460)
>        at
> java.util.concurrent.FutureTask$Sync.innerRun(FutureTask.java:303)
>        at java.util.concurrent.FutureTask.run(FutureTask.java:138)
>        at
> java.util.concurrent.ThreadPoolExecutor$Worker.runTask(ThreadPoolExecutor.java:886)
>        at
> java.util.concurrent.ThreadPoolExecutor$Worker.run(ThreadPoolExecutor.java:908)
>        at java.lang.Thread.run(Thread.java:662)
> Caused by: java.lang.ClassNotFoundException:
> com.google.appengine.tools.development.RequestEndListener
>        at java.net.URLClassLoader$1.run(URLClassLoader.java:202)
>        at java.security.AccessController.doPrivileged(Native Method)
>        at java.net.URLClassLoader.findClass(URLClassLoader.java:190)
>        at java.lang.ClassLoader.loadClass(ClassLoader.java:307)
>        at sun.misc.Launcher$AppClassLoader.loadClass(Launcher.java:301)
>        at java.lang.ClassLoader.loadClass(ClassLoader.java:248)
>        ... 31 more
>
>
> delete(org.apache.nuvem.cloud.data.impl.MemcacheDocumentServiceImplTestCase)
>  Time elapsed: 0.005 sec  <<< ERROR!
> java.lang.NoClassDefFoundError:
> com/google/appengine/tools/development/RequestEndListener
>        at java.lang.ClassLoader.defineClass1(Native Method)
>        at java.lang.ClassLoader.defineClassCond(ClassLoader.java:632)
>        at java.lang.ClassLoader.defineClass(ClassLoader.java:616)
>        at
> java.security.SecureClassLoader.defineClass(SecureClassLoader.java:141)
>        at java.net.URLClassLoader.defineClass(URLClassLoader.java:283)
>        at java.net.URLClassLoader.access$000(URLClassLoader.java:58)
>        at java.net.URLClassLoader$1.run(URLClassLoader.java:197)
>        at java.security.AccessController.doPrivileged(Native Method)
>        at java.net.URLClassLoader.findClass(URLClassLoader.java:190)
>        at java.lang.ClassLoader.loadClass(ClassLoader.java:307)
>        at sun.misc.Launcher$AppClassLoader.loadClass(Launcher.java:301)
>        at java.lang.ClassLoader.loadClass(ClassLoader.java:248)
>        at java.lang.Class.forName0(Native Method)
>        at java.lang.Class.forName(Class.java:247)
>        at sun.misc.Service$LazyIterator.next(Service.java:271)
>        at
> com.google.appengine.tools.development.ApiProxyLocalImpl.startServices(ApiProxyLocalImpl.java:378)
>        at
> com.google.appengine.tools.development.ApiProxyLocalImpl.access$600(ApiProxyLocalImpl.java:42)
>        at
> com.google.appengine.tools.development.ApiProxyLocalImpl$2.run(ApiProxyLocalImpl.java:363)
>        at
> com.google.appengine.tools.development.ApiProxyLocalImpl$2.run(ApiProxyLocalImpl.java:361)
>        at java.security.AccessController.doPrivileged(Native Method)
>        at
> com.google.appengine.tools.development.ApiProxyLocalImpl.getService(ApiProxyLocalImpl.java:360)
>        at
> com.google.appengine.tools.development.ApiProxyLocalImpl$AsyncApiCall.call(ApiProxyLocalImpl.java:282)
>        at
> com.google.appengine.tools.development.ApiProxyLocalImpl$AsyncApiCall.call(ApiProxyLocalImpl.java:265)
>        at
> java.util.concurrent.Executors$PrivilegedCallable$1.run(Executors.java:463)
>        at java.security.AccessController.doPrivileged(Native Method)
>        at
> java.util.concurrent.Executors$PrivilegedCallable.call(Executors.java:460)
>        at
> java.util.concurrent.FutureTask$Sync.innerRun(FutureTask.java:303)
>        at java.util.concurrent.FutureTask.run(FutureTask.java:138)
>        at
> java.util.concurrent.ThreadPoolExecutor$Worker.runTask(ThreadPoolExecutor.java:886)
>        at
> java.util.concurrent.ThreadPoolExecutor$Worker.run(ThreadPoolExecutor.java:908)
>        at java.lang.Thread.run(Thread.java:662)
> Caused by: java.lang.ClassNotFoundException:
> com.google.appengine.tools.development.RequestEndListener
>        at java.net.URLClassLoader$1.run(URLClassLoader.java:202)
>        at java.security.AccessController.doPrivileged(Native Method)
>        at java.net.URLClassLoader.findClass(URLClassLoader.java:190)
>        at java.lang.ClassLoader.loadClass(ClassLoader.java:307)
>        at sun.misc.Launcher$AppClassLoader.loadClass(Launcher.java:301)
>        at java.lang.ClassLoader.loadClass(ClassLoader.java:248)
>        ... 31 more
>
> Running org.apache.nuvem.cloud.user.impl.GoogleUserServiceTestCase
> Tests run: 2, Failures: 0, Errors: 0, Skipped: 0, Time elapsed: 0.01 sec
> Running org.apache.nuvem.cloud.xmpp.impl.GooglePresenceAdapterTestCase
> Tests run: 1, Failures: 0, Errors: 0, Skipped: 0, Time elapsed: 0.014 sec
> Running org.apache.nuvem.cloud.data.impl.DatastoreDocumentServiceTestCase
> Returned Entity:<Entity [org.apache.nuvem.cloud.data.impl.Customer("1")]:
>        id = 1
>        creditCard = xxxxx
>        name = Avdhesh
> >
>
> Tests run: 2, Failures: 0, Errors: 0, Skipped: 0, Time elapsed: 0.145 sec
>
> Results :
>
> Tests in error:
>
>  initializationError(org.apache.nuvem.cloud.xmpp.impl.GooglePresenceServletTestCase)
>  get(org.apache.nuvem.cloud.data.impl.MemcacheDocumentServiceImplTestCase)
>
>  delete(org.apache.nuvem.cloud.data.impl.MemcacheDocumentServiceImplTestCase)
>
> Tests run: 15, Failures: 0, Errors: 3, Skipped: 0
>
> [INFO]
> ------------------------------------------------------------------------
> [ERROR] BUILD FAILURE
> [INFO]
> ------------------------------------------------------------------------
> [INFO] There are test failures.
>

Mime
  • Unnamed multipart/alternative (inline, None, 0 bytes)
View raw message