incubator-s4-user mailing list archives

Site index · List index
Message view « Date » · « Thread »
Top « Date » · « Thread »
From Matthieu Morel <mmo...@apache.org>
Subject Re: S4-Piper: Running Twitter trending example
Date Thu, 11 Oct 2012 14:21:06 GMT
This indeed refers to you own home directory, the error message in the 
twitter adapter tells you which file it is expecting if not found.

Matthieu

On 10/11/12 3:22 PM, Surya Prakash Reddy wrote:
> and... where do I need to keep <twitter4j.properties> file?
> documentation says that *"**Note: You need a twitter4j.properties file
> in your home directory with the following content (debug is optional):"*
> is it my own home directory or s4 base directory or something else?
>
> On Thu, Oct 11, 2012 at 4:34 PM, Matthieu Morel <mmorel@apache.org
> <mailto:mmorel@apache.org>> wrote:
>
>     It looks like you cannot get some maven artifacts from public
>     repositories.
>
>     Can you try setting the gradle options as indicated here ?
>     https://cwiki.apache.org/__confluence/display/S4/FAQ
>     <https://cwiki.apache.org/confluence/display/S4/FAQ>
>
>     Hope this helps,
>
>     Matthieu
>
>
>     On 10/11/12 11:30 AM, Surya Prakash Reddy wrote:
>
>         Hi,
>                When I want to deploy the app = 'twitter counter' by this
>         command:
>         ./s4 deploy -appName=twitter-counter -c=cluster1
>         -b=/home/suryaprakash/__s4project/incubator-s4/test-__apps/twitter-counter/build.__gradle
>         I am getting errors like these:
>
>         14:57:41.181 [main] DEBUG org.gradle.tooling.__GradleConnector -
>         Connecting from tooling API consumer version 1.0
>         14:57:41.237 [main] INFO  org.apache.s4.tools.Deploy - [-stacktrace,
>         -info, -PappClass=, -PappsDir=/tmp/1349947661127-__0,
>         -PappName=twitter-counter]
>         14:57:41.274 [Connection worker] DEBUG
>         o.g.t.i.c.l.__DefaultToolingImplementationLo__ader - Using
>         tooling provider
>         from Gradle distribution
>         'http://services.gradle.org/__distributions/gradle-1.0-bin.__zip
>         <http://services.gradle.org/distributions/gradle-1.0-bin.zip>'
>         14:57:41.275 [Connection worker] DEBUG
>         o.g.t.i.c.l.__DefaultToolingImplementationLo__ader - Using
>         tooling provider
>         classpath:
>         [/home/suryaprakash/.gradle/__wrapper/dists/gradle-1.0-bin/__3712n820lsda7ntccvm5qn52st/__gradle-1.0/lib/jul-to-slf4j-1.__6.4.jar,
>         /home/suryaprakash/.gradle/__wrapper/dists/gradle-1.0-bin/__3712n820lsda7ntccvm5qn52st/__gradle-1.0/lib/gradle-ui-1.0.__jar,
>         /home/suryaprakash/.gradle/__wrapper/dists/gradle-1.0-bin/__3712n820lsda7ntccvm5qn52st/__gradle-1.0/lib/gradle-wrapper-__1.0.jar,
>         /home/suryaprakash/.gradle/__wrapper/dists/gradle-1.0-bin/__3712n820lsda7ntccvm5qn52st/__gradle-1.0/lib/jaxen-1.1.jar,
>         /home/suryaprakash/.gradle/__wrapper/dists/gradle-1.0-bin/__3712n820lsda7ntccvm5qn52st/__gradle-1.0/lib/guava-11.0.1.__jar,
>         /home/suryaprakash/.gradle/__wrapper/dists/gradle-1.0-bin/__3712n820lsda7ntccvm5qn52st/__gradle-1.0/lib/gradle-core-1.__0.jar,
>         /home/suryaprakash/.gradle/__wrapper/dists/gradle-1.0-bin/__3712n820lsda7ntccvm5qn52st/__gradle-1.0/lib/jna-3.2.7.jar,
>         /home/suryaprakash/.gradle/__wrapper/dists/gradle-1.0-bin/__3712n820lsda7ntccvm5qn52st/__gradle-1.0/lib/ant-launcher-1.__8.2.jar,
>         /home/suryaprakash/.gradle/__wrapper/dists/gradle-1.0-bin/__3712n820lsda7ntccvm5qn52st/__gradle-1.0/lib/gradle-open-__api-1.0.jar,
>         /home/suryaprakash/.gradle/__wrapper/dists/gradle-1.0-bin/__3712n820lsda7ntccvm5qn52st/__gradle-1.0/lib/commons-io-1.4.__jar,
>         /home/suryaprakash/.gradle/__wrapper/dists/gradle-1.0-bin/__3712n820lsda7ntccvm5qn52st/__gradle-1.0/lib/commons-__collections-3.2.1.jar,
>         /home/suryaprakash/.gradle/__wrapper/dists/gradle-1.0-bin/__3712n820lsda7ntccvm5qn52st/__gradle-1.0/lib/gradle-cli-1.0.__jar,
>         /home/suryaprakash/.gradle/__wrapper/dists/gradle-1.0-bin/__3712n820lsda7ntccvm5qn52st/__gradle-1.0/lib/ant-1.8.2.jar,
>         /home/suryaprakash/.gradle/__wrapper/dists/gradle-1.0-bin/__3712n820lsda7ntccvm5qn52st/__gradle-1.0/lib/ivy-2.2.0.jar,
>         /home/suryaprakash/.gradle/__wrapper/dists/gradle-1.0-bin/__3712n820lsda7ntccvm5qn52st/__gradle-1.0/lib/asm-all-3.3.1.__jar,
>         /home/suryaprakash/.gradle/__wrapper/dists/gradle-1.0-bin/__3712n820lsda7ntccvm5qn52st/__gradle-1.0/lib/gradle-native-__1.0.jar,
>         /home/suryaprakash/.gradle/__wrapper/dists/gradle-1.0-bin/__3712n820lsda7ntccvm5qn52st/__gradle-1.0/lib/slf4j-api-1.6.__4.jar,
>         /home/suryaprakash/.gradle/__wrapper/dists/gradle-1.0-bin/__3712n820lsda7ntccvm5qn52st/__gradle-1.0/lib/gradle-base-__services-1.0.jar,
>         /home/suryaprakash/.gradle/__wrapper/dists/gradle-1.0-bin/__3712n820lsda7ntccvm5qn52st/__gradle-1.0/lib/jcip-__annotations-1.0.jar,
>         /home/suryaprakash/.gradle/__wrapper/dists/gradle-1.0-bin/__3712n820lsda7ntccvm5qn52st/__gradle-1.0/lib/jsch-0.1.46.__jar,
>         /home/suryaprakash/.gradle/__wrapper/dists/gradle-1.0-bin/__3712n820lsda7ntccvm5qn52st/__gradle-1.0/lib/groovy-all-1.8.__6.jar,
>         /home/suryaprakash/.gradle/__wrapper/dists/gradle-1.0-bin/__3712n820lsda7ntccvm5qn52st/__gradle-1.0/lib/jcl-over-slf4j-__1.6.4.jar,
>         /home/suryaprakash/.gradle/__wrapper/dists/gradle-1.0-bin/__3712n820lsda7ntccvm5qn52st/__gradle-1.0/lib/gradle-tooling-__api-1.0.jar,
>         /home/suryaprakash/.gradle/__wrapper/dists/gradle-1.0-bin/__3712n820lsda7ntccvm5qn52st/__gradle-1.0/lib/dom4j-1.6.1.__jar,
>         /home/suryaprakash/.gradle/__wrapper/dists/gradle-1.0-bin/__3712n820lsda7ntccvm5qn52st/__gradle-1.0/lib/commons-lang-2.__6.jar,
>         /home/suryaprakash/.gradle/__wrapper/dists/gradle-1.0-bin/__3712n820lsda7ntccvm5qn52st/__gradle-1.0/lib/gradle-__launcher-1.0.jar,
>         /home/suryaprakash/.gradle/__wrapper/dists/gradle-1.0-bin/__3712n820lsda7ntccvm5qn52st/__gradle-1.0/lib/log4j-over-__slf4j-1.6.4.jar,
>         /home/suryaprakash/.gradle/__wrapper/dists/gradle-1.0-bin/__3712n820lsda7ntccvm5qn52st/__gradle-1.0/lib/jansi-1.2.1.__jar,
>         /home/suryaprakash/.gradle/__wrapper/dists/gradle-1.0-bin/__3712n820lsda7ntccvm5qn52st/__gradle-1.0/lib/logback-__classic-1.0.0.jar,
>         /home/suryaprakash/.gradle/__wrapper/dists/gradle-1.0-bin/__3712n820lsda7ntccvm5qn52st/__gradle-1.0/lib/logback-core-1.__0.0.jar,
>         /home/suryaprakash/.gradle/__wrapper/dists/gradle-1.0-bin/__3712n820lsda7ntccvm5qn52st/__gradle-1.0/lib/jna-posix-1.0.__3.jar]
>         14:57:41.393 [Connection worker] DEBUG
>         o.g.t.i.provider.__DefaultConnection - Provider implementation
>         created.
>         14:57:41.472 [Connection worker] DEBUG
>         o.g.t.i.provider.__DefaultConnection - Embedded executer support
>         created.
>         14:57:41.474 [Connection worker] DEBUG
>         o.g.t.i.provider.__DefaultConnection - Configuring logging to
>         level: INFO
>         Tooling API uses target gradle version: 1.0.
>         Connected to the daemon. Dispatching Build{id=1349947661794-1,
>         currentDir=/home/suryaprakash/__s4project/incubator-s4} request.
>         The client will now receive all logging from the daemon (pid:
>         5047). The
>         daemon log file:
>         /home/suryaprakash/.gradle/__daemon/1.0/daemon-5047.out.log
>         Executing build with daemon context:
>         DefaultDaemonContext[uid=__d59f3747-4def-424e-b078-__148c918971ce,javaHome=/usr/__lib/jvm/java-6-sun-1.6.0.26,__daemonRegistryDir=/home/__suryaprakash/.gradle/daemon,__pid=5047,idleTimeout=10800000,__daemonOpts=-XX:MaxPermSize=__256m,-XX:+__HeapDumpOnOutOfMemoryError,-__Xmx1024m,-Dfile.encoding=UTF-__8]
>         Starting Build
>         Closing daemons standard input as requested by received command:
>         CloseInput[id=1349947661914-2] ...
>         The daemon will no longer process any standard input.
>         Settings evaluated using empty settings script.
>         Projects loaded. Root project using build file
>         '/home/suryaprakash/s4project/__incubator-s4/test-apps/__twitter-counter/build.gradle'.
>         Included projects: [root project 'twitter-counter']
>         Evaluating root project 'twitter-counter' using build file
>         '/home/suryaprakash/s4project/__incubator-s4/test-apps/__twitter-counter/build.gradle'.
>         Found app class name:
>         org.apache.s4.example.twitter.__TwitterCounterApp
>         All projects evaluated.
>         Selected primary task 'installS4R'
>         Tasks to be executed: [task ':compileJava', task
>         ':processResources',
>         task ':classes', task ':jar', task ':buildProjectJar', task
>         ':cleanBuildProjectJar', task ':cleanCopyDependenciesToLib', task
>         ':copyDependenciesToLib', task ':s4r', task ':installS4R']
>         :compileJava
>         :: loading settings :: url =
>         jar:file:/home/suryaprakash/.__gradle/wrapper/dists/gradle-1.__0-bin/__3712n820lsda7ntccvm5qn52st/__gradle-1.0/lib/ivy-2.2.0.jar!/__org/apache/ivy/core/settings/__ivysettings.xml
>
>         BUILD FAILED
>
>         Total time: 15.27 secs
>         14:57:56.779 [main] ERROR org.apache.s4.tools.Deploy - Cannot
>         deploy app
>         org.gradle.tooling.__BuildException: Could not execute build
>         using Gradle
>         distribution
>         'http://services.gradle.org/__distributions/gradle-1.0-bin.__zip
>         <http://services.gradle.org/distributions/gradle-1.0-bin.zip>'.
>         at
>         org.gradle.tooling.internal.__consumer.ResultHandlerAdapter.__onFailure(__ResultHandlerAdapter.java:53)
>         ~[gradle-tooling-api-1.0.jar:__1.0]
>         at
>         org.gradle.tooling.internal.__consumer.async.__DefaultAsyncConnection$3.run(__DefaultAsyncConnection.java:__81)
>         ~[gradle-tooling-api-1.0.jar:__1.0]
>         at
>         org.gradle.messaging.__concurrent.__DefaultExecutorFactory$__StoppableExecutorImpl$1.run(__DefaultExecutorFactory.java:__66)
>         ~[gradle-core-1.0.jar:1.0]
>         at
>         java.util.concurrent.__ThreadPoolExecutor$Worker.__runTask(ThreadPoolExecutor.__java:886)
>         ~[na:1.6.0_26]
>         at
>         java.util.concurrent.__ThreadPoolExecutor$Worker.run(__ThreadPoolExecutor.java:908)
>         ~[na:1.6.0_26]
>         at java.lang.Thread.run(Thread.__java:662) ~[na:1.6.0_26]
>         Caused by: org.gradle.api.internal.__LocationAwareException:
>         Could not
>         resolve all dependencies for configuration ':compile'.
>         at
>         org.gradle.initialization.__DefaultExceptionAnalyser.__transform(__DefaultExceptionAnalyser.java:__85)
>         ~[gradle-core-1.0.jar:1.0]
>         at
>         org.gradle.initialization.__DefaultGradleLauncher.doBuild(__DefaultGradleLauncher.java:__112)
>         ~[gradle-core-1.0.jar:1.0]
>         at
>         org.gradle.initialization.__DefaultGradleLauncher.run(__DefaultGradleLauncher.java:78)
>         ~[gradle-core-1.0.jar:1.0]
>         at
>         org.gradle.tooling.internal.__provider.ExecuteBuildAction.__run(ExecuteBuildAction.java:__31)
>         ~[na:na]
>         at
>         org.gradle.tooling.internal.__provider.__ConfiguringBuildAction.run(__ConfiguringBuildAction.java:__94)
>         ~[na:na]
>         at
>         org.gradle.launcher.daemon.__protocol.Build.run(Build.java:__68)
>         ~[na:na]
>         at
>         org.gradle.launcher.daemon.__protocol.Build.run(Build.java:__64)
>         ~[na:na]
>         at
>         org.gradle.launcher.daemon.__server.exec.ExecuteBuild.__doBuild(ExecuteBuild.java:45)
>         ~[na:na]
>         at
>         org.gradle.launcher.daemon.__server.exec.BuildCommandOnly.__execute(BuildCommandOnly.java:__34)
>         ~[na:na]
>         at
>         org.gradle.launcher.daemon.__server.exec.__DaemonCommandExecution.__proceed(__DaemonCommandExecution.java:__122)
>         ~[na:na]
>         at
>         org.gradle.launcher.daemon.__server.exec.__WatchForDisconnection.execute(__WatchForDisconnection.java:45)
>         ~[na:na]
>         at
>         org.gradle.launcher.daemon.__server.exec.__DaemonCommandExecution.__proceed(__DaemonCommandExecution.java:__122)
>         ~[na:na]
>         at
>         org.gradle.launcher.daemon.__server.exec.__ResetDeprecationLogger.__execute(__ResetDeprecationLogger.java:__24)
>         ~[na:na]
>         at
>         org.gradle.launcher.daemon.__server.exec.__DaemonCommandExecution.__proceed(__DaemonCommandExecution.java:__122)
>         ~[na:na]
>         at
>         org.gradle.launcher.daemon.__server.exec.__StartStopIfBuildAndStop.__execute(__StartStopIfBuildAndStop.java:__28)
>         ~[na:na]
>         at
>         org.gradle.launcher.daemon.__server.exec.__DaemonCommandExecution.__proceed(__DaemonCommandExecution.java:__122)
>         ~[na:na]
>         at
>         org.gradle.launcher.daemon.__server.exec.ReturnResult.__execute(ReturnResult.java:34)
>         ~[na:na]
>         at
>         org.gradle.launcher.daemon.__server.exec.__DaemonCommandExecution.__proceed(__DaemonCommandExecution.java:__122)
>         ~[na:na]
>         at
>         org.gradle.launcher.daemon.__server.exec.__ForwardClientInput$4.call(__ForwardClientInput.java:116)
>         ~[na:na]
>         at
>         org.gradle.launcher.daemon.__server.exec.__ForwardClientInput$4.call(__ForwardClientInput.java:114)
>         ~[na:na]
>         at org.gradle.util.Swapper.swap(__Swapper.java:38)
>         ~[gradle-core-1.0.jar:1.0]
>         at
>         org.gradle.launcher.daemon.__server.exec.__ForwardClientInput.execute(__ForwardClientInput.java:114)
>         ~[na:na]
>         at
>         org.gradle.launcher.daemon.__server.exec.__DaemonCommandExecution.__proceed(__DaemonCommandExecution.java:__122)
>         ~[na:na]
>         at
>         org.gradle.launcher.daemon.__server.exec.LogToClient.__doBuild(LogToClient.java:60)
>         ~[na:na]
>         at
>         org.gradle.launcher.daemon.__server.exec.BuildCommandOnly.__execute(BuildCommandOnly.java:__34)
>         ~[na:na]
>         at
>         org.gradle.launcher.daemon.__server.exec.__DaemonCommandExecution.__proceed(__DaemonCommandExecution.java:__122)
>         ~[na:na]
>         at
>         org.gradle.launcher.daemon.__server.exec.__EstablishBuildEnvironment.__doBuild(__EstablishBuildEnvironment.__java:61)
>         ~[na:na]
>         at
>         org.gradle.launcher.daemon.__server.exec.BuildCommandOnly.__execute(BuildCommandOnly.java:__34)
>         ~[na:na]
>         at
>         org.gradle.launcher.daemon.__server.exec.__DaemonCommandExecution.__proceed(__DaemonCommandExecution.java:__122)
>         ~[na:na]
>         at
>         org.gradle.launcher.daemon.__server.exec.__StartBuildOrRespondWithBusy.__doBuild(__StartBuildOrRespondWithBusy.__java:49)
>         ~[na:na]
>         at
>         org.gradle.launcher.daemon.__server.exec.BuildCommandOnly.__execute(BuildCommandOnly.java:__34)
>         ~[na:na]
>         at
>         org.gradle.launcher.daemon.__server.exec.__DaemonCommandExecution.__proceed(__DaemonCommandExecution.java:__122)
>         ~[na:na]
>         at
>         org.gradle.launcher.daemon.__server.exec.HandleStop.__execute(HandleStop.java:34)
>         ~[na:na]
>         at
>         org.gradle.launcher.daemon.__server.exec.__DaemonCommandExecution.__proceed(__DaemonCommandExecution.java:__122)
>         ~[na:na]
>         at
>         org.gradle.launcher.daemon.__server.exec.__CatchAndForwardDaemonFailure.__execute(__CatchAndForwardDaemonFailure.__java:32)
>         ~[na:na]
>         at
>         org.gradle.launcher.daemon.__server.exec.__DaemonCommandExecution.__proceed(__DaemonCommandExecution.java:__122)
>         ~[na:na]
>         at
>         org.gradle.launcher.daemon.__server.exec.__HandleClientDisconnectBeforeSe__ndingCommand.execute(__HandleClientDisconnectBeforeSe__ndingCommand.java:21)
>         ~[na:na]
>         at
>         org.gradle.launcher.daemon.__server.exec.__DaemonCommandExecution.__proceed(__DaemonCommandExecution.java:__122)
>         ~[na:na]
>         at
>         org.gradle.launcher.daemon.__server.exec.__StopConnectionAfterExecution.__execute(__StopConnectionAfterExecution.__java:27)
>         ~[na:na]
>         at
>         org.gradle.launcher.daemon.__server.exec.__DaemonCommandExecution.__proceed(__DaemonCommandExecution.java:__122)
>         ~[na:na]
>         at
>         org.gradle.launcher.daemon.__server.exec.__DefaultDaemonCommandExecuter.__executeCommand(__DefaultDaemonCommandExecuter.__java:55)
>         ~[na:na]
>         at
>         org.gradle.launcher.daemon.__server.Daemon$1$1.run(Daemon.__java:123)
>         ~[na:na]
>         ... 4 common frames omitted
>         org.gradle.messaging.remote.__internal.PlaceholderException:
>         Could not
>         resolve all dependencies for configuration ':compile'.
>         at
>         org.gradle.api.internal.__artifacts.ivyservice.__DefaultLenientConfiguration.__rethrowFailure(__DefaultLenientConfiguration.__java:51)
>         ~[na:na]
>         at
>         org.gradle.api.internal.__artifacts.ivyservice.__DefaultResolvedConfiguration.__rethrowFailure(__DefaultResolvedConfiguration.__java:36)
>         ~[na:na]
>         at
>         org.gradle.api.internal.__artifacts.ivyservice.__SelfResolvingDependencyResolve__r$1.rethrowFailure(__SelfResolvingDependencyResolve__r.java:81)
>         ~[na:na]
>         at
>         org.gradle.api.internal.__artifacts.ivyservice.__ErrorHandlingArtifactDependenc__yResolver$__ErrorHandlingResolvedConfigura__tion.rethrowFailure(__ErrorHandlingArtifactDependenc__yResolver.java:70)
>         ~[na:na]
>         at
>         org.gradle.api.internal.__artifacts.configurations.__DefaultConfiguration$__ConfigurationFileCollection.__getFiles(DefaultConfiguration.__java:458)
>         ~[gradle-core-1.0.jar:1.0]
>         at
>         org.gradle.api.internal.__artifacts.configurations.__DefaultConfiguration.getFiles(__DefaultConfiguration.java:203)
>         ~[gradle-core-1.0.jar:1.0]
>         at
>         org.gradle.api.internal.__artifacts.configurations.__DefaultConfiguration___Decorated.getFiles(Unknown
>         Source) ~[na:na]
>         at
>         org.gradle.api.internal.file.__collections.__DefaultFileCollectionResolveCo__ntext$FileTreeConverter.__convertInto(__DefaultFileCollectionResolveCo__ntext.java:191)
>         ~[gradle-core-1.0.jar:1.0]
>         at
>         org.gradle.api.internal.file.__collections.__DefaultFileCollectionResolveCo__ntext.doResolve(__DefaultFileCollectionResolveCo__ntext.java:103)
>         ~[gradle-core-1.0.jar:1.0]
>         at
>         org.gradle.api.internal.file.__collections.__DefaultFileCollectionResolveCo__ntext.resolveAsFileTrees(__DefaultFileCollectionResolveCo__ntext.java:75)
>         ~[gradle-core-1.0.jar:1.0]
>         at
>         org.gradle.api.internal.file.__collections.__DefaultFileCollectionResolveCo__ntext$FileTreeConverter.__convertInto(__DefaultFileCollectionResolveCo__ntext.java:182)
>         ~[gradle-core-1.0.jar:1.0]
>         at
>         org.gradle.api.internal.file.__collections.__DefaultFileCollectionResolveCo__ntext.doResolve(__DefaultFileCollectionResolveCo__ntext.java:98)
>         ~[gradle-core-1.0.jar:1.0]
>         at
>         org.gradle.api.internal.file.__collections.__DefaultFileCollectionResolveCo__ntext.resolveAsFileTrees(__DefaultFileCollectionResolveCo__ntext.java:75)
>         ~[gradle-core-1.0.jar:1.0]
>         at
>         org.gradle.api.internal.file.__CompositeFileCollection$1.__resolve(__CompositeFileCollection.java:__88)
>         ~[gradle-core-1.0.jar:1.0]
>         at
>         org.gradle.api.internal.file.__CompositeFileCollection.__getSourceCollections(__CompositeFileCollection.java:__143)
>         ~[gradle-core-1.0.jar:1.0]
>         at
>         org.gradle.api.internal.file.__CompositeFileTree.__getSourceCollections(__CompositeFileTree.java:30)
>         ~[gradle-core-1.0.jar:1.0]
>         at
>         org.gradle.api.internal.file.__CompositeFileCollection.__getFiles(__CompositeFileCollection.java:__38)
>         ~[gradle-core-1.0.jar:1.0]
>         at
>         org.gradle.api.internal.file.__AbstractFileCollection.__iterator(__AbstractFileCollection.java:__60)
>         ~[gradle-core-1.0.jar:1.0]
>         at
>         org.gradle.api.internal.__changedetection.__DefaultFileSnapshotter.__snapshot(__DefaultFileSnapshotter.java:__42)
>         ~[gradle-core-1.0.jar:1.0]
>         at
>         org.gradle.api.internal.__changedetection.__InputFilesChangedUpToDateRule.__create(__InputFilesChangedUpToDateRule.__java:35)
>         ~[gradle-core-1.0.jar:1.0]
>         at
>         org.gradle.api.internal.__changedetection.__CompositeUpToDateRule.create(__CompositeUpToDateRule.java:35)
>         ~[gradle-core-1.0.jar:1.0]
>         at
>         org.gradle.api.internal.__changedetection.__DefaultTaskArtifactStateReposi__tory$HistoricExecution.__calcCurrentState(__DefaultTaskArtifactStateReposi__tory.java:80)
>         ~[gradle-core-1.0.jar:1.0]
>         at
>         org.gradle.api.internal.__changedetection.__DefaultTaskArtifactStateReposi__tory$HistoricExecution.__isUpToDate(__DefaultTaskArtifactStateReposi__tory.java:88)
>         ~[gradle-core-1.0.jar:1.0]
>         at
>         org.gradle.api.internal.__changedetection.__DefaultTaskArtifactStateReposi__tory$TaskArtifactStateImpl.__isUpToDate(__DefaultTaskArtifactStateReposi__tory.java:128)
>         ~[gradle-core-1.0.jar:1.0]
>         at
>         org.gradle.api.internal.__changedetection.__ShortCircuitTaskArtifactStateR__epository$__ShortCircuitArtifactState.__isUpToDate(__ShortCircuitTaskArtifactStateR__epository.java:77)
>         ~[gradle-core-1.0.jar:1.0]
>         at
>         org.gradle.api.internal.__changedetection.__FileCacheBroadcastTaskArtifact__StateRepository$1.isUpToDate(__FileCacheBroadcastTaskArtifact__StateRepository.java:37)
>         ~[gradle-core-1.0.jar:1.0]
>         at
>         org.gradle.api.internal.tasks.__execution.__SkipUpToDateTaskExecuter.__execute(__SkipUpToDateTaskExecuter.java:__44)
>         ~[gradle-core-1.0.jar:1.0]
>         at
>         org.gradle.api.internal.tasks.__execution.__ValidatingTaskExecuter.__execute(__ValidatingTaskExecuter.java:__57)
>         ~[gradle-core-1.0.jar:1.0]
>         at
>         org.gradle.api.internal.tasks.__execution.__SkipEmptySourceFilesTaskExecut__er.execute(__SkipEmptySourceFilesTaskExecut__er.java:41)
>         ~[gradle-core-1.0.jar:1.0]
>         at
>         org.gradle.api.internal.tasks.__execution.__SkipTaskWithNoActionsExecuter.__execute(__SkipTaskWithNoActionsExecuter.__java:51)
>         ~[gradle-core-1.0.jar:1.0]
>         at
>         org.gradle.api.internal.tasks.__execution.__SkipOnlyIfTaskExecuter.__execute(__SkipOnlyIfTaskExecuter.java:__52)
>         ~[gradle-core-1.0.jar:1.0]
>         at
>         org.gradle.api.internal.tasks.__execution.__ExecuteAtMostOnceTaskExecuter.__execute(__ExecuteAtMostOnceTaskExecuter.__java:42)
>         ~[gradle-core-1.0.jar:1.0]
>         at
>         org.gradle.api.internal.__AbstractTask.__executeWithoutThrowingTaskFail__ure(AbstractTask.java:247)
>         ~[gradle-core-1.0.jar:1.0]
>         at
>         org.gradle.execution.__DefaultTaskGraphExecuter.__executeTask(__DefaultTaskGraphExecuter.java:__192)
>         ~[gradle-core-1.0.jar:1.0]
>         at
>         org.gradle.execution.__DefaultTaskGraphExecuter.__doExecute(__DefaultTaskGraphExecuter.java:__177)
>         ~[gradle-core-1.0.jar:1.0]
>         at
>         org.gradle.execution.__DefaultTaskGraphExecuter.__execute(__DefaultTaskGraphExecuter.java:__83)
>         ~[gradle-core-1.0.jar:1.0]
>         at
>         org.gradle.execution.__SelectedTaskExecutionAction.__execute(__SelectedTaskExecutionAction.__java:36)
>         ~[gradle-core-1.0.jar:1.0]
>         at
>         org.gradle.execution.__DefaultBuildExecuter.execute(__DefaultBuildExecuter.java:61)
>         ~[gradle-core-1.0.jar:1.0]
>         at
>         org.gradle.execution.__DefaultBuildExecuter.access$__200(DefaultBuildExecuter.java:__23)
>         ~[gradle-core-1.0.jar:1.0]
>         at
>         org.gradle.execution.__DefaultBuildExecuter$2.__proceed(DefaultBuildExecuter.__java:67)
>         ~[gradle-core-1.0.jar:1.0]
>         at
>         org.gradle.api.internal.__changedetection.__TaskCacheLockHandlingBuildExec__uter$1.run(__TaskCacheLockHandlingBuildExec__uter.java:31)
>         ~[gradle-core-1.0.jar:1.0]
>         at
>         org.gradle.cache.internal.__DefaultCacheAccess$1.create(__DefaultCacheAccess.java:111)
>         ~[gradle-core-1.0.jar:1.0]
>         at
>         org.gradle.cache.internal.__DefaultCacheAccess.useCache(__DefaultCacheAccess.java:126)
>         ~[gradle-core-1.0.jar:1.0]
>         at
>         org.gradle.cache.internal.__DefaultCacheAccess.useCache(__DefaultCacheAccess.java:109)
>         ~[gradle-core-1.0.jar:1.0]
>         at
>         org.gradle.cache.internal.__DefaultPersistentDirectoryStor__e.useCache(__DefaultPersistentDirectoryStor__e.java:103)
>         ~[gradle-core-1.0.jar:1.0]
>         at
>         org.gradle.api.internal.__changedetection.__DefaultTaskArtifactStateCacheA__ccess.useCache(__DefaultTaskArtifactStateCacheA__ccess.java:79)
>         ~[gradle-core-1.0.jar:1.0]
>         at
>         org.gradle.api.internal.__changedetection.__TaskCacheLockHandlingBuildExec__uter.execute(__TaskCacheLockHandlingBuildExec__uter.java:29)
>         ~[gradle-core-1.0.jar:1.0]
>         at
>         org.gradle.execution.__DefaultBuildExecuter.execute(__DefaultBuildExecuter.java:61)
>         ~[gradle-core-1.0.jar:1.0]
>         at
>         org.gradle.execution.__DefaultBuildExecuter.access$__200(DefaultBuildExecuter.java:__23)
>         ~[gradle-core-1.0.jar:1.0]
>         at
>         org.gradle.execution.__DefaultBuildExecuter$2.__proceed(DefaultBuildExecuter.__java:67)
>         ~[gradle-core-1.0.jar:1.0]
>         at
>         org.gradle.execution.__DryRunBuildExecutionAction.__execute(__DryRunBuildExecutionAction.__java:32)
>         ~[gradle-core-1.0.jar:1.0]
>         at
>         org.gradle.execution.__DefaultBuildExecuter.execute(__DefaultBuildExecuter.java:61)
>         ~[gradle-core-1.0.jar:1.0]
>         at
>         org.gradle.execution.__DefaultBuildExecuter.execute(__DefaultBuildExecuter.java:54)
>         ~[gradle-core-1.0.jar:1.0]
>         at
>         org.gradle.initialization.__DefaultGradleLauncher.__doBuildStages(__DefaultGradleLauncher.java:__155)
>         ~[gradle-core-1.0.jar:1.0]
>         at
>         org.gradle.initialization.__DefaultGradleLauncher.doBuild(__DefaultGradleLauncher.java:__110)
>         ~[gradle-core-1.0.jar:1.0]
>         at
>         org.gradle.initialization.__DefaultGradleLauncher.run(__DefaultGradleLauncher.java:78)
>         ~[gradle-core-1.0.jar:1.0]
>         at
>         org.gradle.tooling.internal.__provider.ExecuteBuildAction.__run(ExecuteBuildAction.java:__31)
>         ~[na:na]
>         at
>         org.gradle.tooling.internal.__provider.__ConfiguringBuildAction.run(__ConfiguringBuildAction.java:__94)
>         ~[na:na]
>         at
>         org.gradle.launcher.daemon.__protocol.Build.run(Build.java:__68)
>         ~[na:na]
>         at
>         org.gradle.launcher.daemon.__protocol.Build.run(Build.java:__64)
>         ~[na:na]
>         at
>         org.gradle.launcher.daemon.__server.exec.ExecuteBuild.__doBuild(ExecuteBuild.java:45)
>         ~[na:na]
>         at
>         org.gradle.launcher.daemon.__server.exec.BuildCommandOnly.__execute(BuildCommandOnly.java:__34)
>         ~[na:na]
>         at
>         org.gradle.launcher.daemon.__server.exec.__DaemonCommandExecution.__proceed(__DaemonCommandExecution.java:__122)
>         ~[na:na]
>         at
>         org.gradle.launcher.daemon.__server.exec.__WatchForDisconnection.execute(__WatchForDisconnection.java:45)
>         ~[na:na]
>         at
>         org.gradle.launcher.daemon.__server.exec.__DaemonCommandExecution.__proceed(__DaemonCommandExecution.java:__122)
>         ~[na:na]
>         at
>         org.gradle.launcher.daemon.__server.exec.__ResetDeprecationLogger.__execute(__ResetDeprecationLogger.java:__24)
>         ~[na:na]
>         at
>         org.gradle.launcher.daemon.__server.exec.__DaemonCommandExecution.__proceed(__DaemonCommandExecution.java:__122)
>         ~[na:na]
>         at
>         org.gradle.launcher.daemon.__server.exec.__StartStopIfBuildAndStop.__execute(__StartStopIfBuildAndStop.java:__28)
>         ~[na:na]
>         at
>         org.gradle.launcher.daemon.__server.exec.__DaemonCommandExecution.__proceed(__DaemonCommandExecution.java:__122)
>         ~[na:na]
>         at
>         org.gradle.launcher.daemon.__server.exec.ReturnResult.__execute(ReturnResult.java:34)
>         ~[na:na]
>         at
>         org.gradle.launcher.daemon.__server.exec.__DaemonCommandExecution.__proceed(__DaemonCommandExecution.java:__122)
>         ~[na:na]
>         at
>         org.gradle.launcher.daemon.__server.exec.__ForwardClientInput$4.call(__ForwardClientInput.java:116)
>         ~[na:na]
>         at
>         org.gradle.launcher.daemon.__server.exec.__ForwardClientInput$4.call(__ForwardClientInput.java:114)
>         ~[na:na]
>         at org.gradle.util.Swapper.swap(__Swapper.java:38)
>         ~[gradle-core-1.0.jar:1.0]
>         at
>         org.gradle.launcher.daemon.__server.exec.__ForwardClientInput.execute(__ForwardClientInput.java:114)
>         ~[na:na]
>         at
>         org.gradle.launcher.daemon.__server.exec.__DaemonCommandExecution.__proceed(__DaemonCommandExecution.java:__122)
>         ~[na:na]
>         at
>         org.gradle.launcher.daemon.__server.exec.LogToClient.__doBuild(LogToClient.java:60)
>         ~[na:na]
>         at
>         org.gradle.launcher.daemon.__server.exec.BuildCommandOnly.__execute(BuildCommandOnly.java:__34)
>         ~[na:na]
>         at
>         org.gradle.launcher.daemon.__server.exec.__DaemonCommandExecution.__proceed(__DaemonCommandExecution.java:__122)
>         ~[na:na]
>         at
>         org.gradle.launcher.daemon.__server.exec.__EstablishBuildEnvironment.__doBuild(__EstablishBuildEnvironment.__java:61)
>         ~[na:na]
>         at
>         org.gradle.launcher.daemon.__server.exec.BuildCommandOnly.__execute(BuildCommandOnly.java:__34)
>         ~[na:na]
>         at
>         org.gradle.launcher.daemon.__server.exec.__DaemonCommandExecution.__proceed(__DaemonCommandExecution.java:__122)
>         ~[na:na]
>         at
>         org.gradle.launcher.daemon.__server.exec.__StartBuildOrRespondWithBusy.__doBuild(__StartBuildOrRespondWithBusy.__java:49)
>         ~[na:na]
>         at
>         org.gradle.launcher.daemon.__server.exec.BuildCommandOnly.__execute(BuildCommandOnly.java:__34)
>         ~[na:na]
>         at
>         org.gradle.launcher.daemon.__server.exec.__DaemonCommandExecution.__proceed(__DaemonCommandExecution.java:__122)
>         ~[na:na]
>         at
>         org.gradle.launcher.daemon.__server.exec.HandleStop.__execute(HandleStop.java:34)
>         ~[na:na]
>         at
>         org.gradle.launcher.daemon.__server.exec.__DaemonCommandExecution.__proceed(__DaemonCommandExecution.java:__122)
>         ~[na:na]
>         at
>         org.gradle.launcher.daemon.__server.exec.__CatchAndForwardDaemonFailure.__execute(__CatchAndForwardDaemonFailure.__java:32)
>         ~[na:na]
>         at
>         org.gradle.launcher.daemon.__server.exec.__DaemonCommandExecution.__proceed(__DaemonCommandExecution.java:__122)
>         ~[na:na]
>         at
>         org.gradle.launcher.daemon.__server.exec.__HandleClientDisconnectBeforeSe__ndingCommand.execute(__HandleClientDisconnectBeforeSe__ndingCommand.java:21)
>         ~[na:na]
>         at
>         org.gradle.launcher.daemon.__server.exec.__DaemonCommandExecution.__proceed(__DaemonCommandExecution.java:__122)
>         ~[na:na]
>         at
>         org.gradle.launcher.daemon.__server.exec.__StopConnectionAfterExecution.__execute(__StopConnectionAfterExecution.__java:27)
>         ~[na:na]
>         at
>         org.gradle.launcher.daemon.__server.exec.__DaemonCommandExecution.__proceed(__DaemonCommandExecution.java:__122)
>         ~[na:na]
>         at
>         org.gradle.launcher.daemon.__server.exec.__DefaultDaemonCommandExecuter.__executeCommand(__DefaultDaemonCommandExecuter.__java:55)
>         ~[na:na]
>         at
>         org.gradle.launcher.daemon.__server.Daemon$1$1.run(Daemon.__java:123)
>         ~[na:na]
>         at
>         org.gradle.messaging.__concurrent.__DefaultExecutorFactory$__StoppableExecutorImpl$1.run(__DefaultExecutorFactory.java:__66)
>         ~[gradle-core-1.0.jar:1.0]
>         Caused by:
>         org.gradle.messaging.remote.__internal.PlaceholderException:
>         Could not resolve group:org.apache.zookeeper, module:zookeeper,
>         version:3.3.3.
>         Required by:
>               org.apache.s4:twitter-counter:__unspecified >
>         org.apache.s4:s4-base:0.5.0-__incubating
>               org.apache.s4:twitter-counter:__unspecified >
>         org.apache.s4:s4-comm:0.5.0-__incubating
>               org.apache.s4:twitter-counter:__unspecified >
>         org.apache.s4:s4-core:0.5.0-__incubating
>               org.apache.s4:twitter-counter:__unspecified >
>         org.apache.s4:s4-comm:0.5.0-__incubating >
>         com.github.sgroschupf:__zkclient:0.1
>         at
>         org.gradle.api.internal.__artifacts.ivyservice.__ivyresolve.UserResolverChain.__resolve(UserResolverChain.__java:61)
>         ~[na:na]
>         at
>         org.gradle.api.internal.__artifacts.ivyservice.__clientmodule.__ClientModuleResolver.resolve(__ClientModuleResolver.java:39)
>         ~[na:na]
>         at
>         org.gradle.api.internal.__artifacts.ivyservice.__projectmodule.__ProjectDependencyResolver.__resolve(__ProjectDependencyResolver.__java:42)
>         ~[na:na]
>         at
>         org.gradle.api.internal.__artifacts.ivyservice.__ivyresolve.__LazyDependencyToModuleResolver__$StaticVersionResolveResult.__resolve(__LazyDependencyToModuleResolver__.java:113)
>         ~[na:na]
>         at
>         org.gradle.api.internal.__artifacts.ivyservice.__resolveengine.__DependencyGraphBuilder$__ModuleVersionSelectorResolveSt__ate.resolve(__DependencyGraphBuilder.java:__869)
>         ~[na:na]
>         at
>         org.gradle.api.internal.__artifacts.ivyservice.__resolveengine.__DependencyGraphBuilder$__DefaultModuleRevisionResolveSt__ate.getDescriptor(__DependencyGraphBuilder.java:__597)
>         ~[na:na]
>         at
>         org.gradle.api.internal.__artifacts.ivyservice.__resolveengine.__DependencyGraphBuilder$__DependencyEdge.__calculateTargetConfigurations(__DependencyGraphBuilder.java:__307)
>         ~[na:na]
>         at
>         org.gradle.api.internal.__artifacts.ivyservice.__resolveengine.__DependencyGraphBuilder$__DependencyEdge.__attachToTargetConfigurations(__DependencyGraphBuilder.java:__283)
>         ~[na:na]
>         at
>         org.gradle.api.internal.__artifacts.ivyservice.__resolveengine.__DependencyGraphBuilder$__DependencyEdge.restart(__DependencyGraphBuilder.java:__302)
>         ~[na:na]
>         at
>         org.gradle.api.internal.__artifacts.ivyservice.__resolveengine.__DependencyGraphBuilder$__ConfigurationNode.restart(__DependencyGraphBuilder.java:__809)
>         ~[na:na]
>         at
>         org.gradle.api.internal.__artifacts.ivyservice.__resolveengine.__DependencyGraphBuilder$__DefaultModuleRevisionResolveSt__ate.restart(__DependencyGraphBuilder.java:__582)
>         ~[na:na]
>         at
>         org.gradle.api.internal.__artifacts.ivyservice.__resolveengine.__DependencyGraphBuilder$__ModuleResolveState.restart(__DependencyGraphBuilder.java:__517)
>         ~[na:na]
>         at
>         org.gradle.api.internal.__artifacts.ivyservice.__resolveengine.__DependencyGraphBuilder.__traverseGraph(__DependencyGraphBuilder.java:__129)
>         ~[na:na]
>         at
>         org.gradle.api.internal.__artifacts.ivyservice.__resolveengine.__DependencyGraphBuilder.__resolve(__DependencyGraphBuilder.java:__53)
>         ~[na:na]
>         at
>         org.gradle.api.internal.__artifacts.ivyservice.__resolveengine.__DefaultDependencyResolver.__resolve(__DefaultDependencyResolver.__java:67)
>         ~[na:na]
>         at
>         org.gradle.api.internal.__artifacts.ivyservice.__CacheLockingArtifactDependency__Resolver$1.create(__CacheLockingArtifactDependency__Resolver.java:36)
>         ~[na:na]
>         at
>         org.gradle.api.internal.__artifacts.ivyservice.__CacheLockingArtifactDependency__Resolver$1.create(__CacheLockingArtifactDependency__Resolver.java:34)
>         ~[na:na]
>         at
>         org.gradle.cache.internal.__DefaultCacheAccess.useCache(__DefaultCacheAccess.java:126)
>         ~[gradle-core-1.0.jar:1.0]
>         at
>         org.gradle.cache.internal.__DefaultPersistentDirectoryStor__e.useCache(__DefaultPersistentDirectoryStor__e.java:99)
>         ~[gradle-core-1.0.jar:1.0]
>         at
>         org.gradle.api.internal.__artifacts.ivyservice.__DefaultCacheLockingManager.__useCache(__DefaultCacheLockingManager.__java:49)
>         ~[na:na]
>         at
>         org.gradle.api.internal.__artifacts.ivyservice.__CacheLockingArtifactDependency__Resolver.resolve(__CacheLockingArtifactDependency__Resolver.java:34)
>         ~[na:na]
>         at
>         org.gradle.api.internal.__artifacts.ivyservice.__SelfResolvingDependencyResolve__r.resolve(__SelfResolvingDependencyResolve__r.java:42)
>         ~[na:na]
>         at
>         org.gradle.api.internal.__artifacts.ivyservice.__ShortcircuitEmptyConfigsArtifa__ctDependencyResolver.resolve(__ShortcircuitEmptyConfigsArtifa__ctDependencyResolver.java:78)
>         ~[na:na]
>         at
>         org.gradle.api.internal.__artifacts.ivyservice.__ErrorHandlingArtifactDependenc__yResolver.resolve(__ErrorHandlingArtifactDependenc__yResolver.java:36)
>         ~[na:na]
>         at
>         org.gradle.api.internal.__artifacts.configurations.__DefaultConfiguration.__getResolvedConfiguration(__DefaultConfiguration.java:236)
>         ~[gradle-core-1.0.jar:1.0]
>         at
>         org.gradle.api.internal.__artifacts.configurations.__DefaultConfiguration___Decorated.__getResolvedConfiguration(__Unknown
>         Source) ~[na:na]
>         at
>         org.gradle.api.internal.__artifacts.configurations.__DefaultConfiguration$__ConfigurationFileCollection.__getFiles(DefaultConfiguration.__java:456)
>         ~[gradle-core-1.0.jar:1.0]
>         ... 91 common frames omitted
>         Caused by: org.gradle.api.__UncheckedIOException: Could not GET
>         'http://repo1.maven.org/__maven2/org/apache/zookeeper/__zookeeper/3.3.3/zookeeper-3.3.__3.pom
>         <http://repo1.maven.org/maven2/org/apache/zookeeper/zookeeper/3.3.3/zookeeper-3.3.3.pom>'.
>         at
>         org.gradle.api.internal.__externalresource.transport.__http.HttpClientHelper.__performRequest(__HttpClientHelper.java:87)
>         ~[na:na]
>         at
>         org.gradle.api.internal.__externalresource.transport.__http.HttpClientHelper.__performRawGet(__HttpClientHelper.java:64)
>         ~[na:na]
>         at
>         org.gradle.api.internal.__externalresource.transport.__http.HttpClientHelper.__performGet(HttpClientHelper.__java:72)
>         ~[na:na]
>         at
>         org.gradle.api.internal.__externalresource.transport.__http.HttpClientHelper.__performGet(HttpClientHelper.__java:68)
>         ~[na:na]
>         at
>         org.gradle.api.internal.__externalresource.transport.__http.HttpResourceAccessor.__getResource(__HttpResourceAccessor.java:46)
>         ~[na:na]
>         at
>         org.gradle.api.internal.__externalresource.transfer.__DefaultCacheAwareExternalResou__rceAccessor.getResource(__DefaultCacheAwareExternalResou__rceAccessor.java:50)
>         ~[na:na]
>         at
>         org.gradle.api.internal.__artifacts.repositories.__DefaultExternalResourceReposit__ory.getResource(__DefaultExternalResourceReposit__ory.java:62)
>         ~[na:na]
>         at
>         org.gradle.api.internal.__artifacts.repositories.__ExternalResourceResolver.__getResource(__ExternalResourceResolver.java:__318)
>         ~[na:na]
>         at
>         org.gradle.api.internal.__artifacts.repositories.__ExternalResourceResolver.__findStaticResourceUsingPattern__(ExternalResourceResolver.__java:257)
>         ~[na:na]
>         at
>         org.gradle.api.internal.__artifacts.repositories.__ExternalResourceResolver.__findResourceUsingPattern(__ExternalResourceResolver.java:__243)
>         ~[na:na]
>         at
>         org.gradle.api.internal.__artifacts.repositories.__ExternalResourceResolver.__findResourceUsingPatterns(__ExternalResourceResolver.java:__145)
>         ~[na:na]
>         at
>         org.gradle.api.internal.__artifacts.repositories.__MavenResolver.findIvyFileRef(__MavenResolver.java:122)
>         ~[na:na]
>         at
>         org.apache.ivy.plugins.__resolver.BasicResolver.__getDependency(BasicResolver.__java:223)
>         ~[na:na]
>         at
>         org.gradle.api.internal.__artifacts.ivyservice.__ivyresolve.__DependencyResolverAdapter.__getDependency(__DependencyResolverAdapter.__java:102)
>         ~[na:na]
>         at
>         org.gradle.api.internal.__artifacts.ivyservice.__ivyresolve.__CacheLockingModuleVersionRepos__itory$1.create(__CacheLockingModuleVersionRepos__itory.java:51)
>         ~[na:na]
>         at
>         org.gradle.api.internal.__artifacts.ivyservice.__ivyresolve.__CacheLockingModuleVersionRepos__itory$1.create(__CacheLockingModuleVersionRepos__itory.java:49)
>         ~[na:na]
>         at
>         org.gradle.cache.internal.__DefaultCacheAccess.__longRunningOperation(__DefaultCacheAccess.java:172)
>         ~[gradle-core-1.0.jar:1.0]
>         at
>         org.gradle.cache.internal.__DefaultPersistentDirectoryStor__e.longRunningOperation(__DefaultPersistentDirectoryStor__e.java:107)
>         ~[gradle-core-1.0.jar:1.0]
>         at
>         org.gradle.api.internal.__artifacts.ivyservice.__DefaultCacheLockingManager.__longRunningOperation(__DefaultCacheLockingManager.__java:57)
>         ~[na:na]
>         at
>         org.gradle.api.internal.__artifacts.ivyservice.__ivyresolve.__CacheLockingModuleVersionRepos__itory.getDependency(__CacheLockingModuleVersionRepos__itory.java:49)
>         ~[na:na]
>         at
>         org.gradle.api.internal.__artifacts.ivyservice.__ivyresolve.__CachingModuleVersionRepository__.resolveModule(__CachingModuleVersionRepository__.java:157)
>         ~[na:na]
>         at
>         org.gradle.api.internal.__artifacts.ivyservice.__ivyresolve.__CachingModuleVersionRepository__.findModule(__CachingModuleVersionRepository__.java:94)
>         ~[na:na]
>         at
>         org.gradle.api.internal.__artifacts.ivyservice.__ivyresolve.__CachingModuleVersionRepository__.getDependency(__CachingModuleVersionRepository__.java:85)
>         ~[na:na]
>         at
>         org.gradle.api.internal.__artifacts.ivyservice.__ivyresolve.IvyContextualiser$__1.invoke(IvyContextualiser.__java:44)
>         ~[na:na]
>         at $Proxy35.getDependency(Unknown Source) ~[na:na]
>         at
>         org.gradle.api.internal.__artifacts.ivyservice.__ivyresolve.UserResolverChain.__findLatestModule(__UserResolverChain.java:73)
>         ~[na:na]
>         at
>         org.gradle.api.internal.__artifacts.ivyservice.__ivyresolve.UserResolverChain.__resolve(UserResolverChain.__java:54)
>         ~[na:na]
>         ... 117 common frames omitted
>         Caused by:
>         org.gradle.messaging.remote.__internal.PlaceholderException:
>         Connection to http://repo1.maven.org refused
>         at
>         org.apache.http.impl.conn.__DefaultClientConnectionOperato__r.openConnection(__DefaultClientConnectionOperato__r.java:158)
>         ~[na:na]
>         at
>         org.apache.http.impl.conn.__AbstractPoolEntry.open(__AbstractPoolEntry.java:149)
>         ~[na:na]
>         at
>         org.apache.http.impl.conn.__AbstractPooledConnAdapter.__open(__AbstractPooledConnAdapter.__java:121)
>         ~[na:na]
>         at
>         org.apache.http.impl.client.__DefaultRequestDirector.__tryConnect(__DefaultRequestDirector.java:__573)
>         ~[na:na]
>         at
>         org.apache.http.impl.client.__DefaultRequestDirector.__execute(__DefaultRequestDirector.java:__425)
>         ~[na:na]
>         at
>         org.apache.http.impl.client.__AbstractHttpClient.execute(__AbstractHttpClient.java:820)
>         ~[na:na]
>         at
>         org.apache.http.impl.client.__AbstractHttpClient.execute(__AbstractHttpClient.java:754)
>         ~[na:na]
>         at
>         org.gradle.api.internal.__externalresource.transport.__http.HttpClientHelper.__performHttpRequest(__HttpClientHelper.java:120)
>         ~[na:na]
>         at
>         org.gradle.api.internal.__externalresource.transport.__http.HttpClientHelper.__executeGetOrHead(__HttpClientHelper.java:94)
>         ~[na:na]
>         at
>         org.gradle.api.internal.__externalresource.transport.__http.HttpClientHelper.__performRequest(__HttpClientHelper.java:85)
>         ~[na:na]
>         ... 143 common frames omitted
>         Caused by: java.net.ConnectException: Connection refused
>         at
>         org.apache.http.conn.scheme.__PlainSocketFactory.__connectSocket(__PlainSocketFactory.java:123)
>         ~[na:na]
>         at
>         org.apache.http.impl.conn.__DefaultClientConnectionOperato__r.openConnection(__DefaultClientConnectionOperato__r.java:148)
>         ~[na:na]
>         ... 152 common frames omitted
>
>         Please help me in this issue, any help would be appreciated.
>
>
>         --
>         Regards,
>         A Surya Prakash Reddy
>         9248-195-195
>         IIIT-Hyderabad <http://www.iiit.ac.in>
>
>
>
>
>
> --
> Regards,
> A Surya Prakash Reddy
> 9248-195-195
> IIIT-Hyderabad <http://www.iiit.ac.in>
>


Mime
View raw message