incubator-yoko-commits mailing list archives

Site index · List index
Message view « Date » · « Thread »
Top « Date » · « Thread »
From "Continuum@vmbuild.apache.org" <yoko-comm...@incubator.apache.org>
Subject [continuum] BUILD FAILURE: Yoko Core
Date Tue, 06 Mar 2007 05:30:02 GMT
Online report : http://vmbuild.apache.org/continuum/servlet/continuum/target/ProjectBuild.vm/view/ProjectBuild/id/207/buildId/69982
Build statistics:
  State: Failed
  Previous State: Ok
  Started at: Mon, 5 Mar 2007 05:28:04 -0800
  Finished at: Mon, 5 Mar 2007 21:30:02 -0800
  Total time: 16h 1m 57s
  Build Trigger: Forced
  Exit code: 1
  Building machine hostname: vmbuild.apache.org
  Operating system : Linux(unknown)
  Java version : 1.5.0_06(Sun Microsystems Inc.)

Changes
      No files changed
  
****************************************************************************
Output:
****************************************************************************
[INFO] Scanning for projects...
[INFO] ----------------------------------------------------------------------------
[INFO] Building Yoko Core
[INFO]    task-segment: [install]
[INFO] ----------------------------------------------------------------------------
[INFO] [dependency:copy {execution: default}]
[INFO] Configured Artifact: org.apache.yoko:yoko-spec-corba:?:jar
[INFO] Copying yoko-spec-corba-1.0-incubating-M2-SNAPSHOT.jar to /x1/continuum/working-directory/207/target/endorsed/yoko-spec-corba-1.0-incubating-M2-SNAPSHOT.jar
[INFO] [resources:resources]
[INFO] Using default encoding to copy filtered resources.
[INFO] Copying 0 resource
[INFO] Resource directory does not exist: /x1/continuum/working-directory/207/src/main/resources
[INFO] Resource directory does not exist: /x1/continuum/working-directory/207/target/generated/src/main/resources
[INFO] Copying 3 resources to META-INF
[INFO] [compiler:compile]
[INFO] Nothing to compile - all classes are up to date
[INFO] [resources:testResources]
[INFO] Using default encoding to copy filtered resources.
[INFO] Copying 52 resources
[INFO] Resource directory does not exist: /x1/continuum/working-directory/207/src/test/resources
[INFO] Resource directory does not exist: /x1/continuum/working-directory/207/target/generated/src/test/resources
[INFO] [compiler:testCompile]
[INFO] Nothing to compile - all classes are up to date
[INFO] [antrun:run {execution: default}]
[INFO] Executing tasks
[INFO] Executed tasks
[INFO] [antrun:run {execution: default}]
[INFO] Executing tasks
[INFO] Executed tasks
[INFO] [surefire:test]
[INFO] Setting reports dir: /x1/continuum/working-directory/207/target/surefire-reports

-------------------------------------------------------
 T E S T S
-------------------------------------------------------
[client:err] java.io.FileNotFoundException: TestCodeSets.ref (No such file or directory)
[client:err] org.omg.CORBA.BAD_PARAM: bad scheme specific part: file error:  vmcid: OMG minor
code: 0x9  completed: No
[client:err] 	at org.apache.yoko.orb.OB.FileURLScheme_impl.parse_url(FileURLScheme_impl.java:87)
[client:err] 	at org.apache.yoko.orb.OB.URLRegistry_impl.parse_url(URLRegistry_impl.java:70)
[client:err] 	at org.apache.yoko.orb.OB.ObjectFactory.stringToObject(ObjectFactory.java:107)
[client:err] 	at org.apache.yoko.orb.OBCORBA.ORB_impl.string_to_object(ORB_impl.java:1152)
[client:err] 	at test.codesets.Client.run(Client.java:26)
[client:err] 	at test.codesets.Client.main(Client.java:73)
[client:err] 	at sun.reflect.NativeMethodAccessorImpl.invoke0(Native Method)
[client:err] 	at sun.reflect.NativeMethodAccessorImpl.invoke(NativeMethodAccessorImpl.java:39)
[client:err] 	at sun.reflect.DelegatingMethodAccessorImpl.invoke(DelegatingMethodAccessorImpl.java:25)
[client:err] 	at java.lang.reflect.Method.invoke(Method.java:585)
[client:err] 	at org.apache.yoko.processmanager.internal.ProcessAgentImpl.invokeStatic(ProcessAgentImpl.java:153)
[client:err] 	at sun.reflect.NativeMethodAccessorImpl.invoke0(Native Method)
[client:err] 	at sun.reflect.NativeMethodAccessorImpl.invoke(NativeMethodAccessorImpl.java:39)
[client:err] 	at sun.reflect.DelegatingMethodAccessorImpl.invoke(DelegatingMethodAccessorImpl.java:25)
[client:err] 	at java.lang.reflect.Method.invoke(Method.java:585)
[client:err] 	at sun.rmi.server.UnicastServerRef.dispatch(UnicastServerRef.java:294)
[client:err] 	at sun.rmi.transport.Transport$1.run(Transport.java:153)
[client:err] 	at java.security.AccessController.doPrivileged(Native Method)
[client:err] 	at sun.rmi.transport.Transport.serviceCall(Transport.java:149)
[client:err] 	at sun.rmi.transport.tcp.TCPTransport.handleMessages(TCPTransport.java:460)
[client:err] 	at sun.rmi.transport.tcp.TCPTransport$ConnectionHandler.run(TCPTransport.java:701)
[client:err] 	at java.lang.Thread.run(Thread.java:595)
[INFO] ------------------------------------------------------------------------
[ERROR] BUILD ERROR
[INFO] ------------------------------------------------------------------------
[INFO] There are test failures.
[INFO] ------------------------------------------------------------------------
[INFO] For more information, run Maven with the -e switch
[INFO] ------------------------------------------------------------------------
[INFO] Total time: 961 minutes 54 seconds
[INFO] Finished at: Mon Mar 05 21:30:01 PST 2007
[INFO] Final Memory: 8M/15M
[INFO] ------------------------------------------------------------------------

****************************************************************************



Mime
View raw message