incubator-yoko-commits mailing list archives

Site index · List index
Message view « Date » · « Thread »
Top « Date » · « Thread »
From "Continuum@vmbuild.apache.org" <yoko-comm...@incubator.apache.org>
Subject [continuum] BUILD FAILURE: Apache Yoko Bindings
Date Fri, 16 Mar 2007 18:06:18 GMT
Online report : http://vmbuild.apache.org/continuum/servlet/continuum/target/ProjectBuild.vm/view/ProjectBuild/id/214/buildId/79163
Build statistics:
  State: Failed
  Previous State: Failed
  Started at: Fri, 16 Mar 2007 11:01:12 -0700
  Finished at: Fri, 16 Mar 2007 11:06:18 -0700
  Total time: 5m 5s
  Build Trigger: Schedule
  Exit code: 1
  Building machine hostname: vmbuild.apache.org
  Operating system : Linux(unknown)
  Java version : 1.5.0_06(Sun Microsystems Inc.)

Changes
         bravi          [YOKO-245] - Fix for continuum failures.
             /incubator/yoko/trunk/bindings/pom.xml
            /incubator/yoko/trunk/bindings/src/main/java/org/apache/yoko/bindings/corba/CorbaDestination.java
        
****************************************************************************
Output:
****************************************************************************
[INFO] Scanning for projects...
[INFO] ----------------------------------------------------------------------------
[INFO] Building Apache Yoko Bindings
[INFO]    task-segment: [install]
[INFO] ----------------------------------------------------------------------------
[INFO] [dependency:copy {execution: default}]
[INFO] Configured Artifact: org.apache.yoko:yoko-spec-corba:?:jar
[INFO] Configured Artifact: org.apache.yoko:yoko-core:?:jar
[INFO] Copying yoko-spec-corba-1.0-incubating-SNAPSHOT.jar to /x1/continuum/working-directory/214/target/endorsed/yoko-spec-corba-1.0-incubating-SNAPSHOT.jar
[INFO] Copying yoko-core-1.0-incubating-SNAPSHOT.jar to /x1/continuum/working-directory/214/target/endorsed/yoko-core-1.0-incubating-SNAPSHOT.jar
[INFO] Setting property: classpath.resource.loader.class => 'org.codehaus.plexus.velocity.ContextClassLoaderResourceLoader'.
[INFO] Setting property: velocimacro.messages.on => 'false'.
[INFO] Setting property: resource.loader => 'classpath'.
[INFO] Setting property: resource.manager.logwhenfound => 'false'.
[INFO] ************************************************************** 
[INFO] Starting Jakarta Velocity v1.4
[INFO] RuntimeInstance initializing.
[INFO] Default Properties File: org/apache/velocity/runtime/defaults/velocity.properties
[INFO] Default ResourceManager initializing. (class org.apache.velocity.runtime.resource.ResourceManagerImpl)
[INFO] Resource Loader Instantiated: org.codehaus.plexus.velocity.ContextClassLoaderResourceLoader
[INFO] ClasspathResourceLoader : initialization starting.
[INFO] ClasspathResourceLoader : initialization complete.
[INFO] ResourceCache : initialized. (class org.apache.velocity.runtime.resource.ResourceCacheImpl)
[INFO] Default ResourceManager initialization complete.
[INFO] Loaded System Directive: org.apache.velocity.runtime.directive.Literal
[INFO] Loaded System Directive: org.apache.velocity.runtime.directive.Macro
[INFO] Loaded System Directive: org.apache.velocity.runtime.directive.Parse
[INFO] Loaded System Directive: org.apache.velocity.runtime.directive.Include
[INFO] Loaded System Directive: org.apache.velocity.runtime.directive.Foreach
[INFO] Created: 20 parsers.
[INFO] Velocimacro : initialization starting.
[INFO] Velocimacro : adding VMs from VM library template : VM_global_library.vm
[ERROR] ResourceManager : unable to find resource 'VM_global_library.vm' in any resource loader.
[INFO] Velocimacro : error using  VM library template VM_global_library.vm : org.apache.velocity.exception.ResourceNotFoundException:
Unable to find resource 'VM_global_library.vm'
[INFO] Velocimacro :  VM library template macro registration complete.
[INFO] Velocimacro : allowInline = true : VMs can be defined inline in templates
[INFO] Velocimacro : allowInlineToOverride = false : VMs defined inline may NOT replace previous
VM definitions
[INFO] Velocimacro : allowInlineLocal = false : VMs defined inline will be  global in scope
if allowed.
[INFO] Velocimacro : initialization complete.
[INFO] Velocity successfully started.
[INFO] [checkstyle:checkstyle {execution: process-sources}]
[INFO] Starting audit...
Audit done.

[WARNING] Unable to locate Source XRef to link to - DISABLED
[INFO] Setting property: classpath.resource.loader.class => 'org.codehaus.plexus.velocity.ContextClassLoaderResourceLoader'.
[INFO] Setting property: velocimacro.messages.on => 'false'.
[INFO] Setting property: resource.loader => 'classpath'.
[INFO] Setting property: resource.manager.logwhenfound => 'false'.
[INFO] [remote-resources:process {execution: default}]
[INFO] [resources:resources]
[INFO] Using default encoding to copy filtered resources.
[INFO] Copying 2 resources
[INFO] Copying 4 resources
[INFO] Resource directory does not exist: /x1/continuum/working-directory/214/target/generated/src/main/resources
[INFO] Copying 2 resources to META-INF
[INFO] Copying 3 resources
[INFO] [compiler:compile]
[INFO] Compiling 1 source file to /x1/continuum/working-directory/214/target/classes
[INFO] [antrun:run {execution: generate-test-sources}]
[INFO] Executing tasks
[INFO] Executed tasks
[INFO] Registering compile test source root /x1/continuum/working-directory/214/target/generated/src/test/java
[INFO] [yokos:wsdltoidl {execution: generate-type-test-corba-binding}]
[INFO] [yokos:idltowsdl {execution: idltowsdl-generate-type-test-corba-binding}]
[INFO] [resources:testResources]
[INFO] Using default encoding to copy filtered resources.
[INFO] Copying 1 resource
[INFO] Copying 19 resources
[INFO] Copying 9 resources
[INFO] Copying 3 resources
[INFO] [cxf-codegen:wsdl2java {execution: generate-type-test-java-sources}]
[INFO] [cxf-codegen:wsdl2java {execution: generate-corba-type-test-java-sources}]
[INFO] [compiler:testCompile]
[INFO] Nothing to compile - all classes are up to date
[INFO] [surefire:test]
[INFO] Setting reports dir: /x1/continuum/working-directory/214/target/surefire-reports

-------------------------------------------------------
 T E S T S
-------------------------------------------------------
[surefire] Running org.apache.yoko.bindings.corba.interceptors.CorbaInInterceptorTest
[surefire] Tests run: 6, Failures: 0, Errors: 0, Time elapsed: 12.771 sec
[surefire] 

[surefire] Running org.apache.yoko.bindings.corba.interceptors.CorbaOutInterceptorTest
[surefire] Tests run: 1, Failures: 0, Errors: 0, Time elapsed: 0.424 sec
[surefire] 

[surefire] Running org.apache.yoko.bindings.corba.types.CorbaArrayHandlerTest
[surefire] Tests run: 1, Failures: 0, Errors: 0, Time elapsed: 0.037 sec
[surefire] 

[surefire] Running org.apache.yoko.bindings.corba.types.CorbaAnyHandlerTest
[surefire] Tests run: 3, Failures: 0, Errors: 0, Time elapsed: 0.011 sec
[surefire] 

[surefire] Running org.apache.yoko.bindings.corba.types.CorbaPrimitiveHandlerTest
[surefire] Tests run: 14, Failures: 0, Errors: 0, Time elapsed: 0.05 sec
[surefire] 

[surefire] Running org.apache.yoko.bindings.corba.types.CorbaHandlerUtilsTest
[surefire] Tests run: 2, Failures: 0, Errors: 0, Time elapsed: 5.253 sec
[surefire] 

[surefire] Running org.apache.yoko.bindings.corba.types.CorbaEnumHandlerTest
[surefire] Tests run: 1, Failures: 0, Errors: 0, Time elapsed: 0.021 sec
[surefire] 

[surefire] Running org.apache.yoko.bindings.corba.types.CorbaObjectHandlerTest
[surefire] Tests run: 2, Failures: 0, Errors: 0, Time elapsed: 0.006 sec
[surefire] 

[surefire] Running org.apache.yoko.bindings.corba.types.CorbaSequenceHandlerTest
[surefire] Tests run: 1, Failures: 0, Errors: 0, Time elapsed: 0.005 sec
[surefire] 

[surefire] Running org.apache.yoko.bindings.corba.types.CorbaFixedHandlerTest
[surefire] Tests run: 1, Failures: 0, Errors: 0, Time elapsed: 0.013 sec
[surefire] 

[surefire] Running org.apache.yoko.bindings.corba.types.CorbaStructHandlerTest
[surefire] Tests run: 1, Failures: 0, Errors: 0, Time elapsed: 0.004 sec
[surefire] 

[surefire] Running org.apache.yoko.bindings.corba.CorbaUtilsTest
[surefire] Tests run: 14, Failures: 0, Errors: 0, Time elapsed: 0.064 sec
[surefire] 

[surefire] Running org.apache.yoko.bindings.corba.CorbaTypeMapTest
[surefire] Tests run: 1, Failures: 0, Errors: 0, Time elapsed: 0.004 sec
[surefire] 

[surefire] Running org.apache.yoko.bindings.corba.IdlToWsdlTypeTest
[surefire] Tests run: 21, Failures: 0, Errors: 0, Time elapsed: 23.25 sec
[surefire] 

[surefire] Running org.apache.yoko.bindings.corba.CorbaMessageTest
[surefire] Tests run: 1, Failures: 0, Errors: 0, Time elapsed: 0.017 sec
[surefire] 

[surefire] Running org.apache.yoko.bindings.corba.CorbaConduitTest
[surefire] Tests run: 13, Failures: 0, Errors: 0, Time elapsed: 1.81 sec
[surefire] 

[surefire] Running org.apache.yoko.bindings.corba.CorbaBindingTest
[surefire] Tests run: 1, Failures: 0, Errors: 0, Time elapsed: 0.02 sec
[surefire] 

[surefire] Running org.apache.yoko.bindings.corba.CorbaObjectReaderTest
[surefire] Tests run: 21, Failures: 0, Errors: 0, Time elapsed: 0.081 sec
[surefire] 

[surefire] Running org.apache.yoko.bindings.corba.CorbaObjectWriterTest
[surefire] Tests run: 18, Failures: 0, Errors: 0, Time elapsed: 0.047 sec
[surefire] 

[surefire] Running org.apache.yoko.bindings.corba.CorbaStreamableTest
[surefire] Tests run: 5, Failures: 0, Errors: 0, Time elapsed: 0.013 sec
[surefire] 

[surefire] Running org.apache.yoko.bindings.corba.CorbaServerConduitTest
[surefire] Tests run: 9, Failures: 0, Errors: 0, Time elapsed: 15.463 sec
[surefire] 

[surefire] Running org.apache.yoko.bindings.corba.CorbaStaxObjectTest
[surefire] Tests run: 7, Failures: 0, Errors: 0, Time elapsed: 1.697 sec
[surefire] 

[surefire] Running org.apache.yoko.bindings.corba.ContextUtilsTest
[surefire] Tests run: 2, Failures: 0, Errors: 0, Time elapsed: 0.003 sec
[surefire] 

[surefire] Running org.apache.yoko.bindings.corba.CorbaDestinationTest
[surefire] Tests run: 1, Failures: 0, Errors: 0, Time elapsed: 0.024 sec
[surefire] 

[surefire] Running org.apache.yoko.bindings.corba.CorbaBindingFactoryTest
[surefire] Tests run: 9, Failures: 0, Errors: 0, Time elapsed: 12.59 sec
[surefire] 

[surefire] Running org.apache.yoko.bindings.corba.CorbaTypeTest
[surefire] Tests run: 1, Failures: 1, Errors: 0, Time elapsed: 180.139 sec
[surefire] 
[surefire] org.apache.yoko.bindings.corba.CorbaTypeTest  Time elapsed: 181.57 sec  <<<
FAILURE!
junit.framework.AssertionFailedError: failed to launch server
	at junit.framework.Assert.fail(Assert.java:47)
	at junit.framework.Assert.assertTrue(Assert.java:20)
	at org.apache.yoko.bindings.corba.CorbaTypeTest$CorbaTypeTestSetup.setUp(CorbaTypeTest.java:84)
	at org.apache.yoko.bindings.corba.CorbaTypeTest$1.setUp(CorbaTypeTest.java:44)
	at junit.extensions.TestSetup$1.protect(TestSetup.java:20)
	at junit.framework.TestResult.runProtected(TestResult.java:124)
	at junit.extensions.TestSetup.run(TestSetup.java:25)
	at sun.reflect.GeneratedMethodAccessor30.invoke(Unknown Source)
	at sun.reflect.DelegatingMethodAccessorImpl.invoke(DelegatingMethodAccessorImpl.java:25)
	at java.lang.reflect.Method.invoke(Method.java:585)
	at org.apache.maven.surefire.battery.JUnitBattery.executeJUnit(JUnitBattery.java:242)
	at org.apache.maven.surefire.battery.JUnitBattery.execute(JUnitBattery.java:216)
	at org.apache.maven.surefire.Surefire.executeBattery(Surefire.java:215)
	at org.apache.maven.surefire.Surefire.run(Surefire.java:163)
	at org.apache.maven.surefire.Surefire.run(Surefire.java:87)
	at org.apache.maven.surefire.Surefire.run(Surefire.java:63)
	at sun.reflect.NativeMethodAccessorImpl.invoke0(Native Method)
	at sun.reflect.NativeMethodAccessorImpl.invoke(NativeMethodAccessorImpl.java:39)
	at sun.reflect.DelegatingMethodAccessorImpl.invoke(DelegatingMethodAccessorImpl.java:25)
	at java.lang.reflect.Method.invoke(Method.java:585)
	at org.apache.maven.surefire.SurefireBooter.main(SurefireBooter.java:785)


Test OnMessage in TestObserver
[surefire] Running org.apache.yoko.bindings.corba.CorbaDSIServantTest
[surefire] Tests run: 1, Failures: 0, Errors: 0, Time elapsed: 1.235 sec
[surefire] 


Results :
[surefire] Tests run: 158, Failures: 1, Errors: 0

[INFO] ------------------------------------------------------------------------
[ERROR] BUILD ERROR
[INFO] ------------------------------------------------------------------------
[INFO] There are test failures.
[INFO] ------------------------------------------------------------------------
[INFO] For more information, run Maven with the -e switch
[INFO] ------------------------------------------------------------------------
[INFO] Total time: 5 minutes 1 second
[INFO] Finished at: Fri Mar 16 11:06:17 PDT 2007
[INFO] Final Memory: 21M/41M
[INFO] ------------------------------------------------------------------------

****************************************************************************



Mime
View raw message