incubator-yoko-commits mailing list archives

Site index · List index
Message view « Date » · « Thread »
Top « Date » · « Thread »
From "Continuum@vmbuild.apache.org" <yoko-comm...@incubator.apache.org>
Subject [continuum] BUILD FAILURE: Apache Yoko Bindings
Date Mon, 16 Apr 2007 14:06:06 GMT
Online report : http://vmbuild.apache.org/continuum/servlet/continuum/target/ProjectBuild.vm/view/ProjectBuild/id/214/buildId/113892
Build statistics:
  State: Failed
  Previous State: Failed
  Started at: Mon, 16 Apr 2007 07:02:39 -0700
  Finished at: Mon, 16 Apr 2007 07:06:06 -0700
  Total time: 3m 27s
  Build Trigger: Schedule
  Exit code: 1
  Building machine hostname: vmbuild.apache.org
  Operating system : Linux(unknown)
  Java version : 1.5.0_06(Sun Microsystems Inc.)

Changes
         bravi          Fixing the failed binding tests because of cxf api modifications & also fixed checkstyle errors in the IDLPreProcessor code.
             /incubator/yoko/trunk/bindings/src/main/java/org/apache/yoko/bindings/corba/CorbaBindingFactory.java
            /incubator/yoko/trunk/bindings/src/test/java/org/apache/yoko/bindings/corba/CorbaBindingFactoryTest.java
            /incubator/yoko/trunk/bindings/src/test/java/org/apache/yoko/bindings/corba/CorbaConduitTest.java
            /incubator/yoko/trunk/bindings/src/test/java/org/apache/yoko/bindings/corba/CorbaObjectReferenceTest.java
            /incubator/yoko/trunk/bindings/src/test/java/org/apache/yoko/bindings/corba/CorbaServerConduitTest.java
            /incubator/yoko/trunk/bindings/src/test/java/org/apache/yoko/bindings/corba/CorbaSystemExceptionTest.java
            /incubator/yoko/trunk/bindings/src/test/java/org/apache/yoko/bindings/corba/CorbaTypeTestServer.java
            /incubator/yoko/trunk/bindings/src/test/java/org/apache/yoko/bindings/corba/IdlToWsdlTypeTestServer.java
            /incubator/yoko/trunk/bindings/src/test/java/org/apache/yoko/bindings/corba/TestUtils.java
            /incubator/yoko/trunk/bindings/src/test/java/org/apache/yoko/bindings/corba/types/CorbaHandlerUtilsTest.java
            /incubator/yoko/trunk/bindings/src/test/resources/wsdl/ObjectRef.wsdl
            /incubator/yoko/trunk/tools/src/main/java/org/apache/yoko/tools/idlpreprocessor/DefaultIncludeResolver.java
            /incubator/yoko/trunk/tools/src/main/java/org/apache/yoko/tools/idlpreprocessor/IdlPreprocessorReader.java
            /incubator/yoko/trunk/tools/src/main/java/org/apache/yoko/tools/idlpreprocessor/IncludeResolver.java
            /incubator/yoko/trunk/tools/src/main/java/org/apache/yoko/tools/idlpreprocessor/IncludeStackEntry.java
            /incubator/yoko/trunk/tools/src/main/java/org/apache/yoko/tools/idlpreprocessor/PreprocessingException.java
            /incubator/yoko/trunk/tools/src/main/java/org/apache/yoko/tools/processors/idl/PortTypeVisitor.java
           bravi          Missed a file in my earlier commit
             /incubator/yoko/trunk/bindings/src/test/resources/wsdl/ws-addr.xsd
        
****************************************************************************
Output:
****************************************************************************
[INFO] Scanning for projects...
[INFO] ----------------------------------------------------------------------------
[INFO] Building Apache Yoko Bindings
[INFO]    task-segment: [clean, install]
[INFO] ----------------------------------------------------------------------------
[INFO] artifact org.apache.maven.plugins:maven-clean-plugin: checking for updates from apache-incubator
[INFO] snapshot org.apache.maven.plugins:maven-clean-plugin:2.2-SNAPSHOT: checking for updates from apache-incubator
[INFO] snapshot org.apache.maven.plugins:maven-clean-plugin:2.2-SNAPSHOT: checking for updates from apache-snapshots
[INFO] artifact org.apache.maven.plugins:maven-checkstyle-plugin: checking for updates from apache-incubator
[INFO] snapshot org.apache.maven.plugins:maven-checkstyle-plugin:2.2-SNAPSHOT: checking for updates from apache-incubator
[INFO] snapshot org.apache.maven.plugins:maven-checkstyle-plugin:2.2-SNAPSHOT: checking for updates from apache-snapshots
[INFO] snapshot org.apache.yoko:yoko-maven-plugins:1.0-incubating-SNAPSHOT: checking for updates from apache-incubator
[INFO] snapshot org.apache.yoko:yoko-maven-plugins:1.0-incubating-SNAPSHOT: checking for updates from apache-snapshots
[INFO] snapshot org.apache.yoko:yoko-maven-plugins:1.0-incubating-SNAPSHOT: checking for updates from java.net
[INFO] snapshot org.apache.yoko:yoko-maven-plugins:1.0-incubating-SNAPSHOT: checking for updates from apache.snapshots
[INFO] snapshot org.apache.cxf:cxf-codegen-plugin:2.0-incubator-RC-SNAPSHOT: checking for updates from apache-incubator
[INFO] snapshot org.apache.cxf:cxf-codegen-plugin:2.0-incubator-RC-SNAPSHOT: checking for updates from apache-snapshots
[INFO] snapshot org.apache.cxf:cxf-codegen-plugin:2.0-incubator-RC-SNAPSHOT: checking for updates from java.net
[INFO] snapshot org.apache.cxf:cxf-codegen-plugin:2.0-incubator-RC-SNAPSHOT: checking for updates from apache.snapshots
[INFO] snapshot org.apache.cxf:cxf-parent:2.0-incubator-RC-SNAPSHOT: checking for updates from java.net
[INFO] snapshot org.apache.cxf:cxf-parent:2.0-incubator-RC-SNAPSHOT: checking for updates from apache-incubator
[INFO] snapshot org.apache.cxf:cxf-parent:2.0-incubator-RC-SNAPSHOT: checking for updates from apache-snapshots
[INFO] snapshot org.apache.cxf:cxf-parent:2.0-incubator-RC-SNAPSHOT: checking for updates from apache.snapshots
[INFO] snapshot org.apache.cxf:cxf:2.0-incubator-RC-SNAPSHOT: checking for updates from java.net
[INFO] snapshot org.apache.cxf:cxf:2.0-incubator-RC-SNAPSHOT: checking for updates from apache-incubator
[INFO] snapshot org.apache.cxf:cxf:2.0-incubator-RC-SNAPSHOT: checking for updates from apache-snapshots
[INFO] snapshot org.apache.cxf:cxf:2.0-incubator-RC-SNAPSHOT: checking for updates from apache.snapshots
[INFO] [clean:clean]
[INFO] Deleting directory /x1/continuum/working-directory/214/target
[INFO] Deleting directory /x1/continuum/working-directory/214/target/classes
[INFO] Deleting directory /x1/continuum/working-directory/214/target/test-classes
[INFO] Deleting directory /x1/continuum/working-directory/214/target/site
[INFO] artifact org.apache.maven.plugins:maven-resources-plugin: checking for updates from apache-incubator
[INFO] snapshot org.apache.maven.plugins:maven-resources-plugin:2.3-SNAPSHOT: checking for updates from apache-incubator
[INFO] snapshot org.apache.maven.plugins:maven-resources-plugin:2.3-SNAPSHOT: checking for updates from apache-snapshots
[INFO] [dependency:copy {execution: default}]
[INFO] Configured Artifact: org.apache.yoko:yoko-spec-corba:?:jar
[INFO] snapshot org.apache.yoko:yoko-spec-corba:1.0-incubating-SNAPSHOT: checking for updates from apache-snapshots
[INFO] snapshot org.apache.yoko:yoko-spec-corba:1.0-incubating-SNAPSHOT: checking for updates from apache-incubator
[INFO] snapshot org.apache.yoko:yoko-spec-corba:1.0-incubating-SNAPSHOT: checking for updates from java.net
[INFO] snapshot org.apache.yoko:yoko-spec-corba:1.0-incubating-SNAPSHOT: checking for updates from apache.snapshots
[INFO] Configured Artifact: org.apache.yoko:yoko-core:?:jar
[INFO] snapshot org.apache.yoko:yoko-core:1.0-incubating-SNAPSHOT: checking for updates from apache-snapshots
[INFO] snapshot org.apache.yoko:yoko-core:1.0-incubating-SNAPSHOT: checking for updates from apache-incubator
[INFO] snapshot org.apache.yoko:yoko-core:1.0-incubating-SNAPSHOT: checking for updates from java.net
[INFO] snapshot org.apache.yoko:yoko-core:1.0-incubating-SNAPSHOT: checking for updates from apache.snapshots
[INFO] Copying yoko-spec-corba-1.0-incubating-SNAPSHOT.jar to /x1/continuum/working-directory/214/target/endorsed/yoko-spec-corba-1.0-incubating-SNAPSHOT.jar
[INFO] Copying yoko-core-1.0-incubating-SNAPSHOT.jar to /x1/continuum/working-directory/214/target/endorsed/yoko-core-1.0-incubating-SNAPSHOT.jar
[INFO] Setting property: classpath.resource.loader.class => 'org.codehaus.plexus.velocity.ContextClassLoaderResourceLoader'.
[INFO] Setting property: velocimacro.messages.on => 'false'.
[INFO] Setting property: resource.loader => 'classpath'.
[INFO] Setting property: resource.manager.logwhenfound => 'false'.
[INFO] ************************************************************** 
[INFO] Starting Jakarta Velocity v1.4
[INFO] RuntimeInstance initializing.
[INFO] Default Properties File: org/apache/velocity/runtime/defaults/velocity.properties
[INFO] Default ResourceManager initializing. (class org.apache.velocity.runtime.resource.ResourceManagerImpl)
[INFO] Resource Loader Instantiated: org.codehaus.plexus.velocity.ContextClassLoaderResourceLoader
[INFO] ClasspathResourceLoader : initialization starting.
[INFO] ClasspathResourceLoader : initialization complete.
[INFO] ResourceCache : initialized. (class org.apache.velocity.runtime.resource.ResourceCacheImpl)
[INFO] Default ResourceManager initialization complete.
[INFO] Loaded System Directive: org.apache.velocity.runtime.directive.Literal
[INFO] Loaded System Directive: org.apache.velocity.runtime.directive.Macro
[INFO] Loaded System Directive: org.apache.velocity.runtime.directive.Parse
[INFO] Loaded System Directive: org.apache.velocity.runtime.directive.Include
[INFO] Loaded System Directive: org.apache.velocity.runtime.directive.Foreach
[INFO] Created: 20 parsers.
[INFO] Velocimacro : initialization starting.
[INFO] Velocimacro : adding VMs from VM library template : VM_global_library.vm
[ERROR] ResourceManager : unable to find resource 'VM_global_library.vm' in any resource loader.
[INFO] Velocimacro : error using  VM library template VM_global_library.vm : org.apache.velocity.exception.ResourceNotFoundException: Unable to find resource 'VM_global_library.vm'
[INFO] Velocimacro :  VM library template macro registration complete.
[INFO] Velocimacro : allowInline = true : VMs can be defined inline in templates
[INFO] Velocimacro : allowInlineToOverride = false : VMs defined inline may NOT replace previous VM definitions
[INFO] Velocimacro : allowInlineLocal = false : VMs defined inline will be  global in scope if allowed.
[INFO] Velocimacro : initialization complete.
[INFO] Velocity successfully started.
[INFO] [checkstyle:checkstyle {execution: process-sources}]
[INFO] Starting audit...
Audit done.

[WARNING] Unable to locate Source XRef to link to - DISABLED
[INFO] snapshot org.apache.cxf:cxf-common-utilities:2.0-incubator-RC-SNAPSHOT: checking for updates from apache-snapshots
[INFO] snapshot org.apache.cxf:cxf-common-utilities:2.0-incubator-RC-SNAPSHOT: checking for updates from apache-incubator
[INFO] snapshot org.apache.cxf:cxf-common-utilities:2.0-incubator-RC-SNAPSHOT: checking for updates from java.net
[INFO] snapshot org.apache.cxf:cxf-common-utilities:2.0-incubator-RC-SNAPSHOT: checking for updates from apache.snapshots
[INFO] snapshot org.apache.cxf:cxf-rt-frontend-jaxws:2.0-incubator-RC-SNAPSHOT: checking for updates from apache-snapshots
[INFO] snapshot org.apache.cxf:cxf-rt-frontend-jaxws:2.0-incubator-RC-SNAPSHOT: checking for updates from apache-incubator
[INFO] snapshot org.apache.cxf:cxf-rt-frontend-jaxws:2.0-incubator-RC-SNAPSHOT: checking for updates from java.net
[INFO] snapshot org.apache.cxf:cxf-rt-frontend-jaxws:2.0-incubator-RC-SNAPSHOT: checking for updates from apache.snapshots
[INFO] snapshot org.apache.cxf:cxf-tools-common:2.0-incubator-RC-SNAPSHOT: checking for updates from apache-snapshots
[INFO] snapshot org.apache.cxf:cxf-tools-common:2.0-incubator-RC-SNAPSHOT: checking for updates from apache-incubator
[INFO] snapshot org.apache.cxf:cxf-tools-common:2.0-incubator-RC-SNAPSHOT: checking for updates from java.net
[INFO] snapshot org.apache.cxf:cxf-tools-common:2.0-incubator-RC-SNAPSHOT: checking for updates from apache.snapshots
[INFO] snapshot org.apache.cxf:cxf-rt-core:2.0-incubator-RC-SNAPSHOT: checking for updates from apache-snapshots
[INFO] snapshot org.apache.cxf:cxf-rt-core:2.0-incubator-RC-SNAPSHOT: checking for updates from apache-incubator
[INFO] snapshot org.apache.cxf:cxf-rt-core:2.0-incubator-RC-SNAPSHOT: checking for updates from java.net
[INFO] snapshot org.apache.cxf:cxf-rt-core:2.0-incubator-RC-SNAPSHOT: checking for updates from apache.snapshots
[INFO] snapshot org.apache.cxf:cxf-api:2.0-incubator-RC-SNAPSHOT: checking for updates from apache-snapshots
[INFO] snapshot org.apache.cxf:cxf-api:2.0-incubator-RC-SNAPSHOT: checking for updates from apache-incubator
[INFO] snapshot org.apache.cxf:cxf-api:2.0-incubator-RC-SNAPSHOT: checking for updates from java.net
[INFO] snapshot org.apache.cxf:cxf-api:2.0-incubator-RC-SNAPSHOT: checking for updates from apache.snapshots
[INFO] snapshot org.apache.cxf:cxf-common-schemas:2.0-incubator-RC-SNAPSHOT: checking for updates from apache-snapshots
[INFO] snapshot org.apache.cxf:cxf-common-schemas:2.0-incubator-RC-SNAPSHOT: checking for updates from apache-incubator
[INFO] snapshot org.apache.cxf:cxf-common-schemas:2.0-incubator-RC-SNAPSHOT: checking for updates from java.net
[INFO] snapshot org.apache.cxf:cxf-common-schemas:2.0-incubator-RC-SNAPSHOT: checking for updates from apache.snapshots
[INFO] snapshot org.apache.cxf:cxf-rt-bindings-soap:2.0-incubator-RC-SNAPSHOT: checking for updates from apache-snapshots
[INFO] snapshot org.apache.cxf:cxf-rt-bindings-soap:2.0-incubator-RC-SNAPSHOT: checking for updates from apache-incubator
[INFO] snapshot org.apache.cxf:cxf-rt-bindings-soap:2.0-incubator-RC-SNAPSHOT: checking for updates from java.net
[INFO] snapshot org.apache.cxf:cxf-rt-bindings-soap:2.0-incubator-RC-SNAPSHOT: checking for updates from apache.snapshots
[INFO] snapshot org.apache.cxf:cxf-rt-databinding-jaxb:2.0-incubator-RC-SNAPSHOT: checking for updates from apache-snapshots
[INFO] snapshot org.apache.cxf:cxf-rt-databinding-jaxb:2.0-incubator-RC-SNAPSHOT: checking for updates from apache-incubator
[INFO] snapshot org.apache.cxf:cxf-rt-databinding-jaxb:2.0-incubator-RC-SNAPSHOT: checking for updates from java.net
[INFO] snapshot org.apache.cxf:cxf-rt-databinding-jaxb:2.0-incubator-RC-SNAPSHOT: checking for updates from apache.snapshots
[INFO] snapshot org.apache.cxf:cxf-rt-bindings-xml:2.0-incubator-RC-SNAPSHOT: checking for updates from apache-snapshots
[INFO] snapshot org.apache.cxf:cxf-rt-bindings-xml:2.0-incubator-RC-SNAPSHOT: checking for updates from apache-incubator
[INFO] snapshot org.apache.cxf:cxf-rt-bindings-xml:2.0-incubator-RC-SNAPSHOT: checking for updates from java.net
[INFO] snapshot org.apache.cxf:cxf-rt-bindings-xml:2.0-incubator-RC-SNAPSHOT: checking for updates from apache.snapshots
[INFO] snapshot org.apache.cxf:cxf-rt-frontend-simple:2.0-incubator-RC-SNAPSHOT: checking for updates from apache-snapshots
[INFO] snapshot org.apache.cxf:cxf-rt-frontend-simple:2.0-incubator-RC-SNAPSHOT: checking for updates from apache-incubator
[INFO] snapshot org.apache.cxf:cxf-rt-frontend-simple:2.0-incubator-RC-SNAPSHOT: checking for updates from java.net
[INFO] snapshot org.apache.cxf:cxf-rt-frontend-simple:2.0-incubator-RC-SNAPSHOT: checking for updates from apache.snapshots
[INFO] snapshot org.apache.yoko:yoko-api:1.0-incubating-SNAPSHOT: checking for updates from apache-snapshots
[INFO] snapshot org.apache.yoko:yoko-api:1.0-incubating-SNAPSHOT: checking for updates from apache-incubator
[INFO] snapshot org.apache.yoko:yoko-api:1.0-incubating-SNAPSHOT: checking for updates from java.net
[INFO] snapshot org.apache.yoko:yoko-api:1.0-incubating-SNAPSHOT: checking for updates from apache.snapshots
[INFO] snapshot org.apache.yoko:yoko-rmi-spec:1.0-incubating-SNAPSHOT: checking for updates from apache-snapshots
[INFO] snapshot org.apache.yoko:yoko-rmi-spec:1.0-incubating-SNAPSHOT: checking for updates from apache-incubator
[INFO] snapshot org.apache.yoko:yoko-rmi-spec:1.0-incubating-SNAPSHOT: checking for updates from java.net
[INFO] snapshot org.apache.yoko:yoko-rmi-spec:1.0-incubating-SNAPSHOT: checking for updates from apache.snapshots
[INFO] Setting property: classpath.resource.loader.class => 'org.codehaus.plexus.velocity.ContextClassLoaderResourceLoader'.
[INFO] Setting property: velocimacro.messages.on => 'false'.
[INFO] Setting property: resource.loader => 'classpath'.
[INFO] Setting property: resource.manager.logwhenfound => 'false'.
[INFO] [remote-resources:process {execution: default}]
[INFO] [resources:resources]
[INFO] Using default encoding to copy filtered resources.
[INFO] Copying 4 resources
[INFO] Copying 4 resources
[INFO] Resource directory does not exist: /x1/continuum/working-directory/214/target/generated/src/main/resources
[INFO] Copying 2 resources to META-INF
[INFO] Copying 3 resources
[INFO] [compiler:compile]
[INFO] Compiling 35 source files to /x1/continuum/working-directory/214/target/classes
[WARNING] /x1/continuum/working-directory/214/src/main/java/org/apache/yoko/bindings/corba/interceptors/CorbaInInterceptor.java:[263,24] [unchecked] unchecked call to add(E) as a member of the raw type java.util.List

[WARNING] /x1/continuum/working-directory/214/src/main/java/org/apache/yoko/bindings/corba/interceptors/CorbaInInterceptor.java:[396,24] [unchecked] unchecked call to add(E) as a member of the raw type java.util.List

[WARNING] /x1/continuum/working-directory/214/src/main/java/org/apache/yoko/bindings/corba/interceptors/CorbaInInterceptor.java:[399,24] [unchecked] unchecked call to add(E) as a member of the raw type java.util.List

[WARNING] /x1/continuum/working-directory/214/src/main/java/org/apache/yoko/bindings/corba/interceptors/CorbaInInterceptor.java:[501,36] [unchecked] unchecked call to isAssignableFrom(java.lang.Class<?>) as a member of the raw type java.lang.Class

[WARNING] /x1/continuum/working-directory/214/src/main/java/org/apache/yoko/bindings/corba/interceptors/CorbaOutInterceptor.java:[126,46] [unchecked] unchecked conversion
found   : java.util.List
required: java.util.List<java.lang.Object>

[WARNING] /x1/continuum/working-directory/214/src/main/java/org/apache/yoko/bindings/corba/interceptors/CorbaOutInterceptor.java:[152,46] [unchecked] unchecked conversion
found   : java.util.List
required: java.util.List<java.lang.Object>

[INFO] [antrun:run {execution: generate-test-sources}]
[INFO] Executing tasks
    [mkdir] Created dir: /x1/continuum/working-directory/214/target/generated/src/test/resources/wsdl/type_test
     [xslt] Processing /x1/continuum/working-directory/214/src/test/resources/wsdl/type_test/type_test.xsd to /x1/continuum/working-directory/214/target/generated/src/test/resources/wsdl/type_test/type_test_1.xsd
     [xslt] Loading stylesheet /x1/continuum/working-directory/214/src/test/resources/wsdl/type_test/type_test_ID_xsd.xsl
     [xslt] Processing /x1/continuum/working-directory/214/src/test/resources/wsdl/type_test/type_test.xsd to /x1/continuum/working-directory/214/target/generated/src/test/resources/wsdl/type_test/type_test_2.xsd
     [xslt] Loading stylesheet /x1/continuum/working-directory/214/src/test/resources/wsdl/type_test/type_test_ID_xsd.xsl
     [xslt] Processing /x1/continuum/working-directory/214/src/test/resources/wsdl/type_test/type_test.xsd to /x1/continuum/working-directory/214/target/generated/src/test/resources/wsdl/type_test/type_test_3.xsd
     [xslt] Loading stylesheet /x1/continuum/working-directory/214/src/test/resources/wsdl/type_test/type_test_ID_xsd.xsl
     [xslt] Processing /x1/continuum/working-directory/214/src/test/resources/wsdl/type_test/type_test.xsd to /x1/continuum/working-directory/214/target/generated/src/test/resources/wsdl/type_test/type_test_corba_inc.wsdl
     [xslt] Loading stylesheet /x1/continuum/working-directory/214/src/test/resources/wsdl/type_test/type_test_wsdl.xsl
    [mkdir] Created dir: /x1/continuum/working-directory/214/target/generated/src/test/java/org/apache/type_test/corba
     [xslt] Processing /x1/continuum/working-directory/214/src/test/resources/wsdl/type_test/type_test.xsd to /x1/continuum/working-directory/214/target/generated/src/test/java/org/apache/type_test/corba/TypeTestImpl.java
     [xslt] Loading stylesheet /x1/continuum/working-directory/214/src/test/resources/wsdl/type_test/type_test_impl_java.xsl
     [xslt] Processing /x1/continuum/working-directory/214/src/test/resources/wsdl/type_test/type_test.xsd to /x1/continuum/working-directory/214/target/generated/src/test/java/org/apache/type_test/corba/TypeTestTester.java
     [xslt] Loading stylesheet /x1/continuum/working-directory/214/src/test/resources/wsdl/type_test/type_test_tester_java.xsl
[INFO] Executed tasks
[INFO] Registering compile test source root /x1/continuum/working-directory/214/target/generated/src/test/java
[INFO] snapshot org.apache.yoko:yoko-tools:1.0-incubating-SNAPSHOT: checking for updates from apache-incubator
[INFO] snapshot org.apache.yoko:yoko-tools:1.0-incubating-SNAPSHOT: checking for updates from apache-snapshots
[INFO] snapshot org.apache.yoko:yoko-tools:1.0-incubating-SNAPSHOT: checking for updates from java.net
[INFO] snapshot org.apache.yoko:yoko-tools:1.0-incubating-SNAPSHOT: checking for updates from apache.snapshots
[INFO] [yokos:wsdltoidl {execution: generate-type-test-corba-binding}]
wsdltoidl -d /x1/continuum/working-directory/214/target/generated/src/test/resources/wsdl/type_test -corba -o type_test_corba.wsdl -b TypeTestCORBABinding -verbose /x1/continuum/working-directory/214/target/generated/src/test/resources/wsdl/type_test/type_test_corba_inc.wsdl
wsdltoidl - 2.0-incubator-RC-SNAPSHOT

Retrieving document at '/x1/continuum/working-directory/214/target/generated/src/test/resources/wsdl/type_test/type_test_corba_inc.wsdl'.
Apr 16, 2007 7:03:35 AM org.apache.yoko.tools.processors.wsdl.WSDLToCorbaHelper createArray
WARNING: Couldn't Map to Array:{http://apache.org/type_test/corba}AnonymousStructSequenceStructArray:minOccurs=1:maxOccurs=1
Apr 16, 2007 7:03:35 AM org.apache.yoko.tools.processors.wsdl.WSDLToCorbaHelper createArray
WARNING: Couldn't Map to Array:{http://apache.org/type_test/corba}AnonymousStructSequenceStructArray:minOccurs=1:maxOccurs=1
Apr 16, 2007 7:03:35 AM org.apache.yoko.tools.processors.wsdl.WSDLToCorbaHelper createArray
WARNING: Couldn't Map to Array:{http://apache.org/type_test/corba}AnonymousStructSequenceStructArray:minOccurs=1:maxOccurs=1
Apr 16, 2007 7:03:35 AM org.apache.yoko.tools.processors.wsdl.WSDLToCorbaHelper createArray
WARNING: Couldn't Map to Array:{http://apache.org/type_test/corba}AnonymousStructSequenceStructArray:minOccurs=1:maxOccurs=1
Apr 16, 2007 7:03:35 AM org.apache.yoko.tools.processors.wsdl.WSDLToCorbaHelper createArray
WARNING: Couldn't Map to Array:{http://apache.org/type_test/corba}AnonymousStructSequenceStructArray:minOccurs=1:maxOccurs=1
Apr 16, 2007 7:03:35 AM org.apache.yoko.tools.processors.wsdl.WSDLToCorbaHelper createArray
WARNING: Couldn't Map to Array:{http://apache.org/type_test/corba}AnonymousStructSequenceStructArray:minOccurs=1:maxOccurs=1
Apr 16, 2007 7:03:36 AM org.apache.yoko.tools.processors.wsdl.WSDLToCorbaHelper createArray
WARNING: Couldn't Map to Array:{http://apache.org/type_test/corba}AnonymousStructSequenceStructArray:minOccurs=1:maxOccurs=1
Apr 16, 2007 7:03:36 AM org.apache.yoko.tools.processors.wsdl.WSDLToCorbaHelper createArray
WARNING: Couldn't Map to Array:{http://apache.org/type_test/corba}AnonymousStructSequenceStructArray:minOccurs=1:maxOccurs=1
Apr 16, 2007 7:03:36 AM org.apache.yoko.tools.processors.wsdl.WSDLToCorbaHelper createArray
WARNING: Couldn't Map to Array:{http://apache.org/type_test/corba}AnonymousStructSequenceStructArray:minOccurs=1:maxOccurs=1
Apr 16, 2007 7:03:36 AM org.apache.yoko.tools.processors.wsdl.WSDLToCorbaHelper createArray
WARNING: Couldn't Map to Array:{http://apache.org/type_test/corba}AnonymousStructSequenceStructArray:minOccurs=1:maxOccurs=1
Apr 16, 2007 7:03:36 AM org.apache.yoko.tools.processors.wsdl.WSDLToCorbaHelper createArray
WARNING: Couldn't Map to Array:{http://apache.org/type_test/corba}AnonymousStructSequenceStructArray:minOccurs=1:maxOccurs=1
[INFO] [yokos:idltowsdl {execution: idltowsdl-generate-type-test-corba-binding}]
 ( interface idltowsdlTypeTest ( greetMe string ( in string name ) ) ( typedef long TpInt32 ) ( typedef TpInt32 TpDuration ) ( testAlias TpDuration ( in TpDuration inDuration ) ( inout TpDuration inoutDuration ) ( out TpDuration outDuration ) ) ( testFloat float ( in float inFloat ) ( inout float inoutFloat ) ( out float outFloat ) ) ( testDouble double ( in double inDouble ) ( inout double inoutDouble ) ( out double outDouble ) ) ( testShort short ( in short inShort ) ( inout short inoutShort ) ( out short outShort ) ) ( testLong long ( in long inLong ) ( inout long inoutLong ) ( out long outLong ) ) ( testLongLong long long ( in long long inLongLong ) ( inout long long inoutLongLong ) ( out long long outLongLong ) ) ( testUnsignedShort unsigned short ( in unsigned short inUnsignedShort ) ( inout unsigned short inoutUnsignedShort ) ( out unsigned short outUnsignedShort ) ) ( testUnsignedLong unsigned long ( in unsigned long inUnsignedLong ) ( inout unsigned long inoutUnsignedLong ) ( out unsigned long outUnsignedLong ) ) ( testUnsignedLongLong unsigned long long ( in unsigned long long inUnsignedLongLong ) ( inout unsigned long long inoutUnsignedLongLong ) ( out unsigned long long outUnsignedLongLong ) ) ( testChar char ( in char inChar ) ( inout char inoutChar ) ( out char outChar ) ) ( testWchar wchar ( in wchar inWchar ) ( inout wchar inoutWchar ) ( out wchar outWchar ) ) ( testBoolean boolean ( in boolean inBoolean ) ( inout boolean inoutBoolean ) ( out boolean outBoolean ) ) ( testOctet octet ( in octet inOctet ) ( inout octet inoutOctet ) ( out octet outOctet ) ) ( testAny any ( in any inAny ) ( inout any inoutAny ) ( out any outAny ) ) ( typedef ( sequence long ) seqLong ) ( testSeqLong seqLong ( in seqLong inSeqLong ) ( inout seqLong inoutSeqLong ) ( out seqLong outSeqLong ) ) ( testString string ( in string inString ) ( inout string inoutString ) ( out string outString ) ) ( testWstring wstring ( in wstring inWstring ) ( inout wstring inoutWstring ) ( out wstring outWstring ) ) ( typedef ( fixed 31 2 ) fixedPt ) ( testFixedPt fixedPt ( in fixedPt inFixedPt ) ( inout fixedPt inoutFixedPt ) ( out fixedPt outFixedPt ) ) ( struct struct1 long struct1long short struct1short ) ( testStruct struct1 ( in struct1 inStruct1 ) ( inout struct1 inoutStruct1 ) ( out struct1 outStruct1 ) ) ( enum enum1 e1_1 e1_2 e1_3 e1_4 ) ( union union1 enum1 ( case e1_1 long u1_1 ) ( case ( case e1_2 ) e1_3 string u1_2 ) ( default short u1_3 ) ) ( testUnion union1 ( in union1 inUnion1 ) ( inout union1 inoutUnion1 ) ( out union1 outUnion1 ) ) ( testEnum enum1 ( in enum1 inEnum1 ) ( inout enum1 inoutEnum1 ) ( out enum1 outEnum1 ) ) )
[INFO] [resources:testResources]
[INFO] Using default encoding to copy filtered resources.
[INFO] Copying 1 resource
[INFO] Copying 22 resources
[INFO] Copying 8 resources
[INFO] Copying 3 resources
[INFO] snapshot org.apache.cxf:cxf-tools-wsdlto-databinding-jaxb:2.0-incubator-RC-SNAPSHOT: checking for updates from apache-incubator
[INFO] snapshot org.apache.cxf:cxf-tools-wsdlto-databinding-jaxb:2.0-incubator-RC-SNAPSHOT: checking for updates from apache-snapshots
[INFO] snapshot org.apache.cxf:cxf-tools-wsdlto-databinding-jaxb:2.0-incubator-RC-SNAPSHOT: checking for updates from java.net
[INFO] snapshot org.apache.cxf:cxf-tools-wsdlto-databinding-jaxb:2.0-incubator-RC-SNAPSHOT: checking for updates from apache.snapshots
[INFO] snapshot org.apache.cxf:cxf-tools-wsdlto-core:2.0-incubator-RC-SNAPSHOT: checking for updates from apache-incubator
[INFO] snapshot org.apache.cxf:cxf-tools-wsdlto-core:2.0-incubator-RC-SNAPSHOT: checking for updates from apache-snapshots
[INFO] snapshot org.apache.cxf:cxf-tools-wsdlto-core:2.0-incubator-RC-SNAPSHOT: checking for updates from java.net
[INFO] snapshot org.apache.cxf:cxf-tools-wsdlto-core:2.0-incubator-RC-SNAPSHOT: checking for updates from apache.snapshots
[INFO] snapshot org.apache.cxf:cxf-tools-validator:2.0-incubator-RC-SNAPSHOT: checking for updates from apache-incubator
[INFO] snapshot org.apache.cxf:cxf-tools-validator:2.0-incubator-RC-SNAPSHOT: checking for updates from apache-snapshots
[INFO] snapshot org.apache.cxf:cxf-tools-validator:2.0-incubator-RC-SNAPSHOT: checking for updates from java.net
[INFO] snapshot org.apache.cxf:cxf-tools-validator:2.0-incubator-RC-SNAPSHOT: checking for updates from apache.snapshots
[INFO] snapshot org.apache.cxf:cxf-tools-wsdlto-frontend-jaxws:2.0-incubator-RC-SNAPSHOT: checking for updates from apache-incubator
[INFO] snapshot org.apache.cxf:cxf-tools-wsdlto-frontend-jaxws:2.0-incubator-RC-SNAPSHOT: checking for updates from apache-snapshots
[INFO] snapshot org.apache.cxf:cxf-tools-wsdlto-frontend-jaxws:2.0-incubator-RC-SNAPSHOT: checking for updates from java.net
[INFO] snapshot org.apache.cxf:cxf-tools-wsdlto-frontend-jaxws:2.0-incubator-RC-SNAPSHOT: checking for updates from apache.snapshots
[INFO] [cxf-codegen:wsdl2java {execution: generate-type-test-java-sources}]
Apr 16, 2007 7:03:43 AM org.apache.cxf.tools.wsdlto.core.PluginLoader loadPlugin
INFO: Loading plugin jar:file:/home/continuum/.m2/repository/org/apache/cxf/cxf-tools-wsdlto-frontend-jaxws/2.0-incubator-RC-SNAPSHOT/cxf-tools-wsdlto-frontend-jaxws-2.0-incubator-RC-SNAPSHOT.jar!/META-INF/tools-plugin.xml
Apr 16, 2007 7:03:43 AM org.apache.cxf.tools.wsdlto.core.PluginLoader loadPlugin
INFO: Found 1 frontends in <jaxws> plugin.
Apr 16, 2007 7:03:43 AM org.apache.cxf.tools.wsdlto.core.PluginLoader loadPlugin
INFO: Loading <jaxws> frontend from <jaxws> plugin.
Apr 16, 2007 7:03:43 AM org.apache.cxf.tools.wsdlto.core.PluginLoader loadPlugin
INFO: Loading plugin jar:file:/home/continuum/.m2/repository/org/apache/cxf/cxf-tools-wsdlto-databinding-jaxb/2.0-incubator-RC-SNAPSHOT/cxf-tools-wsdlto-databinding-jaxb-2.0-incubator-RC-SNAPSHOT.jar!/META-INF/tools-plugin.xml
Apr 16, 2007 7:03:43 AM org.apache.cxf.tools.wsdlto.core.PluginLoader loadPlugin
INFO: Found 1 databindings in <jaxb> plugin.
Apr 16, 2007 7:03:43 AM org.apache.cxf.tools.wsdlto.core.PluginLoader loadPlugin
INFO: Loading <jaxb> databinding from <jaxb> plugin.
Loading FrontEnd jaxws ...
Loading DataBinding jaxb ...
wsdl2java -d /x1/continuum/working-directory/214/target/generated/src/test/java -verbose /x1/continuum/working-directory/214/target/generated/src/test/resources/wsdl/type_test/type_test_corba.wsdl
wsdl2java - 2.0-incubator-RC-SNAPSHOT

Apr 16, 2007 7:03:44 AM org.springframework.context.support.AbstractApplicationContext refresh
INFO: Refreshing org.apache.cxf.bus.spring.BusApplicationContext@ec078b: display name [org.apache.cxf.bus.spring.BusApplicationContext@ec078b]; startup date [Mon Apr 16 07:03:44 PDT 2007]; root of context hierarchy
Apr 16, 2007 7:03:44 AM org.apache.cxf.bus.spring.BusApplicationContext getConfigResources
INFO: Could not find the configuration file cxf.xml on the classpath.
Apr 16, 2007 7:03:45 AM org.springframework.beans.factory.xml.XmlBeanDefinitionReader loadBeanDefinitions
INFO: Loading XML bean definitions from class path resource [META-INF/cxf/cxf.xml]
Apr 16, 2007 7:03:45 AM org.springframework.beans.factory.xml.XmlBeanDefinitionReader loadBeanDefinitions
INFO: Loading XML bean definitions from URL [jar:file:/home/continuum/.m2/repository/org/apache/cxf/cxf-api/2.0-incubator-RC-SNAPSHOT/cxf-api-2.0-incubator-RC-SNAPSHOT.jar!/META-INF/cxf/cxf-property-editors.xml]
Apr 16, 2007 7:03:45 AM org.springframework.context.support.AbstractApplicationContext refresh
INFO: Bean factory for application context [org.apache.cxf.bus.spring.BusApplicationContext@ec078b]: org.springframework.beans.factory.support.DefaultListableBeanFactory@50867d
Apr 16, 2007 7:03:45 AM org.springframework.context.support.AbstractApplicationContext$BeanPostProcessorChecker postProcessAfterInitialization
INFO: Bean 'org.apache.cxf.bus.spring.Jsr250BeanPostProcessor' is not eligible for getting processed by all BeanPostProcessors (for example: not eligible for auto-proxying)
Apr 16, 2007 7:03:45 AM org.springframework.context.support.AbstractApplicationContext$BeanPostProcessorChecker postProcessAfterInitialization
INFO: Bean 'cxf' is not eligible for getting processed by all BeanPostProcessors (for example: not eligible for auto-proxying)
Apr 16, 2007 7:03:45 AM org.springframework.context.support.AbstractApplicationContext$BeanPostProcessorChecker postProcessAfterInitialization
INFO: Bean 'org.apache.cxf.bus.spring.BusExtensionPostProcessor' is not eligible for getting processed by all BeanPostProcessors (for example: not eligible for auto-proxying)
Apr 16, 2007 7:03:45 AM org.springframework.beans.factory.support.DefaultListableBeanFactory preInstantiateSingletons
INFO: Pre-instantiating singletons in org.springframework.beans.factory.support.DefaultListableBeanFactory@50867d: defining beans [cxf,org.apache.cxf.bus.spring.Jsr250BeanPostProcessor,org.apache.cxf.bus.spring.BusExtensionPostProcessor,org.apache.cxf.resource.ResourceManager,org.apache.cxf.binding.BindingFactoryManager,org.apache.cxf.transport.DestinationFactoryManager,org.apache.cxf.transport.ConduitInitiatorManager,org.apache.cxf.wsdl.WSDLManager,org.apache.cxf.phase.PhaseManager,org.apache.cxf.workqueue.WorkQueueManager,org.apache.cxf.buslifecycle.BusLifeCycleManager,org.apache.cxf.endpoint.ServerRegistry,org.apache.cxf.endpoint.ServerLifeCycleManager,org.apache.cxf.transports.http.QueryHandlerRegistry,org.apache.cxf.endpoint.EndpointResolverRegistry,org.apache.cxf.configuration.security.customEditorConfigurer]; root of factory hierarchy
[INFO] [cxf-codegen:wsdl2java {execution: generate-corba-type-test-java-sources}]
Loading FrontEnd jaxws ...
Loading DataBinding jaxb ...
wsdl2java -d /x1/continuum/working-directory/214/target/generated/src/test/java -verbose /x1/continuum/working-directory/214/target/generated/src/test/resources/wsdl/type_test/idltowsdl_type_test.wsdl
wsdl2java - 2.0-incubator-RC-SNAPSHOT

[INFO] [cxf-codegen:wsdl2java {execution: generate-corba-object-reference-test-java-sources}]
Loading FrontEnd jaxws ...
Loading DataBinding jaxb ...
wsdl2java -d /x1/continuum/working-directory/214/target/generated/src/test/java -verbose /x1/continuum/working-directory/214/src/test/resources/wsdl/ObjectRef.wsdl
wsdl2java - 2.0-incubator-RC-SNAPSHOT

[INFO] [cxf-codegen:wsdl2java {execution: generate-corba-system-exception-test-java-sources}]
Loading FrontEnd jaxws ...
Loading DataBinding jaxb ...
wsdl2java -d /x1/continuum/working-directory/214/target/generated/src/test/java -verbose /x1/continuum/working-directory/214/src/test/resources/wsdl/SystemEx.wsdl
wsdl2java - 2.0-incubator-RC-SNAPSHOT

[INFO] [compiler:testCompile]
[INFO] Compiling 305 source files to /x1/continuum/working-directory/214/target/test-classes
[WARNING] /x1/continuum/working-directory/214/src/test/java/org/apache/yoko/bindings/corba/interceptors/CorbaInInterceptorTest.java:[344,55] [unchecked] unchecked conversion
found   : java.util.List
required: java.util.List<org.apache.schemas.yoko.bindings.corba.ParamType>

[WARNING] /x1/continuum/working-directory/214/src/test/java/org/apache/yoko/bindings/corba/interceptors/CorbaInInterceptorTest.java:[394,46] [unchecked] unchecked conversion
found   : java.util.List
required: java.util.List<java.lang.Object>

[WARNING] /x1/continuum/working-directory/214/src/test/java/org/apache/yoko/bindings/corba/CorbaConduitTest.java:[201,56] [unchecked] unchecked conversion
found   : java.util.List
required: java.util.List<org.apache.yoko.bindings.corba.CorbaTypeMap>

[WARNING] /x1/continuum/working-directory/214/src/test/java/org/apache/yoko/bindings/corba/CorbaConduitTest.java:[203,65] [unchecked] unchecked conversion
found   : java.util.HashMap
required: java.util.Map<org.omg.CORBA.TypeCode,org.apache.schemas.yoko.bindings.corba.RaisesType>

[WARNING] /x1/continuum/working-directory/214/src/test/java/org/apache/yoko/bindings/corba/CorbaConduitTest.java:[204,52] [unchecked] unchecked conversion
found   : java.util.ArrayList
required: java.util.List<org.apache.schemas.yoko.bindings.corba.RaisesType>

[WARNING] /x1/continuum/working-directory/214/src/test/java/org/apache/yoko/bindings/corba/CorbaConduitTest.java:[225,52] [unchecked] unchecked conversion
found   : java.util.List
required: java.util.List<org.apache.yoko.bindings.corba.CorbaTypeMap>

[WARNING] /x1/continuum/working-directory/214/src/test/java/org/apache/yoko/bindings/corba/CorbaConduitTest.java:[226,56] [unchecked] unchecked conversion
found   : java.util.List
required: java.util.List<org.apache.yoko.bindings.corba.CorbaTypeMap>

[WARNING] /x1/continuum/working-directory/214/src/test/java/org/apache/yoko/bindings/corba/interceptors/CorbaOutInterceptorTest.java:[297,82] [unchecked] unchecked conversion
found   : org.apache.cxf.databinding.DataWriter
required: org.apache.cxf.databinding.DataWriter<javax.xml.stream.XMLEventWriter>

[INFO] [surefire:test]
[INFO] Setting reports dir: /x1/continuum/working-directory/214/target/surefire-reports

-------------------------------------------------------
 T E S T S
-------------------------------------------------------
[surefire] Running org.apache.yoko.bindings.corba.interceptors.CorbaInInterceptorTest
[surefire] Tests run: 6, Failures: 0, Errors: 0, Time elapsed: 12.361 sec
[surefire] 

[surefire] Running org.apache.yoko.bindings.corba.interceptors.CorbaOutInterceptorTest
[surefire] Tests run: 1, Failures: 0, Errors: 0, Time elapsed: 0.364 sec
[surefire] 

Initializing object reference support test...
Testing custom object reference as a parameter...
getTransportIdshttp://schemas.apache.org/yoko/bindings/corba
Testing default object reference as a parameter...
getTransportIdshttp://schemas.apache.org/yoko/bindings/corba
Testing custom object reference as a return value...
getTransportIdshttp://schemas.apache.org/yoko/bindings/corba
Apr 16, 2007 7:04:32 AM org.apache.yoko.bindings.corba.interceptors.CorbaFaultOutInterceptor handleMessage
SEVERE: CORBA marshal fault exception
java.lang.NullPointerException
	at org.apache.yoko.bindings.corba.interceptors.CorbaFaultOutInterceptor.handleMessage(CorbaFaultOutInterceptor.java:125)
	at org.apache.cxf.phase.PhaseInterceptorChain.doIntercept(PhaseInterceptorChain.java:159)
	at org.apache.cxf.interceptor.AbstractFaultChainInitiatorObserver.onMessage(AbstractFaultChainInitiatorObserver.java:78)
	at org.apache.cxf.phase.PhaseInterceptorChain.doIntercept(PhaseInterceptorChain.java:175)
	at org.apache.cxf.transport.ChainInitiationObserver.onMessage(ChainInitiationObserver.java:63)
	at org.apache.yoko.bindings.corba.runtime.CorbaDSIServant.invoke(CorbaDSIServant.java:108)
	at org.apache.yoko.orb.OBPortableServer.ServantDispatcher.dispatch(ServantDispatcher.java:225)
	at org.apache.yoko.orb.OBPortableServer.POA_impl._OB_dispatch(POA_impl.java:1607)
	at org.apache.yoko.orb.OB.DispatchRequest_impl.invoke(DispatchRequest_impl.java:56)
	at org.apache.yoko.orb.OB.DispatchSameThread_impl.dispatch(DispatchStrategyFactory_impl.java:53)
	at org.apache.yoko.orb.OB.Upcall.invoke(Upcall.java:360)
	at org.apache.yoko.orb.OB.GIOPConnectionThreaded.execReceive(GIOPConnectionThreaded.java:502)
	at org.apache.yoko.orb.OB.GIOPConnectionThreaded$ReceiverThread.run(GIOPConnectionThreaded.java:64)
org.apache.yoko.bindings.corba.CorbaBindingException: Error reading streamable value
	at org.apache.yoko.bindings.corba.runtime.CorbaStreamableImpl._read(CorbaStreamableImpl.java:51)
	at org.apache.yoko.orb.CORBA.Any.readValue(Any.java:94)
	at org.apache.yoko.orb.CORBA.Any.read_value(Any.java:472)
	at org.apache.yoko.orb.CORBA.Request.unmarshal(Request.java:161)
	at org.apache.yoko.orb.CORBA.Request.invoke(Request.java:293)
	at org.apache.yoko.bindings.corba.CorbaConduit.buildRequest(CorbaConduit.java:182)
	at org.apache.yoko.bindings.corba.CorbaConduit.close(CorbaConduit.java:122)
	at org.apache.cxf.interceptor.MessageSenderInterceptor$MessageSenderEndingInterceptor.handleMessage(MessageSenderInterceptor.java:79)
	at org.apache.cxf.phase.PhaseInterceptorChain.doIntercept(PhaseInterceptorChain.java:159)
	at org.apache.cxf.endpoint.ClientImpl.invoke(ClientImpl.java:231)
	at org.apache.cxf.frontend.ClientProxy.invokeSync(ClientProxy.java:73)
	at org.apache.cxf.jaxws.JaxWsClientProxy.invoke(JaxWsClientProxy.java:123)
	at $Proxy42.testCustomObjectReturn(Unknown Source)
	at org.apache.yoko.bindings.corba.CorbaObjectReferenceTest.testCustomObjectReturn(CorbaObjectReferenceTest.java:157)
	at sun.reflect.NativeMethodAccessorImpl.invoke0(Native Method)
	at sun.reflect.NativeMethodAccessorImpl.invoke(NativeMethodAccessorImpl.java:39)
	at sun.reflect.DelegatingMethodAccessorImpl.invoke(DelegatingMethodAccessorImpl.java:25)
	at java.lang.reflect.Method.invoke(Method.java:585)
	at junit.framework.TestCase.runTest(TestCase.java:164)
	at junit.framework.TestCase.runBare(TestCase.java:130)
	at junit.framework.TestResult$1.protect(TestResult.java:106)
	at junit.framework.TestResult.runProtected(TestResult.java:124)
	at junit.framework.TestResult.run(TestResult.java:109)
	at junit.framework.TestCase.run(TestCase.java:120)
	at junit.framework.TestSuite.runTest(TestSuite.java:230)
	at junit.framework.TestSuite.run(TestSuite.java:225)
	at sun.reflect.NativeMethodAccessorImpl.invoke0(Native Method)
	at sun.reflect.NativeMethodAccessorImpl.invoke(NativeMethodAccessorImpl.java:39)
	at sun.reflect.DelegatingMethodAccessorImpl.invoke(DelegatingMethodAccessorImpl.java:25)
	at java.lang.reflect.Method.invoke(Method.java:585)
	at org.apache.maven.surefire.battery.JUnitBattery.executeJUnit(JUnitBattery.java:242)
	at org.apache.maven.surefire.battery.JUnitBattery.execute(JUnitBattery.java:216)
	at org.apache.maven.surefire.Surefire.executeBattery(Surefire.java:215)
	at org.apache.maven.surefire.Surefire.run(Surefire.java:163)
	at org.apache.maven.surefire.Surefire.run(Surefire.java:87)
	at org.apache.maven.surefire.Surefire.run(Surefire.java:63)
	at sun.reflect.NativeMethodAccessorImpl.invoke0(Native Method)
	at sun.reflect.NativeMethodAccessorImpl.invoke(NativeMethodAccessorImpl.java:39)
	at sun.reflect.DelegatingMethodAccessorImpl.invoke(DelegatingMethodAccessorImpl.java:25)
	at java.lang.reflect.Method.invoke(Method.java:585)
	at org.apache.maven.surefire.SurefireBooter.main(SurefireBooter.java:785)
Caused by: org.omg.CORBA.MARSHAL: overflow while reading long:  vmcid: Apache minor code: 0x8  completed: No
	at org.apache.yoko.orb.CORBA.InputStream._OB_readLongUnchecked(InputStream.java:2056)
	at org.apache.yoko.orb.CORBA.InputStream.read_long(InputStream.java:1186)
	at org.apache.yoko.orb.CORBA.InputStream.read_ulong(InputStream.java:1190)
	at org.apache.yoko.orb.CORBA.InputStream.read_string(InputStream.java:1249)
	at org.omg.IOP.IORHelper.read(IORHelper.java:76)
	at org.apache.yoko.orb.CORBA.InputStream.read_Object(InputStream.java:1665)
	at org.apache.yoko.bindings.corba.runtime.CorbaObjectReader.readObjectReference(CorbaObjectReader.java:416)
	at org.apache.yoko.bindings.corba.runtime.CorbaObjectReader.read(CorbaObjectReader.java:140)
	at org.apache.yoko.bindings.corba.runtime.CorbaStreamableImpl._read(CorbaStreamableImpl.java:49)
	... 40 more
Apr 16, 2007 7:04:32 AM org.apache.yoko.bindings.corba.CorbaConduit close
SEVERE: Could not build the corba request
Testing default object reference as a return value...
Apr 16, 2007 7:04:35 AM org.apache.yoko.bindings.corba.interceptors.CorbaFaultOutInterceptor handleMessage
SEVERE: CORBA marshal fault exception
java.lang.NullPointerException
	at org.apache.yoko.bindings.corba.interceptors.CorbaFaultOutInterceptor.handleMessage(CorbaFaultOutInterceptor.java:125)
	at org.apache.cxf.phase.PhaseInterceptorChain.doIntercept(PhaseInterceptorChain.java:159)
	at org.apache.cxf.interceptor.AbstractFaultChainInitiatorObserver.onMessage(AbstractFaultChainInitiatorObserver.java:78)
	at org.apache.cxf.phase.PhaseInterceptorChain.doIntercept(PhaseInterceptorChain.java:175)
	at org.apache.cxf.transport.ChainInitiationObserver.onMessage(ChainInitiationObserver.java:63)
	at org.apache.yoko.bindings.corba.runtime.CorbaDSIServant.invoke(CorbaDSIServant.java:108)
	at org.apache.yoko.orb.OBPortableServer.ServantDispatcher.dispatch(ServantDispatcher.java:225)
	at org.apache.yoko.orb.OBPortableServer.POA_impl._OB_dispatch(POA_impl.java:1607)
getTransportIdshttp://schemas.apache.org/yoko/bindings/corba
	at org.apache.yoko.orb.OB.DispatchRequest_impl.invoke(DispatchRequest_impl.java:56)
	at org.apache.yoko.orb.OB.DispatchSameThread_impl.dispatch(DispatchStrategyFactory_impl.java:53)
	at org.apache.yoko.orb.OB.Upcall.invoke(Upcall.java:360)
	at org.apache.yoko.orb.OB.GIOPConnectionThreaded.execReceive(GIOPConnectionThreaded.java:502)
	at org.apache.yoko.orb.OB.GIOPConnectionThreaded$ReceiverThread.run(GIOPConnectionThreaded.java:64)
org.apache.yoko.bindings.corba.CorbaBindingException: Error reading streamable value
	at org.apache.yoko.bindings.corba.runtime.CorbaStreamableImpl._read(CorbaStreamableImpl.java:51)
	at org.apache.yoko.orb.CORBA.Any.readValue(Any.java:94)
	at org.apache.yoko.orb.CORBA.Any.read_value(Any.java:472)
	at org.apache.yoko.orb.CORBA.Request.unmarshal(Request.java:161)
	at org.apache.yoko.orb.CORBA.Request.invoke(Request.java:293)
	at org.apache.yoko.bindings.corba.CorbaConduit.buildRequest(CorbaConduit.java:182)
	at org.apache.yoko.bindings.corba.CorbaConduit.close(CorbaConduit.java:122)
	at org.apache.cxf.interceptor.MessageSenderInterceptor$MessageSenderEndingInterceptor.handleMessage(MessageSenderInterceptor.java:79)
	at org.apache.cxf.phase.PhaseInterceptorChain.doIntercept(PhaseInterceptorChain.java:159)
	at org.apache.cxf.endpoint.ClientImpl.invoke(ClientImpl.java:231)
	at org.apache.cxf.frontend.ClientProxy.invokeSync(ClientProxy.java:73)
	at org.apache.cxf.jaxws.JaxWsClientProxy.invoke(JaxWsClientProxy.java:123)
	at $Proxy42.testDefaultObjectReturn(Unknown Source)
	at org.apache.yoko.bindings.corba.CorbaObjectReferenceTest.testDefaultObjectReturn(CorbaObjectReferenceTest.java:179)
	at sun.reflect.NativeMethodAccessorImpl.invoke0(Native Method)
	at sun.reflect.NativeMethodAccessorImpl.invoke(NativeMethodAccessorImpl.java:39)
	at sun.reflect.DelegatingMethodAccessorImpl.invoke(DelegatingMethodAccessorImpl.java:25)
	at java.lang.reflect.Method.invoke(Method.java:585)
	at junit.framework.TestCase.runTest(TestCase.java:164)
	at junit.framework.TestCase.runBare(TestCase.java:130)
	at junit.framework.TestResult$1.protect(TestResult.java:106)
	at junit.framework.TestResult.runProtected(TestResult.java:124)
	at junit.framework.TestResult.run(TestResult.java:109)
	at junit.framework.TestCase.run(TestCase.java:120)
	at junit.framework.TestSuite.runTest(TestSuite.java:230)
	at junit.framework.TestSuite.run(TestSuite.java:225)
	at sun.reflect.NativeMethodAccessorImpl.invoke0(Native Method)
	at sun.reflect.NativeMethodAccessorImpl.invoke(NativeMethodAccessorImpl.java:39)
	at sun.reflect.DelegatingMethodAccessorImpl.invoke(DelegatingMethodAccessorImpl.java:25)
	at java.lang.reflect.Method.invoke(Method.java:585)
	at org.apache.maven.surefire.battery.JUnitBattery.executeJUnit(JUnitBattery.java:242)
	at org.apache.maven.surefire.battery.JUnitBattery.execute(JUnitBattery.java:216)
	at org.apache.maven.surefire.Surefire.executeBattery(Surefire.java:215)
	at org.apache.maven.surefire.Surefire.run(Surefire.java:163)
	at org.apache.maven.surefire.Surefire.run(Surefire.java:87)
	at org.apache.maven.surefire.Surefire.run(Surefire.java:63)
	at sun.reflect.NativeMethodAccessorImpl.invoke0(Native Method)
	at sun.reflect.NativeMethodAccessorImpl.invoke(NativeMethodAccessorImpl.java:39)
	at sun.reflect.DelegatingMethodAccessorImpl.invoke(DelegatingMethodAccessorImpl.java:25)
	at java.lang.reflect.Method.invoke(Method.java:585)
	at org.apache.maven.surefire.SurefireBooter.main(SurefireBooter.java:785)
Caused by: org.omg.CORBA.MARSHAL: overflow while reading long:  vmcid: Apache minor code: 0x8  completed: No
	at org.apache.yoko.orb.CORBA.InputStream._OB_readLongUnchecked(InputStream.java:2056)
	at org.apache.yoko.orb.CORBA.InputStream.read_long(InputStream.java:1186)
	at org.apache.yoko.orb.CORBA.InputStream.read_ulong(InputStream.java:1190)
	at org.apache.yoko.orb.CORBA.InputStream.read_string(InputStream.java:1249)
	at org.omg.IOP.IORHelper.read(IORHelper.java:76)
	at org.apache.yoko.orb.CORBA.InputStream.read_Object(InputStream.java:1665)
	at org.apache.yoko.bindings.corba.runtime.CorbaObjectReader.readObjectReference(CorbaObjectReader.java:416)
	at org.apache.yoko.bindings.corba.runtime.CorbaObjectReader.read(CorbaObjectReader.java:140)
	at org.apache.yoko.bindings.corba.runtime.CorbaStreamableImpl._read(CorbaStreamableImpl.java:49)
	... 40 more
Apr 16, 2007 7:04:35 AM org.apache.yoko.bindings.corba.CorbaConduit close
SEVERE: Could not build the corba request
[surefire] Running org.apache.yoko.bindings.corba.CorbaObjectReferenceTest
[surefire] Tests run: 4, Failures: 0, Errors: 4, Time elapsed: 20.365 sec
[surefire] 
[surefire] testCustomObjectParam(org.apache.yoko.bindings.corba.CorbaObjectReferenceTest)  Time elapsed: 9.871 sec  <<< ERROR!
java.lang.NullPointerException
	at org.apache.yoko.bindings.corba.CorbaDestination.<init>(CorbaDestination.java:65)
	at org.apache.yoko.bindings.corba.CorbaBindingFactory.getDestination(CorbaBindingFactory.java:136)
	at org.apache.cxf.binding.soap.SoapTransportFactory.getDestination(SoapTransportFactory.java:74)
	at org.apache.cxf.endpoint.ServerImpl.<init>(ServerImpl.java:77)
	at org.apache.cxf.frontend.ServerFactoryBean.create(ServerFactoryBean.java:86)
	at org.apache.cxf.jaxws.EndpointImpl.doPublish(EndpointImpl.java:301)
	at org.apache.cxf.jaxws.EndpointImpl.publish(EndpointImpl.java:200)
	at org.apache.cxf.jaxws.spi.ProviderImpl.createAndPublishEndpoint(ProviderImpl.java:74)
	at javax.xml.ws.Endpoint.publish(Endpoint.java:156)
	at org.apache.yoko.bindings.corba.CorbaObjectReferenceTest.createEndpointReferenceType(CorbaObjectReferenceTest.java:211)
	at org.apache.yoko.bindings.corba.CorbaObjectReferenceTest.testCustomObjectParam(CorbaObjectReferenceTest.java:140)
	at sun.reflect.NativeMethodAccessorImpl.invoke0(Native Method)
	at sun.reflect.NativeMethodAccessorImpl.invoke(NativeMethodAccessorImpl.java:39)
	at sun.reflect.DelegatingMethodAccessorImpl.invoke(DelegatingMethodAccessorImpl.java:25)
	at java.lang.reflect.Method.invoke(Method.java:585)
	at junit.framework.TestCase.runTest(TestCase.java:164)
	at junit.framework.TestCase.runBare(TestCase.java:130)
	at junit.framework.TestResult$1.protect(TestResult.java:106)
	at junit.framework.TestResult.runProtected(TestResult.java:124)
	at junit.framework.TestResult.run(TestResult.java:109)
	at junit.framework.TestCase.run(TestCase.java:120)
	at junit.framework.TestSuite.runTest(TestSuite.java:230)
	at junit.framework.TestSuite.run(TestSuite.java:225)
	at sun.reflect.NativeMethodAccessorImpl.invoke0(Native Method)
	at sun.reflect.NativeMethodAccessorImpl.invoke(NativeMethodAccessorImpl.java:39)
	at sun.reflect.DelegatingMethodAccessorImpl.invoke(DelegatingMethodAccessorImpl.java:25)
	at java.lang.reflect.Method.invoke(Method.java:585)
	at org.apache.maven.surefire.battery.JUnitBattery.executeJUnit(JUnitBattery.java:242)
	at org.apache.maven.surefire.battery.JUnitBattery.execute(JUnitBattery.java:216)
	at org.apache.maven.surefire.Surefire.executeBattery(Surefire.java:215)
	at org.apache.maven.surefire.Surefire.run(Surefire.java:163)
	at org.apache.maven.surefire.Surefire.run(Surefire.java:87)
	at org.apache.maven.surefire.Surefire.run(Surefire.java:63)
	at sun.reflect.NativeMethodAccessorImpl.invoke0(Native Method)
	at sun.reflect.NativeMethodAccessorImpl.invoke(NativeMethodAccessorImpl.java:39)
	at sun.reflect.DelegatingMethodAccessorImpl.invoke(DelegatingMethodAccessorImpl.java:25)
	at java.lang.reflect.Method.invoke(Method.java:585)
	at org.apache.maven.surefire.SurefireBooter.main(SurefireBooter.java:785)

[surefire] testDefaultObjectParam(org.apache.yoko.bindings.corba.CorbaObjectReferenceTest)  Time elapsed: 3.22 sec  <<< ERROR!
java.lang.NullPointerException
	at org.apache.yoko.bindings.corba.CorbaDestination.<init>(CorbaDestination.java:65)
	at org.apache.yoko.bindings.corba.CorbaBindingFactory.getDestination(CorbaBindingFactory.java:136)
	at org.apache.cxf.binding.soap.SoapTransportFactory.getDestination(SoapTransportFactory.java:74)
	at org.apache.cxf.endpoint.ServerImpl.<init>(ServerImpl.java:77)
	at org.apache.cxf.frontend.ServerFactoryBean.create(ServerFactoryBean.java:86)
	at org.apache.cxf.jaxws.EndpointImpl.doPublish(EndpointImpl.java:301)
	at org.apache.cxf.jaxws.EndpointImpl.publish(EndpointImpl.java:200)
	at org.apache.cxf.jaxws.spi.ProviderImpl.createAndPublishEndpoint(ProviderImpl.java:74)
	at javax.xml.ws.Endpoint.publish(Endpoint.java:156)
	at org.apache.yoko.bindings.corba.CorbaObjectReferenceTest.createEndpointReferenceType(CorbaObjectReferenceTest.java:211)
	at org.apache.yoko.bindings.corba.CorbaObjectReferenceTest.testDefaultObjectParam(CorbaObjectReferenceTest.java:149)
	at sun.reflect.NativeMethodAccessorImpl.invoke0(Native Method)
	at sun.reflect.NativeMethodAccessorImpl.invoke(NativeMethodAccessorImpl.java:39)
	at sun.reflect.DelegatingMethodAccessorImpl.invoke(DelegatingMethodAccessorImpl.java:25)
	at java.lang.reflect.Method.invoke(Method.java:585)
	at junit.framework.TestCase.runTest(TestCase.java:164)
	at junit.framework.TestCase.runBare(TestCase.java:130)
	at junit.framework.TestResult$1.protect(TestResult.java:106)
	at junit.framework.TestResult.runProtected(TestResult.java:124)
	at junit.framework.TestResult.run(TestResult.java:109)
	at junit.framework.TestCase.run(TestCase.java:120)
	at junit.framework.TestSuite.runTest(TestSuite.java:230)
	at junit.framework.TestSuite.run(TestSuite.java:225)
	at sun.reflect.NativeMethodAccessorImpl.invoke0(Native Method)
	at sun.reflect.NativeMethodAccessorImpl.invoke(NativeMethodAccessorImpl.java:39)
	at sun.reflect.DelegatingMethodAccessorImpl.invoke(DelegatingMethodAccessorImpl.java:25)
	at java.lang.reflect.Method.invoke(Method.java:585)
	at org.apache.maven.surefire.battery.JUnitBattery.executeJUnit(JUnitBattery.java:242)
	at org.apache.maven.surefire.battery.JUnitBattery.execute(JUnitBattery.java:216)
	at org.apache.maven.surefire.Surefire.executeBattery(Surefire.java:215)
	at org.apache.maven.surefire.Surefire.run(Surefire.java:163)
	at org.apache.maven.surefire.Surefire.run(Surefire.java:87)
	at org.apache.maven.surefire.Surefire.run(Surefire.java:63)
	at sun.reflect.NativeMethodAccessorImpl.invoke0(Native Method)
	at sun.reflect.NativeMethodAccessorImpl.invoke(NativeMethodAccessorImpl.java:39)
	at sun.reflect.DelegatingMethodAccessorImpl.invoke(DelegatingMethodAccessorImpl.java:25)
	at java.lang.reflect.Method.invoke(Method.java:585)
	at org.apache.maven.surefire.SurefireBooter.main(SurefireBooter.java:785)

[surefire] testCustomObjectReturn(org.apache.yoko.bindings.corba.CorbaObjectReferenceTest)  Time elapsed: 3.98 sec  <<< ERROR!
org.apache.yoko.bindings.corba.CorbaBindingException: org.apache.yoko.bindings.corba.CorbaBindingException: Error reading streamable value
	at org.apache.yoko.bindings.corba.CorbaConduit.close(CorbaConduit.java:127)
	at org.apache.cxf.interceptor.MessageSenderInterceptor$MessageSenderEndingInterceptor.handleMessage(MessageSenderInterceptor.java:79)
	at org.apache.cxf.phase.PhaseInterceptorChain.doIntercept(PhaseInterceptorChain.java:159)
	at org.apache.cxf.endpoint.ClientImpl.invoke(ClientImpl.java:231)
	at org.apache.cxf.frontend.ClientProxy.invokeSync(ClientProxy.java:73)
	at org.apache.cxf.jaxws.JaxWsClientProxy.invoke(JaxWsClientProxy.java:123)
	at $Proxy42.testCustomObjectReturn(Unknown Source)
	at org.apache.yoko.bindings.corba.CorbaObjectReferenceTest.testCustomObjectReturn(CorbaObjectReferenceTest.java:157)
	at sun.reflect.NativeMethodAccessorImpl.invoke0(Native Method)
	at sun.reflect.NativeMethodAccessorImpl.invoke(NativeMethodAccessorImpl.java:39)
	at sun.reflect.DelegatingMethodAccessorImpl.invoke(DelegatingMethodAccessorImpl.java:25)
	at java.lang.reflect.Method.invoke(Method.java:585)
	at junit.framework.TestCase.runTest(TestCase.java:164)
	at junit.framework.TestCase.runBare(TestCase.java:130)
	at junit.framework.TestResult$1.protect(TestResult.java:106)
	at junit.framework.TestResult.runProtected(TestResult.java:124)
	at junit.framework.TestResult.run(TestResult.java:109)
	at junit.framework.TestCase.run(TestCase.java:120)
	at junit.framework.TestSuite.runTest(TestSuite.java:230)
	at junit.framework.TestSuite.run(TestSuite.java:225)
	at sun.reflect.NativeMethodAccessorImpl.invoke0(Native Method)
	at sun.reflect.NativeMethodAccessorImpl.invoke(NativeMethodAccessorImpl.java:39)
	at sun.reflect.DelegatingMethodAccessorImpl.invoke(DelegatingMethodAccessorImpl.java:25)
	at java.lang.reflect.Method.invoke(Method.java:585)
	at org.apache.maven.surefire.battery.JUnitBattery.executeJUnit(JUnitBattery.java:242)
	at org.apache.maven.surefire.battery.JUnitBattery.execute(JUnitBattery.java:216)
	at org.apache.maven.surefire.Surefire.executeBattery(Surefire.java:215)
	at org.apache.maven.surefire.Surefire.run(Surefire.java:163)
	at org.apache.maven.surefire.Surefire.run(Surefire.java:87)
	at org.apache.maven.surefire.Surefire.run(Surefire.java:63)
	at sun.reflect.NativeMethodAccessorImpl.invoke0(Native Method)
	at sun.reflect.NativeMethodAccessorImpl.invoke(NativeMethodAccessorImpl.java:39)
	at sun.reflect.DelegatingMethodAccessorImpl.invoke(DelegatingMethodAccessorImpl.java:25)
	at java.lang.reflect.Method.invoke(Method.java:585)
	at org.apache.maven.surefire.SurefireBooter.main(SurefireBooter.java:785)
Caused by: org.apache.yoko.bindings.corba.CorbaBindingException: Error reading streamable value
	at org.apache.yoko.bindings.corba.runtime.CorbaStreamableImpl._read(CorbaStreamableImpl.java:51)
	at org.apache.yoko.orb.CORBA.Any.readValue(Any.java:94)
	at org.apache.yoko.orb.CORBA.Any.read_value(Any.java:472)
	at org.apache.yoko.orb.CORBA.Request.unmarshal(Request.java:161)
	at org.apache.yoko.orb.CORBA.Request.invoke(Request.java:293)
	at org.apache.yoko.bindings.corba.CorbaConduit.buildRequest(CorbaConduit.java:182)
	at org.apache.yoko.bindings.corba.CorbaConduit.close(CorbaConduit.java:122)
	... 34 more
Caused by: org.omg.CORBA.MARSHAL: overflow while reading long:  vmcid: Apache minor code: 0x8  completed: No
	at org.apache.yoko.orb.CORBA.InputStream._OB_readLongUnchecked(InputStream.java:2056)
	at org.apache.yoko.orb.CORBA.InputStream.read_long(InputStream.java:1186)
	at org.apache.yoko.orb.CORBA.InputStream.read_ulong(InputStream.java:1190)
	at org.apache.yoko.orb.CORBA.InputStream.read_string(InputStream.java:1249)
	at org.omg.IOP.IORHelper.read(IORHelper.java:76)
	at org.apache.yoko.orb.CORBA.InputStream.read_Object(InputStream.java:1665)
	at org.apache.yoko.bindings.corba.runtime.CorbaObjectReader.readObjectReference(CorbaObjectReader.java:416)
	at org.apache.yoko.bindings.corba.runtime.CorbaObjectReader.read(CorbaObjectReader.java:140)
	at org.apache.yoko.bindings.corba.runtime.CorbaStreamableImpl._read(CorbaStreamableImpl.java:49)
	... 40 more

[surefire] testDefaultObjectReturn(org.apache.yoko.bindings.corba.CorbaObjectReferenceTest)  Time elapsed: 3.204 sec  <<< ERROR!
org.apache.yoko.bindings.corba.CorbaBindingException: org.apache.yoko.bindings.corba.CorbaBindingException: Error reading streamable value
	at org.apache.yoko.bindings.corba.CorbaConduit.close(CorbaConduit.java:127)
	at org.apache.cxf.interceptor.MessageSenderInterceptor$MessageSenderEndingInterceptor.handleMessage(MessageSenderInterceptor.java:79)
	at org.apache.cxf.phase.PhaseInterceptorChain.doIntercept(PhaseInterceptorChain.java:159)
	at org.apache.cxf.endpoint.ClientImpl.invoke(ClientImpl.java:231)
	at org.apache.cxf.frontend.ClientProxy.invokeSync(ClientProxy.java:73)
	at org.apache.cxf.jaxws.JaxWsClientProxy.invoke(JaxWsClientProxy.java:123)
	at $Proxy42.testDefaultObjectReturn(Unknown Source)
	at org.apache.yoko.bindings.corba.CorbaObjectReferenceTest.testDefaultObjectReturn(CorbaObjectReferenceTest.java:179)
	at sun.reflect.NativeMethodAccessorImpl.invoke0(Native Method)
	at sun.reflect.NativeMethodAccessorImpl.invoke(NativeMethodAccessorImpl.java:39)
	at sun.reflect.DelegatingMethodAccessorImpl.invoke(DelegatingMethodAccessorImpl.java:25)
	at java.lang.reflect.Method.invoke(Method.java:585)
	at junit.framework.TestCase.runTest(TestCase.java:164)
	at junit.framework.TestCase.runBare(TestCase.java:130)
	at junit.framework.TestResult$1.protect(TestResult.java:106)
	at junit.framework.TestResult.runProtected(TestResult.java:124)
	at junit.framework.TestResult.run(TestResult.java:109)
	at junit.framework.TestCase.run(TestCase.java:120)
	at junit.framework.TestSuite.runTest(TestSuite.java:230)
	at junit.framework.TestSuite.run(TestSuite.java:225)
	at sun.reflect.NativeMethodAccessorImpl.invoke0(Native Method)
	at sun.reflect.NativeMethodAccessorImpl.invoke(NativeMethodAccessorImpl.java:39)
	at sun.reflect.DelegatingMethodAccessorImpl.invoke(DelegatingMethodAccessorImpl.java:25)
	at java.lang.reflect.Method.invoke(Method.java:585)
	at org.apache.maven.surefire.battery.JUnitBattery.executeJUnit(JUnitBattery.java:242)
	at org.apache.maven.surefire.battery.JUnitBattery.execute(JUnitBattery.java:216)
	at org.apache.maven.surefire.Surefire.executeBattery(Surefire.java:215)
	at org.apache.maven.surefire.Surefire.run(Surefire.java:163)
	at org.apache.maven.surefire.Surefire.run(Surefire.java:87)
	at org.apache.maven.surefire.Surefire.run(Surefire.java:63)
	at sun.reflect.NativeMethodAccessorImpl.invoke0(Native Method)
	at sun.reflect.NativeMethodAccessorImpl.invoke(NativeMethodAccessorImpl.java:39)
	at sun.reflect.DelegatingMethodAccessorImpl.invoke(DelegatingMethodAccessorImpl.java:25)
	at java.lang.reflect.Method.invoke(Method.java:585)
	at org.apache.maven.surefire.SurefireBooter.main(SurefireBooter.java:785)
Caused by: org.apache.yoko.bindings.corba.CorbaBindingException: Error reading streamable value
	at org.apache.yoko.bindings.corba.runtime.CorbaStreamableImpl._read(CorbaStreamableImpl.java:51)
	at org.apache.yoko.orb.CORBA.Any.readValue(Any.java:94)
	at org.apache.yoko.orb.CORBA.Any.read_value(Any.java:472)
	at org.apache.yoko.orb.CORBA.Request.unmarshal(Request.java:161)
	at org.apache.yoko.orb.CORBA.Request.invoke(Request.java:293)
	at org.apache.yoko.bindings.corba.CorbaConduit.buildRequest(CorbaConduit.java:182)
	at org.apache.yoko.bindings.corba.CorbaConduit.close(CorbaConduit.java:122)
	... 34 more
Caused by: org.omg.CORBA.MARSHAL: overflow while reading long:  vmcid: Apache minor code: 0x8  completed: No
	at org.apache.yoko.orb.CORBA.InputStream._OB_readLongUnchecked(InputStream.java:2056)
	at org.apache.yoko.orb.CORBA.InputStream.read_long(InputStream.java:1186)
	at org.apache.yoko.orb.CORBA.InputStream.read_ulong(InputStream.java:1190)
	at org.apache.yoko.orb.CORBA.InputStream.read_string(InputStream.java:1249)
	at org.omg.IOP.IORHelper.read(IORHelper.java:76)
	at org.apache.yoko.orb.CORBA.InputStream.read_Object(InputStream.java:1665)
	at org.apache.yoko.bindings.corba.runtime.CorbaObjectReader.readObjectReference(CorbaObjectReader.java:416)
	at org.apache.yoko.bindings.corba.runtime.CorbaObjectReader.read(CorbaObjectReader.java:140)
	at org.apache.yoko.bindings.corba.runtime.CorbaStreamableImpl._read(CorbaStreamableImpl.java:49)
	... 40 more


[surefire] Running org.apache.yoko.bindings.corba.types.CorbaArrayHandlerTest
[surefire] Tests run: 1, Failures: 0, Errors: 0, Time elapsed: 0.004 sec
[surefire] 

[surefire] Running org.apache.yoko.bindings.corba.types.CorbaAnyHandlerTest
[surefire] Tests run: 3, Failures: 0, Errors: 0, Time elapsed: 0.01 sec
[surefire] 

[surefire] Running org.apache.yoko.bindings.corba.types.CorbaPrimitiveHandlerTest
[surefire] Tests run: 14, Failures: 0, Errors: 0, Time elapsed: 0.109 sec
[surefire] 

[surefire] Running org.apache.yoko.bindings.corba.types.CorbaHandlerUtilsTest
[surefire] Tests run: 2, Failures: 0, Errors: 0, Time elapsed: 1.83 sec
[surefire] 

[surefire] Running org.apache.yoko.bindings.corba.types.CorbaEnumHandlerTest
[surefire] Tests run: 1, Failures: 0, Errors: 0, Time elapsed: 0.004 sec
[surefire] 

[surefire] Running org.apache.yoko.bindings.corba.types.CorbaObjectHandlerTest
[surefire] Tests run: 2, Failures: 0, Errors: 0, Time elapsed: 0.01 sec
[surefire] 

[surefire] Running org.apache.yoko.bindings.corba.types.CorbaSequenceHandlerTest
[surefire] Tests run: 1, Failures: 0, Errors: 0, Time elapsed: 0.003 sec
[surefire] 

[surefire] Running org.apache.yoko.bindings.corba.types.CorbaFixedHandlerTest
[surefire] Tests run: 1, Failures: 0, Errors: 0, Time elapsed: 0.003 sec
[surefire] 

[surefire] Running org.apache.yoko.bindings.corba.types.CorbaStructHandlerTest
[surefire] Tests run: 1, Failures: 0, Errors: 0, Time elapsed: 0.005 sec
[surefire] 

[surefire] Running org.apache.yoko.bindings.corba.runtime.CorbaStreamableTest
[surefire] Tests run: 5, Failures: 0, Errors: 0, Time elapsed: 0.015 sec
[surefire] 

[surefire] Running org.apache.yoko.bindings.corba.runtime.CorbaObjectWriterTest
[surefire] Tests run: 18, Failures: 0, Errors: 0, Time elapsed: 0.049 sec
[surefire] 

[surefire] Running org.apache.yoko.bindings.corba.runtime.CorbaStaxObjectTest
[surefire] Tests run: 7, Failures: 0, Errors: 0, Time elapsed: 1.669 sec
[surefire] 

Test OnMessage in TestObserver
[surefire] Running org.apache.yoko.bindings.corba.runtime.CorbaDSIServantTest
[surefire] Tests run: 1, Failures: 0, Errors: 0, Time elapsed: 0.046 sec
[surefire] 

[surefire] Running org.apache.yoko.bindings.corba.runtime.CorbaObjectReaderTest
[surefire] Tests run: 21, Failures: 0, Errors: 0, Time elapsed: 0.061 sec
[surefire] 

[surefire] Running org.apache.yoko.bindings.corba.CorbaTypeMapTest
[surefire] Tests run: 1, Failures: 0, Errors: 0, Time elapsed: 0.003 sec
[surefire] 

[surefire] Running org.apache.yoko.bindings.corba.IdlToWsdlTypeTest
[surefire] Tests run: 22, Failures: 0, Errors: 0, Time elapsed: 20.364 sec
[surefire] 

org.omg.CORBA.COMM_FAILURE:  vmcid: 0x0 minor code: 0x0  completed: No
	at org.apache.yoko.orb.OB.Util.unmarshalSystemException(Util.java:117)
	at org.apache.yoko.orb.CORBA.ServerRequest._OB_doMarshal(ServerRequest.java:197)
	at org.apache.yoko.orb.OBPortableServer.ServantDispatcher.dispatch(ServantDispatcher.java:228)
	at org.apache.yoko.orb.OBPortableServer.POA_impl._OB_dispatch(POA_impl.java:1607)
	at org.apache.yoko.orb.OB.DispatchRequest_impl.invoke(DispatchRequest_impl.java:56)
	at org.apache.yoko.orb.OB.DispatchSameThread_impl.dispatch(DispatchStrategyFactory_impl.java:53)
	at org.apache.yoko.orb.OB.Upcall.invoke(Upcall.java:360)
	at org.apache.yoko.orb.OB.GIOPConnectionThreaded.execReceive(GIOPConnectionThreaded.java:502)
	at org.apache.yoko.orb.OB.GIOPConnectionThreaded$ReceiverThread.run(GIOPConnectionThreaded.java:64)
org.omg.CORBA.TRANSIENT:  vmcid: 0x0 minor code: 0x0  completed: No
	at org.apache.yoko.orb.OB.Util.unmarshalSystemException(Util.java:149)
	at org.apache.yoko.orb.CORBA.ServerRequest._OB_doMarshal(ServerRequest.java:197)
	at org.apache.yoko.orb.OBPortableServer.ServantDispatcher.dispatch(ServantDispatcher.java:228)
	at org.apache.yoko.orb.OBPortableServer.POA_impl._OB_dispatch(POA_impl.java:1607)
	at org.apache.yoko.orb.OB.DispatchRequest_impl.invoke(DispatchRequest_impl.java:56)
	at org.apache.yoko.orb.OB.DispatchSameThread_impl.dispatch(DispatchStrategyFactory_impl.java:53)
	at org.apache.yoko.orb.OB.Upcall.invoke(Upcall.java:360)
	at org.apache.yoko.orb.OB.GIOPConnectionThreaded.execReceive(GIOPConnectionThreaded.java:502)
	at org.apache.yoko.orb.OB.GIOPConnectionThreaded$ReceiverThread.run(GIOPConnectionThreaded.java:64)
org.omg.CORBA.NO_PERMISSION: :  vmcid: 0x0 minor code: 0x0  completed: No
	at org.apache.yoko.orb.OB.Util.unmarshalSystemException(Util.java:121)
	at org.apache.yoko.orb.CORBA.ServerRequest._OB_doMarshal(ServerRequest.java:197)
	at org.apache.yoko.orb.OBPortableServer.ServantDispatcher.dispatch(ServantDispatcher.java:228)
	at org.apache.yoko.orb.OBPortableServer.POA_impl._OB_dispatch(POA_impl.java:1607)
	at org.apache.yoko.orb.OB.DispatchRequest_impl.invoke(DispatchRequest_impl.java:56)
	at org.apache.yoko.orb.OB.DispatchSameThread_impl.dispatch(DispatchStrategyFactory_impl.java:53)
	at org.apache.yoko.orb.OB.Upcall.invoke(Upcall.java:360)
	at org.apache.yoko.orb.OB.GIOPConnectionThreaded.execReceive(GIOPConnectionThreaded.java:502)
	at org.apache.yoko.orb.OB.GIOPConnectionThreaded$ReceiverThread.run(GIOPConnectionThreaded.java:64)
[surefire] Running org.apache.yoko.bindings.corba.CorbaSystemExceptionTest
[surefire] Tests run: 3, Failures: 0, Errors: 0, Time elapsed: 10.286 sec
[surefire] 

[surefire] Running org.apache.yoko.bindings.corba.CorbaMessageTest
[surefire] Tests run: 1, Failures: 0, Errors: 0, Time elapsed: 0.042 sec
[surefire] 

[surefire] Running org.apache.yoko.bindings.corba.CorbaConduitTest
[surefire] Tests run: 13, Failures: 0, Errors: 0, Time elapsed: 1.278 sec
[surefire] 

[surefire] Running org.apache.yoko.bindings.corba.CorbaBindingTest
[surefire] Tests run: 1, Failures: 0, Errors: 0, Time elapsed: 0.005 sec
[surefire] 

[surefire] Running org.apache.yoko.bindings.corba.CorbaServerConduitTest
[surefire] Tests run: 9, Failures: 0, Errors: 0, Time elapsed: 13.364 sec
[surefire] 

[surefire] Running org.apache.yoko.bindings.corba.CorbaDestinationTest
[surefire] Tests run: 1, Failures: 0, Errors: 0, Time elapsed: 1.402 sec
[surefire] 

getTransportIdsone
[surefire] Running org.apache.yoko.bindings.corba.CorbaBindingFactoryTest
[surefire] Tests run: 9, Failures: 0, Errors: 0, Time elapsed: 11.721 sec
[surefire] 

[surefire] Running org.apache.yoko.bindings.corba.CorbaTypeTest
[surefire] Tests run: 58, Failures: 0, Errors: 0, Time elapsed: 23.817 sec
[surefire] 

[surefire] Running org.apache.yoko.bindings.corba.utils.CorbaUtilsTest
[surefire] Tests run: 14, Failures: 0, Errors: 0, Time elapsed: 0.027 sec
[surefire] 

[surefire] Running org.apache.yoko.bindings.corba.utils.ContextUtilsTest
[surefire] Tests run: 2, Failures: 0, Errors: 0, Time elapsed: 0.01 sec
[surefire] 


Results :
[surefire] Tests run: 223, Failures: 0, Errors: 4

[INFO] ------------------------------------------------------------------------
[ERROR] BUILD ERROR
[INFO] ------------------------------------------------------------------------
[INFO] There are test failures.
[INFO] ------------------------------------------------------------------------
[INFO] For more information, run Maven with the -e switch
[INFO] ------------------------------------------------------------------------
[INFO] Total time: 3 minutes 24 seconds
[INFO] Finished at: Mon Apr 16 07:06:05 PDT 2007
[INFO] Final Memory: 33M/59M
[INFO] ------------------------------------------------------------------------

****************************************************************************



Mime
View raw message