jackrabbit-oak-dev mailing list archives

Site index · List index
Message view « Date » · « Thread »
Top « Date » · « Thread »
From Apache Jenkins Server <jenk...@builds.apache.org>
Subject BUILD FAILURE: Jackrabbit Oak - Build # 2011 - Failure
Date Thu, 14 Mar 2019 04:25:04 GMT
The Apache Jenkins build system has built Jackrabbit Oak (build #2011)

Status: Failure

Check console output at https://builds.apache.org/job/Jackrabbit%20Oak/2011/ to view the results.

Changes:
[amitj] OAK-8115: Allow disabling of BlobTracker when not required

- BlobTracker can be disabled by setting config property snapshotIntervalSecs to 0 or below
as this prop needs a sensible non-zero value anyways to be effective

[amitj] OAK-8112: Change log pattern to have complete date for oak-run datastore command

Changed pattern to have the complete date

 

Test results:
1 tests failed.
FAILED:  org.apache.jackrabbit.oak.plugins.index.lucene.directory.ActiveDeletedBlobCollectionIT.simpleAsyncIndexUpdateBasedBlobCollection[WITHOUT_FDS]

Error Message:
Unable to start docker container: DockerConfig{name=MongoDB}

Stack Trace:
java.lang.RuntimeException: Unable to start docker container: DockerConfig{name=MongoDB}
	at com.arakelian.docker.junit.DockerRule$StatementWithDockerRule.evaluate(DockerRule.java:79)
	at org.junit.rules.ExternalResource$1.evaluate(ExternalResource.java:48)
	at org.junit.rules.ExternalResource$1.evaluate(ExternalResource.java:48)
	at org.junit.rules.ExternalResource$1.evaluate(ExternalResource.java:48)
	at org.junit.rules.RunRules.evaluate(RunRules.java:20)
	at org.junit.runners.ParentRunner.runLeaf(ParentRunner.java:325)
	at org.junit.runners.BlockJUnit4ClassRunner.runChild(BlockJUnit4ClassRunner.java:78)
	at org.junit.runners.BlockJUnit4ClassRunner.runChild(BlockJUnit4ClassRunner.java:57)
	at org.junit.runners.ParentRunner$3.run(ParentRunner.java:290)
	at org.junit.runners.ParentRunner$1.schedule(ParentRunner.java:71)
	at org.junit.runners.ParentRunner.runChildren(ParentRunner.java:288)
	at org.junit.runners.ParentRunner.access$000(ParentRunner.java:58)
	at org.junit.runners.ParentRunner$2.evaluate(ParentRunner.java:268)
	at org.junit.runners.ParentRunner.run(ParentRunner.java:363)
	at org.junit.runners.Suite.runChild(Suite.java:128)
	at org.junit.runners.Suite.runChild(Suite.java:27)
	at org.junit.runners.ParentRunner$3.run(ParentRunner.java:290)
	at org.junit.runners.ParentRunner$1.schedule(ParentRunner.java:71)
	at org.junit.runners.ParentRunner.runChildren(ParentRunner.java:288)
	at org.junit.runners.ParentRunner.access$000(ParentRunner.java:58)
	at org.junit.runners.ParentRunner$2.evaluate(ParentRunner.java:268)
	at org.junit.internal.runners.statements.RunBefores.evaluate(RunBefores.java:26)
	at org.junit.runners.ParentRunner.run(ParentRunner.java:363)
	at org.apache.maven.surefire.junit4.JUnit4Provider.execute(JUnit4Provider.java:365)
	at org.apache.maven.surefire.junit4.JUnit4Provider.executeWithRerun(JUnit4Provider.java:273)
	at org.apache.maven.surefire.junit4.JUnit4Provider.executeTestSet(JUnit4Provider.java:238)
	at org.apache.maven.surefire.junit4.JUnit4Provider.invoke(JUnit4Provider.java:159)
	at org.apache.maven.surefire.booter.ForkedBooter.invokeProviderInSameClassLoader(ForkedBooter.java:384)
	at org.apache.maven.surefire.booter.ForkedBooter.runSuitesInProcess(ForkedBooter.java:345)
	at org.apache.maven.surefire.booter.ForkedBooter.execute(ForkedBooter.java:126)
	at org.apache.maven.surefire.booter.ForkedBooter.main(ForkedBooter.java:418)
Caused by: org.junit.internal.runners.model.MultipleFailureException: There were 2 errors:
  org.apache.jackrabbit.oak.plugins.document.DocumentStoreException(This oak instance failed
to update the lease in time and can therefore no longer access this DocumentNodeStore.)
  org.apache.jackrabbit.oak.plugins.document.DocumentStoreException(This oak instance failed
to update the lease in time and can therefore no longer access this DocumentNodeStore.)
	at org.junit.runners.model.MultipleFailureException.assertEmpty(MultipleFailureException.java:67)
	at org.junit.internal.runners.statements.RunAfters.evaluate(RunAfters.java:39)
	at org.junit.rules.ExternalResource$1.evaluate(ExternalResource.java:48)
	at com.arakelian.docker.junit.DockerRule$StatementWithDockerRule.evaluate(DockerRule.java:76)
	... 30 more
Mime
View raw message