jackrabbit-oak-dev mailing list archives

Site index · List index
Message view « Date » · « Thread »
Top « Date » · « Thread »
From Apache Jenkins Server <jenk...@builds.apache.org>
Subject BUILD FAILURE: Jackrabbit Oak - Build # 1994 - Failure
Date Tue, 05 Mar 2019 11:00:18 GMT
The Apache Jenkins build system has built Jackrabbit Oak (build #1994)

Status: Failure

Check console output at https://builds.apache.org/job/Jackrabbit%20Oak/1994/ to view the results.

Changes:
[mreutegg] OAK-8106: High memory usage when large branch is reset

Add an ignored test

 

Test results:
15 tests failed.
FAILED:  oak.apache.jackrabbit.oak.segment.azure.tool.SegmentCopyAzureToTarTest.oak.apache.jackrabbit.oak.segment.azure.tool.SegmentCopyAzureToTarTest

Error Message:
Unable to start docker container: DockerConfig{name=oak-test-azurite}

Stack Trace:
java.lang.RuntimeException: Unable to start docker container: DockerConfig{name=oak-test-azurite}
	at com.arakelian.docker.junit.DockerRule$StatementWithDockerRule.evaluate(DockerRule.java:79)
	at org.junit.rules.RunRules.evaluate(RunRules.java:20)
	at org.junit.runners.ParentRunner.run(ParentRunner.java:363)
	at org.apache.maven.surefire.junit4.JUnit4Provider.execute(JUnit4Provider.java:365)
	at org.apache.maven.surefire.junit4.JUnit4Provider.executeWithRerun(JUnit4Provider.java:273)
	at org.apache.maven.surefire.junit4.JUnit4Provider.executeTestSet(JUnit4Provider.java:238)
	at org.apache.maven.surefire.junit4.JUnit4Provider.invoke(JUnit4Provider.java:159)
	at org.apache.maven.surefire.booter.ForkedBooter.invokeProviderInSameClassLoader(ForkedBooter.java:384)
	at org.apache.maven.surefire.booter.ForkedBooter.runSuitesInProcess(ForkedBooter.java:345)
	at org.apache.maven.surefire.booter.ForkedBooter.execute(ForkedBooter.java:126)
	at org.apache.maven.surefire.booter.ForkedBooter.main(ForkedBooter.java:418)
Caused by: java.lang.IllegalStateException: Unable to create container using ContainerConfig{hostname=null, domainname=null, user=null, attachStdin=null, attachStdout=null, attachStderr=null, portSpecs=null, exposedPorts=[10000], tty=null, openStdin=null, stdinOnce=null, env=[executable=blob], cmd=null, image=trekawek/azurite, volumes=[], workingDir=null, entrypoint=null, networkDisabled=false, onBuild=null, labels=null, macAddress=null, hostConfig=HostConfig{binds=null, blkioWeight=null, blkioWeightDevice=null, blkioDeviceReadBps=null, blkioDeviceWriteBps=null, blkioDeviceReadIOps=null, blkioDeviceWriteIOps=null, containerIdFile=null, lxcConf=null, privileged=null, portBindings={10000=[PortBinding{hostIp=0.0.0.0, hostPort=}]}, links=null, publishAllPorts=null, dns=null, dnsOptions=null, dnsSearch=null, extraHosts=null, volumesFrom=null, capAdd=null, capDrop=null, networkMode=null, securityOpt=null, devices=null, memory=null, memorySwap=null, memorySwappiness=null, memoryReservation=null, nanoCpus=null, cpuPeriod=null, cpuShares=null, cpusetCpus=null, cpusetMems=null, cpuQuota=null, cgroupParent=null, restartPolicy=null, logConfig=null, ipcMode=null, ulimits=null, pidMode=null, shmSize=null, oomKillDisable=null, oomScoreAdj=null, autoRemove=null, pidsLimit=null, tmpfs=null, readonlyRootfs=null, storageOpt=null}, stopSignal=null, healthcheck=null, networkingConfig=null}
	at com.arakelian.docker.junit.Container.createContainer(Container.java:486)
	at com.arakelian.docker.junit.Container.start(Container.java:288)
	at com.arakelian.docker.junit.DockerRule$StatementWithDockerRule.evaluate(DockerRule.java:75)
	... 10 more
Caused by: com.spotify.docker.client.exceptions.ImageNotFoundException: Image not found: trekawek/azurite
	at com.spotify.docker.client.DefaultDockerClient.createContainer(DefaultDockerClient.java:727)
	at com.arakelian.docker.junit.Container.createContainer(Container.java:482)
	... 12 more
Caused by: com.spotify.docker.client.exceptions.DockerRequestException: Request error: POST unix://localhost:80/containers/create?name=oak-test-azurite: 404, body: {"message":"open /var/lib/docker/aufs/layers/43fd5be9e594113c6b55cad4904a407a17c6b3419ba4c91ffdac7c3e9bc1eb45: no such file or directory"}

	at com.spotify.docker.client.DefaultDockerClient.propagate(DefaultDockerClient.java:2820)
	at com.spotify.docker.client.DefaultDockerClient.request(DefaultDockerClient.java:2703)
	at com.spotify.docker.client.DefaultDockerClient.createContainer(DefaultDockerClient.java:722)
	... 13 more
Caused by: com.spotify.docker.client.shaded.javax.ws.rs.NotFoundException: HTTP 404 Not Found
	at com.spotify.docker.client.shaded.org.glassfish.jersey.client.JerseyInvocation.convertToException(JerseyInvocation.java:1008)
	at com.spotify.docker.client.shaded.org.glassfish.jersey.client.JerseyInvocation.translate(JerseyInvocation.java:816)
	at com.spotify.docker.client.shaded.org.glassfish.jersey.client.JerseyInvocation.access$700(JerseyInvocation.java:92)
	at com.spotify.docker.client.shaded.org.glassfish.jersey.client.JerseyInvocation$5.completed(JerseyInvocation.java:773)
	at com.spotify.docker.client.shaded.org.glassfish.jersey.client.ClientRuntime.processResponse(ClientRuntime.java:198)
	at com.spotify.docker.client.shaded.org.glassfish.jersey.client.ClientRuntime.access$300(ClientRuntime.java:79)
	at com.spotify.docker.client.shaded.org.glassfish.jersey.client.ClientRuntime$2.run(ClientRuntime.java:180)
	at com.spotify.docker.client.shaded.org.glassfish.jersey.internal.Errors$1.call(Errors.java:271)
	at com.spotify.docker.client.shaded.org.glassfish.jersey.internal.Errors$1.call(Errors.java:267)
	at com.spotify.docker.client.shaded.org.glassfish.jersey.internal.Errors.process(Errors.java:315)
	at com.spotify.docker.client.shaded.org.glassfish.jersey.internal.Errors.process(Errors.java:297)
	at com.spotify.docker.client.shaded.org.glassfish.jersey.internal.Errors.process(Errors.java:267)
	at com.spotify.docker.client.shaded.org.glassfish.jersey.process.internal.RequestScope.runInScope(RequestScope.java:340)
	at com.spotify.docker.client.shaded.org.glassfish.jersey.client.ClientRuntime$3.run(ClientRuntime.java:210)
	at java.util.concurrent.Executors$RunnableAdapter.call(Executors.java:511)
	at java.util.concurrent.FutureTask.run(FutureTask.java:266)
	at java.util.concurrent.ThreadPoolExecutor.runWorker(ThreadPoolExecutor.java:1149)
	at java.util.concurrent.ThreadPoolExecutor$Worker.run(ThreadPoolExecutor.java:624)
	at java.lang.Thread.run(Thread.java:748)


FAILED:  oak.apache.jackrabbit.oak.segment.azure.tool.SegmentCopyTarToAzureTest.oak.apache.jackrabbit.oak.segment.azure.tool.SegmentCopyTarToAzureTest

Error Message:
Unable to start docker container: DockerConfig{name=oak-test-azurite}

Stack Trace:
java.lang.RuntimeException: Unable to start docker container: DockerConfig{name=oak-test-azurite}
	at com.arakelian.docker.junit.DockerRule$StatementWithDockerRule.evaluate(DockerRule.java:79)
	at org.junit.rules.RunRules.evaluate(RunRules.java:20)
	at org.junit.runners.ParentRunner.run(ParentRunner.java:363)
	at org.apache.maven.surefire.junit4.JUnit4Provider.execute(JUnit4Provider.java:365)
	at org.apache.maven.surefire.junit4.JUnit4Provider.executeWithRerun(JUnit4Provider.java:273)
	at org.apache.maven.surefire.junit4.JUnit4Provider.executeTestSet(JUnit4Provider.java:238)
	at org.apache.maven.surefire.junit4.JUnit4Provider.invoke(JUnit4Provider.java:159)
	at org.apache.maven.surefire.booter.ForkedBooter.invokeProviderInSameClassLoader(ForkedBooter.java:384)
	at org.apache.maven.surefire.booter.ForkedBooter.runSuitesInProcess(ForkedBooter.java:345)
	at org.apache.maven.surefire.booter.ForkedBooter.execute(ForkedBooter.java:126)
	at org.apache.maven.surefire.booter.ForkedBooter.main(ForkedBooter.java:418)
Caused by: java.lang.IllegalStateException: Unable to create container using ContainerConfig{hostname=null, domainname=null, user=null, attachStdin=null, attachStdout=null, attachStderr=null, portSpecs=null, exposedPorts=[10000], tty=null, openStdin=null, stdinOnce=null, env=[executable=blob], cmd=null, image=trekawek/azurite, volumes=[], workingDir=null, entrypoint=null, networkDisabled=false, onBuild=null, labels=null, macAddress=null, hostConfig=HostConfig{binds=null, blkioWeight=null, blkioWeightDevice=null, blkioDeviceReadBps=null, blkioDeviceWriteBps=null, blkioDeviceReadIOps=null, blkioDeviceWriteIOps=null, containerIdFile=null, lxcConf=null, privileged=null, portBindings={10000=[PortBinding{hostIp=0.0.0.0, hostPort=}]}, links=null, publishAllPorts=null, dns=null, dnsOptions=null, dnsSearch=null, extraHosts=null, volumesFrom=null, capAdd=null, capDrop=null, networkMode=null, securityOpt=null, devices=null, memory=null, memorySwap=null, memorySwappiness=null, memoryReservation=null, nanoCpus=null, cpuPeriod=null, cpuShares=null, cpusetCpus=null, cpusetMems=null, cpuQuota=null, cgroupParent=null, restartPolicy=null, logConfig=null, ipcMode=null, ulimits=null, pidMode=null, shmSize=null, oomKillDisable=null, oomScoreAdj=null, autoRemove=null, pidsLimit=null, tmpfs=null, readonlyRootfs=null, storageOpt=null}, stopSignal=null, healthcheck=null, networkingConfig=null}
	at com.arakelian.docker.junit.Container.createContainer(Container.java:486)
	at com.arakelian.docker.junit.Container.start(Container.java:288)
	at com.arakelian.docker.junit.DockerRule$StatementWithDockerRule.evaluate(DockerRule.java:75)
	... 10 more
Caused by: com.spotify.docker.client.exceptions.ImageNotFoundException: Image not found: trekawek/azurite
	at com.spotify.docker.client.DefaultDockerClient.createContainer(DefaultDockerClient.java:727)
	at com.arakelian.docker.junit.Container.createContainer(Container.java:482)
	... 12 more
Caused by: com.spotify.docker.client.exceptions.DockerRequestException: Request error: POST unix://localhost:80/containers/create?name=oak-test-azurite: 404, body: {"message":"open /var/lib/docker/aufs/layers/43fd5be9e594113c6b55cad4904a407a17c6b3419ba4c91ffdac7c3e9bc1eb45: no such file or directory"}

	at com.spotify.docker.client.DefaultDockerClient.propagate(DefaultDockerClient.java:2820)
	at com.spotify.docker.client.DefaultDockerClient.request(DefaultDockerClient.java:2703)
	at com.spotify.docker.client.DefaultDockerClient.createContainer(DefaultDockerClient.java:722)
	... 13 more
Caused by: com.spotify.docker.client.shaded.javax.ws.rs.NotFoundException: HTTP 404 Not Found
	at com.spotify.docker.client.shaded.org.glassfish.jersey.client.JerseyInvocation.convertToException(JerseyInvocation.java:1008)
	at com.spotify.docker.client.shaded.org.glassfish.jersey.client.JerseyInvocation.translate(JerseyInvocation.java:816)
	at com.spotify.docker.client.shaded.org.glassfish.jersey.client.JerseyInvocation.access$700(JerseyInvocation.java:92)
	at com.spotify.docker.client.shaded.org.glassfish.jersey.client.JerseyInvocation$5.completed(JerseyInvocation.java:773)
	at com.spotify.docker.client.shaded.org.glassfish.jersey.client.ClientRuntime.processResponse(ClientRuntime.java:198)
	at com.spotify.docker.client.shaded.org.glassfish.jersey.client.ClientRuntime.access$300(ClientRuntime.java:79)
	at com.spotify.docker.client.shaded.org.glassfish.jersey.client.ClientRuntime$2.run(ClientRuntime.java:180)
	at com.spotify.docker.client.shaded.org.glassfish.jersey.internal.Errors$1.call(Errors.java:271)
	at com.spotify.docker.client.shaded.org.glassfish.jersey.internal.Errors$1.call(Errors.java:267)
	at com.spotify.docker.client.shaded.org.glassfish.jersey.internal.Errors.process(Errors.java:315)
	at com.spotify.docker.client.shaded.org.glassfish.jersey.internal.Errors.process(Errors.java:297)
	at com.spotify.docker.client.shaded.org.glassfish.jersey.internal.Errors.process(Errors.java:267)
	at com.spotify.docker.client.shaded.org.glassfish.jersey.process.internal.RequestScope.runInScope(RequestScope.java:340)
	at com.spotify.docker.client.shaded.org.glassfish.jersey.client.ClientRuntime$3.run(ClientRuntime.java:210)
	at java.util.concurrent.Executors$RunnableAdapter.call(Executors.java:511)
	at java.util.concurrent.FutureTask.run(FutureTask.java:266)
	at java.util.concurrent.ThreadPoolExecutor.runWorker(ThreadPoolExecutor.java:1149)
	at java.util.concurrent.ThreadPoolExecutor$Worker.run(ThreadPoolExecutor.java:624)
	at java.lang.Thread.run(Thread.java:748)


FAILED:  org.apache.jackrabbit.oak.segment.azure.AzureArchiveManagerTest.org.apache.jackrabbit.oak.segment.azure.AzureArchiveManagerTest

Error Message:
Unable to start docker container: DockerConfig{name=oak-test-azurite}

Stack Trace:
java.lang.RuntimeException: Unable to start docker container: DockerConfig{name=oak-test-azurite}
	at com.arakelian.docker.junit.DockerRule$StatementWithDockerRule.evaluate(DockerRule.java:79)
	at org.junit.rules.RunRules.evaluate(RunRules.java:20)
	at org.junit.runners.ParentRunner.run(ParentRunner.java:363)
	at org.apache.maven.surefire.junit4.JUnit4Provider.execute(JUnit4Provider.java:365)
	at org.apache.maven.surefire.junit4.JUnit4Provider.executeWithRerun(JUnit4Provider.java:273)
	at org.apache.maven.surefire.junit4.JUnit4Provider.executeTestSet(JUnit4Provider.java:238)
	at org.apache.maven.surefire.junit4.JUnit4Provider.invoke(JUnit4Provider.java:159)
	at org.apache.maven.surefire.booter.ForkedBooter.invokeProviderInSameClassLoader(ForkedBooter.java:384)
	at org.apache.maven.surefire.booter.ForkedBooter.runSuitesInProcess(ForkedBooter.java:345)
	at org.apache.maven.surefire.booter.ForkedBooter.execute(ForkedBooter.java:126)
	at org.apache.maven.surefire.booter.ForkedBooter.main(ForkedBooter.java:418)
Caused by: java.lang.IllegalStateException: Unable to create container using ContainerConfig{hostname=null, domainname=null, user=null, attachStdin=null, attachStdout=null, attachStderr=null, portSpecs=null, exposedPorts=[10000], tty=null, openStdin=null, stdinOnce=null, env=[executable=blob], cmd=null, image=trekawek/azurite, volumes=[], workingDir=null, entrypoint=null, networkDisabled=false, onBuild=null, labels=null, macAddress=null, hostConfig=HostConfig{binds=null, blkioWeight=null, blkioWeightDevice=null, blkioDeviceReadBps=null, blkioDeviceWriteBps=null, blkioDeviceReadIOps=null, blkioDeviceWriteIOps=null, containerIdFile=null, lxcConf=null, privileged=null, portBindings={10000=[PortBinding{hostIp=0.0.0.0, hostPort=}]}, links=null, publishAllPorts=null, dns=null, dnsOptions=null, dnsSearch=null, extraHosts=null, volumesFrom=null, capAdd=null, capDrop=null, networkMode=null, securityOpt=null, devices=null, memory=null, memorySwap=null, memorySwappiness=null, memoryReservation=null, nanoCpus=null, cpuPeriod=null, cpuShares=null, cpusetCpus=null, cpusetMems=null, cpuQuota=null, cgroupParent=null, restartPolicy=null, logConfig=null, ipcMode=null, ulimits=null, pidMode=null, shmSize=null, oomKillDisable=null, oomScoreAdj=null, autoRemove=null, pidsLimit=null, tmpfs=null, readonlyRootfs=null, storageOpt=null}, stopSignal=null, healthcheck=null, networkingConfig=null}
	at com.arakelian.docker.junit.Container.createContainer(Container.java:486)
	at com.arakelian.docker.junit.Container.start(Container.java:288)
	at com.arakelian.docker.junit.DockerRule$StatementWithDockerRule.evaluate(DockerRule.java:75)
	... 10 more
Caused by: com.spotify.docker.client.exceptions.ImageNotFoundException: Image not found: trekawek/azurite
	at com.spotify.docker.client.DefaultDockerClient.createContainer(DefaultDockerClient.java:727)
	at com.arakelian.docker.junit.Container.createContainer(Container.java:482)
	... 12 more
Caused by: com.spotify.docker.client.exceptions.DockerRequestException: Request error: POST unix://localhost:80/containers/create?name=oak-test-azurite: 404, body: {"message":"open /var/lib/docker/aufs/layers/43fd5be9e594113c6b55cad4904a407a17c6b3419ba4c91ffdac7c3e9bc1eb45: no such file or directory"}

	at com.spotify.docker.client.DefaultDockerClient.propagate(DefaultDockerClient.java:2820)
	at com.spotify.docker.client.DefaultDockerClient.request(DefaultDockerClient.java:2703)
	at com.spotify.docker.client.DefaultDockerClient.createContainer(DefaultDockerClient.java:722)
	... 13 more
Caused by: com.spotify.docker.client.shaded.javax.ws.rs.NotFoundException: HTTP 404 Not Found
	at com.spotify.docker.client.shaded.org.glassfish.jersey.client.JerseyInvocation.convertToException(JerseyInvocation.java:1008)
	at com.spotify.docker.client.shaded.org.glassfish.jersey.client.JerseyInvocation.translate(JerseyInvocation.java:816)
	at com.spotify.docker.client.shaded.org.glassfish.jersey.client.JerseyInvocation.access$700(JerseyInvocation.java:92)
	at com.spotify.docker.client.shaded.org.glassfish.jersey.client.JerseyInvocation$5.completed(JerseyInvocation.java:773)
	at com.spotify.docker.client.shaded.org.glassfish.jersey.client.ClientRuntime.processResponse(ClientRuntime.java:198)
	at com.spotify.docker.client.shaded.org.glassfish.jersey.client.ClientRuntime.access$300(ClientRuntime.java:79)
	at com.spotify.docker.client.shaded.org.glassfish.jersey.client.ClientRuntime$2.run(ClientRuntime.java:180)
	at com.spotify.docker.client.shaded.org.glassfish.jersey.internal.Errors$1.call(Errors.java:271)
	at com.spotify.docker.client.shaded.org.glassfish.jersey.internal.Errors$1.call(Errors.java:267)
	at com.spotify.docker.client.shaded.org.glassfish.jersey.internal.Errors.process(Errors.java:315)
	at com.spotify.docker.client.shaded.org.glassfish.jersey.internal.Errors.process(Errors.java:297)
	at com.spotify.docker.client.shaded.org.glassfish.jersey.internal.Errors.process(Errors.java:267)
	at com.spotify.docker.client.shaded.org.glassfish.jersey.process.internal.RequestScope.runInScope(RequestScope.java:340)
	at com.spotify.docker.client.shaded.org.glassfish.jersey.client.ClientRuntime$3.run(ClientRuntime.java:210)
	at java.util.concurrent.Executors$RunnableAdapter.call(Executors.java:511)
	at java.util.concurrent.FutureTask.run(FutureTask.java:266)
	at java.util.concurrent.ThreadPoolExecutor.runWorker(ThreadPoolExecutor.java:1149)
	at java.util.concurrent.ThreadPoolExecutor$Worker.run(ThreadPoolExecutor.java:624)
	at java.lang.Thread.run(Thread.java:748)


FAILED:  org.apache.jackrabbit.oak.segment.azure.AzureGCJournalTest.org.apache.jackrabbit.oak.segment.azure.AzureGCJournalTest

Error Message:
Unable to start docker container: DockerConfig{name=oak-test-azurite}

Stack Trace:
java.lang.RuntimeException: Unable to start docker container: DockerConfig{name=oak-test-azurite}
	at com.arakelian.docker.junit.DockerRule$StatementWithDockerRule.evaluate(DockerRule.java:79)
	at org.junit.rules.RunRules.evaluate(RunRules.java:20)
	at org.junit.runners.ParentRunner.run(ParentRunner.java:363)
	at org.apache.maven.surefire.junit4.JUnit4Provider.execute(JUnit4Provider.java:365)
	at org.apache.maven.surefire.junit4.JUnit4Provider.executeWithRerun(JUnit4Provider.java:273)
	at org.apache.maven.surefire.junit4.JUnit4Provider.executeTestSet(JUnit4Provider.java:238)
	at org.apache.maven.surefire.junit4.JUnit4Provider.invoke(JUnit4Provider.java:159)
	at org.apache.maven.surefire.booter.ForkedBooter.invokeProviderInSameClassLoader(ForkedBooter.java:384)
	at org.apache.maven.surefire.booter.ForkedBooter.runSuitesInProcess(ForkedBooter.java:345)
	at org.apache.maven.surefire.booter.ForkedBooter.execute(ForkedBooter.java:126)
	at org.apache.maven.surefire.booter.ForkedBooter.main(ForkedBooter.java:418)
Caused by: java.lang.IllegalStateException: Unable to create container using ContainerConfig{hostname=null, domainname=null, user=null, attachStdin=null, attachStdout=null, attachStderr=null, portSpecs=null, exposedPorts=[10000], tty=null, openStdin=null, stdinOnce=null, env=[executable=blob], cmd=null, image=trekawek/azurite, volumes=[], workingDir=null, entrypoint=null, networkDisabled=false, onBuild=null, labels=null, macAddress=null, hostConfig=HostConfig{binds=null, blkioWeight=null, blkioWeightDevice=null, blkioDeviceReadBps=null, blkioDeviceWriteBps=null, blkioDeviceReadIOps=null, blkioDeviceWriteIOps=null, containerIdFile=null, lxcConf=null, privileged=null, portBindings={10000=[PortBinding{hostIp=0.0.0.0, hostPort=}]}, links=null, publishAllPorts=null, dns=null, dnsOptions=null, dnsSearch=null, extraHosts=null, volumesFrom=null, capAdd=null, capDrop=null, networkMode=null, securityOpt=null, devices=null, memory=null, memorySwap=null, memorySwappiness=null, memoryReservation=null, nanoCpus=null, cpuPeriod=null, cpuShares=null, cpusetCpus=null, cpusetMems=null, cpuQuota=null, cgroupParent=null, restartPolicy=null, logConfig=null, ipcMode=null, ulimits=null, pidMode=null, shmSize=null, oomKillDisable=null, oomScoreAdj=null, autoRemove=null, pidsLimit=null, tmpfs=null, readonlyRootfs=null, storageOpt=null}, stopSignal=null, healthcheck=null, networkingConfig=null}
	at com.arakelian.docker.junit.Container.createContainer(Container.java:486)
	at com.arakelian.docker.junit.Container.start(Container.java:288)
	at com.arakelian.docker.junit.DockerRule$StatementWithDockerRule.evaluate(DockerRule.java:75)
	... 10 more
Caused by: com.spotify.docker.client.exceptions.ImageNotFoundException: Image not found: trekawek/azurite
	at com.spotify.docker.client.DefaultDockerClient.createContainer(DefaultDockerClient.java:727)
	at com.arakelian.docker.junit.Container.createContainer(Container.java:482)
	... 12 more
Caused by: com.spotify.docker.client.exceptions.DockerRequestException: Request error: POST unix://localhost:80/containers/create?name=oak-test-azurite: 404, body: {"message":"open /var/lib/docker/aufs/layers/43fd5be9e594113c6b55cad4904a407a17c6b3419ba4c91ffdac7c3e9bc1eb45: no such file or directory"}

	at com.spotify.docker.client.DefaultDockerClient.propagate(DefaultDockerClient.java:2820)
	at com.spotify.docker.client.DefaultDockerClient.request(DefaultDockerClient.java:2703)
	at com.spotify.docker.client.DefaultDockerClient.createContainer(DefaultDockerClient.java:722)
	... 13 more
Caused by: com.spotify.docker.client.shaded.javax.ws.rs.NotFoundException: HTTP 404 Not Found
	at com.spotify.docker.client.shaded.org.glassfish.jersey.client.JerseyInvocation.convertToException(JerseyInvocation.java:1008)
	at com.spotify.docker.client.shaded.org.glassfish.jersey.client.JerseyInvocation.translate(JerseyInvocation.java:816)
	at com.spotify.docker.client.shaded.org.glassfish.jersey.client.JerseyInvocation.access$700(JerseyInvocation.java:92)
	at com.spotify.docker.client.shaded.org.glassfish.jersey.client.JerseyInvocation$5.completed(JerseyInvocation.java:773)
	at com.spotify.docker.client.shaded.org.glassfish.jersey.client.ClientRuntime.processResponse(ClientRuntime.java:198)
	at com.spotify.docker.client.shaded.org.glassfish.jersey.client.ClientRuntime.access$300(ClientRuntime.java:79)
	at com.spotify.docker.client.shaded.org.glassfish.jersey.client.ClientRuntime$2.run(ClientRuntime.java:180)
	at com.spotify.docker.client.shaded.org.glassfish.jersey.internal.Errors$1.call(Errors.java:271)
	at com.spotify.docker.client.shaded.org.glassfish.jersey.internal.Errors$1.call(Errors.java:267)
	at com.spotify.docker.client.shaded.org.glassfish.jersey.internal.Errors.process(Errors.java:315)
	at com.spotify.docker.client.shaded.org.glassfish.jersey.internal.Errors.process(Errors.java:297)
	at com.spotify.docker.client.shaded.org.glassfish.jersey.internal.Errors.process(Errors.java:267)
	at com.spotify.docker.client.shaded.org.glassfish.jersey.process.internal.RequestScope.runInScope(RequestScope.java:340)
	at com.spotify.docker.client.shaded.org.glassfish.jersey.client.ClientRuntime$3.run(ClientRuntime.java:210)
	at java.util.concurrent.Executors$RunnableAdapter.call(Executors.java:511)
	at java.util.concurrent.FutureTask.run(FutureTask.java:266)
	at java.util.concurrent.ThreadPoolExecutor.runWorker(ThreadPoolExecutor.java:1149)
	at java.util.concurrent.ThreadPoolExecutor$Worker.run(ThreadPoolExecutor.java:624)
	at java.lang.Thread.run(Thread.java:748)


FAILED:  org.apache.jackrabbit.oak.segment.azure.AzureJournalFileTest.org.apache.jackrabbit.oak.segment.azure.AzureJournalFileTest

Error Message:
Unable to start docker container: DockerConfig{name=oak-test-azurite}

Stack Trace:
java.lang.RuntimeException: Unable to start docker container: DockerConfig{name=oak-test-azurite}
	at com.arakelian.docker.junit.DockerRule$StatementWithDockerRule.evaluate(DockerRule.java:79)
	at org.junit.rules.RunRules.evaluate(RunRules.java:20)
	at org.junit.runners.ParentRunner.run(ParentRunner.java:363)
	at org.apache.maven.surefire.junit4.JUnit4Provider.execute(JUnit4Provider.java:365)
	at org.apache.maven.surefire.junit4.JUnit4Provider.executeWithRerun(JUnit4Provider.java:273)
	at org.apache.maven.surefire.junit4.JUnit4Provider.executeTestSet(JUnit4Provider.java:238)
	at org.apache.maven.surefire.junit4.JUnit4Provider.invoke(JUnit4Provider.java:159)
	at org.apache.maven.surefire.booter.ForkedBooter.invokeProviderInSameClassLoader(ForkedBooter.java:384)
	at org.apache.maven.surefire.booter.ForkedBooter.runSuitesInProcess(ForkedBooter.java:345)
	at org.apache.maven.surefire.booter.ForkedBooter.execute(ForkedBooter.java:126)
	at org.apache.maven.surefire.booter.ForkedBooter.main(ForkedBooter.java:418)
Caused by: java.lang.IllegalStateException: Unable to create container using ContainerConfig{hostname=null, domainname=null, user=null, attachStdin=null, attachStdout=null, attachStderr=null, portSpecs=null, exposedPorts=[10000], tty=null, openStdin=null, stdinOnce=null, env=[executable=blob], cmd=null, image=trekawek/azurite, volumes=[], workingDir=null, entrypoint=null, networkDisabled=false, onBuild=null, labels=null, macAddress=null, hostConfig=HostConfig{binds=null, blkioWeight=null, blkioWeightDevice=null, blkioDeviceReadBps=null, blkioDeviceWriteBps=null, blkioDeviceReadIOps=null, blkioDeviceWriteIOps=null, containerIdFile=null, lxcConf=null, privileged=null, portBindings={10000=[PortBinding{hostIp=0.0.0.0, hostPort=}]}, links=null, publishAllPorts=null, dns=null, dnsOptions=null, dnsSearch=null, extraHosts=null, volumesFrom=null, capAdd=null, capDrop=null, networkMode=null, securityOpt=null, devices=null, memory=null, memorySwap=null, memorySwappiness=null, memoryReservation=null, nanoCpus=null, cpuPeriod=null, cpuShares=null, cpusetCpus=null, cpusetMems=null, cpuQuota=null, cgroupParent=null, restartPolicy=null, logConfig=null, ipcMode=null, ulimits=null, pidMode=null, shmSize=null, oomKillDisable=null, oomScoreAdj=null, autoRemove=null, pidsLimit=null, tmpfs=null, readonlyRootfs=null, storageOpt=null}, stopSignal=null, healthcheck=null, networkingConfig=null}
	at com.arakelian.docker.junit.Container.createContainer(Container.java:486)
	at com.arakelian.docker.junit.Container.start(Container.java:288)
	at com.arakelian.docker.junit.DockerRule$StatementWithDockerRule.evaluate(DockerRule.java:75)
	... 10 more
Caused by: com.spotify.docker.client.exceptions.ImageNotFoundException: Image not found: trekawek/azurite
	at com.spotify.docker.client.DefaultDockerClient.createContainer(DefaultDockerClient.java:727)
	at com.arakelian.docker.junit.Container.createContainer(Container.java:482)
	... 12 more
Caused by: com.spotify.docker.client.exceptions.DockerRequestException: Request error: POST unix://localhost:80/containers/create?name=oak-test-azurite: 404, body: {"message":"open /var/lib/docker/aufs/layers/43fd5be9e594113c6b55cad4904a407a17c6b3419ba4c91ffdac7c3e9bc1eb45: no such file or directory"}

	at com.spotify.docker.client.DefaultDockerClient.propagate(DefaultDockerClient.java:2820)
	at com.spotify.docker.client.DefaultDockerClient.request(DefaultDockerClient.java:2703)
	at com.spotify.docker.client.DefaultDockerClient.createContainer(DefaultDockerClient.java:722)
	... 13 more
Caused by: com.spotify.docker.client.shaded.javax.ws.rs.NotFoundException: HTTP 404 Not Found
	at com.spotify.docker.client.shaded.org.glassfish.jersey.client.JerseyInvocation.convertToException(JerseyInvocation.java:1008)
	at com.spotify.docker.client.shaded.org.glassfish.jersey.client.JerseyInvocation.translate(JerseyInvocation.java:816)
	at com.spotify.docker.client.shaded.org.glassfish.jersey.client.JerseyInvocation.access$700(JerseyInvocation.java:92)
	at com.spotify.docker.client.shaded.org.glassfish.jersey.client.JerseyInvocation$5.completed(JerseyInvocation.java:773)
	at com.spotify.docker.client.shaded.org.glassfish.jersey.client.ClientRuntime.processResponse(ClientRuntime.java:198)
	at com.spotify.docker.client.shaded.org.glassfish.jersey.client.ClientRuntime.access$300(ClientRuntime.java:79)
	at com.spotify.docker.client.shaded.org.glassfish.jersey.client.ClientRuntime$2.run(ClientRuntime.java:180)
	at com.spotify.docker.client.shaded.org.glassfish.jersey.internal.Errors$1.call(Errors.java:271)
	at com.spotify.docker.client.shaded.org.glassfish.jersey.internal.Errors$1.call(Errors.java:267)
	at com.spotify.docker.client.shaded.org.glassfish.jersey.internal.Errors.process(Errors.java:315)
	at com.spotify.docker.client.shaded.org.glassfish.jersey.internal.Errors.process(Errors.java:297)
	at com.spotify.docker.client.shaded.org.glassfish.jersey.internal.Errors.process(Errors.java:267)
	at com.spotify.docker.client.shaded.org.glassfish.jersey.process.internal.RequestScope.runInScope(RequestScope.java:340)
	at com.spotify.docker.client.shaded.org.glassfish.jersey.client.ClientRuntime$3.run(ClientRuntime.java:210)
	at java.util.concurrent.Executors$RunnableAdapter.call(Executors.java:511)
	at java.util.concurrent.FutureTask.run(FutureTask.java:266)
	at java.util.concurrent.ThreadPoolExecutor.runWorker(ThreadPoolExecutor.java:1149)
	at java.util.concurrent.ThreadPoolExecutor$Worker.run(ThreadPoolExecutor.java:624)
	at java.lang.Thread.run(Thread.java:748)


FAILED:  org.apache.jackrabbit.oak.segment.azure.AzureManifestFileTest.org.apache.jackrabbit.oak.segment.azure.AzureManifestFileTest

Error Message:
Unable to start docker container: DockerConfig{name=oak-test-azurite}

Stack Trace:
java.lang.RuntimeException: Unable to start docker container: DockerConfig{name=oak-test-azurite}
	at com.arakelian.docker.junit.DockerRule$StatementWithDockerRule.evaluate(DockerRule.java:79)
	at org.junit.rules.RunRules.evaluate(RunRules.java:20)
	at org.junit.runners.ParentRunner.run(ParentRunner.java:363)
	at org.apache.maven.surefire.junit4.JUnit4Provider.execute(JUnit4Provider.java:365)
	at org.apache.maven.surefire.junit4.JUnit4Provider.executeWithRerun(JUnit4Provider.java:273)
	at org.apache.maven.surefire.junit4.JUnit4Provider.executeTestSet(JUnit4Provider.java:238)
	at org.apache.maven.surefire.junit4.JUnit4Provider.invoke(JUnit4Provider.java:159)
	at org.apache.maven.surefire.booter.ForkedBooter.invokeProviderInSameClassLoader(ForkedBooter.java:384)
	at org.apache.maven.surefire.booter.ForkedBooter.runSuitesInProcess(ForkedBooter.java:345)
	at org.apache.maven.surefire.booter.ForkedBooter.execute(ForkedBooter.java:126)
	at org.apache.maven.surefire.booter.ForkedBooter.main(ForkedBooter.java:418)
Caused by: java.lang.IllegalStateException: Unable to create container using ContainerConfig{hostname=null, domainname=null, user=null, attachStdin=null, attachStdout=null, attachStderr=null, portSpecs=null, exposedPorts=[10000], tty=null, openStdin=null, stdinOnce=null, env=[executable=blob], cmd=null, image=trekawek/azurite, volumes=[], workingDir=null, entrypoint=null, networkDisabled=false, onBuild=null, labels=null, macAddress=null, hostConfig=HostConfig{binds=null, blkioWeight=null, blkioWeightDevice=null, blkioDeviceReadBps=null, blkioDeviceWriteBps=null, blkioDeviceReadIOps=null, blkioDeviceWriteIOps=null, containerIdFile=null, lxcConf=null, privileged=null, portBindings={10000=[PortBinding{hostIp=0.0.0.0, hostPort=}]}, links=null, publishAllPorts=null, dns=null, dnsOptions=null, dnsSearch=null, extraHosts=null, volumesFrom=null, capAdd=null, capDrop=null, networkMode=null, securityOpt=null, devices=null, memory=null, memorySwap=null, memorySwappiness=null, memoryReservation=null, nanoCpus=null, cpuPeriod=null, cpuShares=null, cpusetCpus=null, cpusetMems=null, cpuQuota=null, cgroupParent=null, restartPolicy=null, logConfig=null, ipcMode=null, ulimits=null, pidMode=null, shmSize=null, oomKillDisable=null, oomScoreAdj=null, autoRemove=null, pidsLimit=null, tmpfs=null, readonlyRootfs=null, storageOpt=null}, stopSignal=null, healthcheck=null, networkingConfig=null}
	at com.arakelian.docker.junit.Container.createContainer(Container.java:486)
	at com.arakelian.docker.junit.Container.start(Container.java:288)
	at com.arakelian.docker.junit.DockerRule$StatementWithDockerRule.evaluate(DockerRule.java:75)
	... 10 more
Caused by: com.spotify.docker.client.exceptions.ImageNotFoundException: Image not found: trekawek/azurite
	at com.spotify.docker.client.DefaultDockerClient.createContainer(DefaultDockerClient.java:727)
	at com.arakelian.docker.junit.Container.createContainer(Container.java:482)
	... 12 more
Caused by: com.spotify.docker.client.exceptions.DockerRequestException: Request error: POST unix://localhost:80/containers/create?name=oak-test-azurite: 404, body: {"message":"open /var/lib/docker/aufs/layers/43fd5be9e594113c6b55cad4904a407a17c6b3419ba4c91ffdac7c3e9bc1eb45: no such file or directory"}

	at com.spotify.docker.client.DefaultDockerClient.propagate(DefaultDockerClient.java:2820)
	at com.spotify.docker.client.DefaultDockerClient.request(DefaultDockerClient.java:2703)
	at com.spotify.docker.client.DefaultDockerClient.createContainer(DefaultDockerClient.java:722)
	... 13 more
Caused by: com.spotify.docker.client.shaded.javax.ws.rs.NotFoundException: HTTP 404 Not Found
	at com.spotify.docker.client.shaded.org.glassfish.jersey.client.JerseyInvocation.convertToException(JerseyInvocation.java:1008)
	at com.spotify.docker.client.shaded.org.glassfish.jersey.client.JerseyInvocation.translate(JerseyInvocation.java:816)
	at com.spotify.docker.client.shaded.org.glassfish.jersey.client.JerseyInvocation.access$700(JerseyInvocation.java:92)
	at com.spotify.docker.client.shaded.org.glassfish.jersey.client.JerseyInvocation$5.completed(JerseyInvocation.java:773)
	at com.spotify.docker.client.shaded.org.glassfish.jersey.client.ClientRuntime.processResponse(ClientRuntime.java:198)
	at com.spotify.docker.client.shaded.org.glassfish.jersey.client.ClientRuntime.access$300(ClientRuntime.java:79)
	at com.spotify.docker.client.shaded.org.glassfish.jersey.client.ClientRuntime$2.run(ClientRuntime.java:180)
	at com.spotify.docker.client.shaded.org.glassfish.jersey.internal.Errors$1.call(Errors.java:271)
	at com.spotify.docker.client.shaded.org.glassfish.jersey.internal.Errors$1.call(Errors.java:267)
	at com.spotify.docker.client.shaded.org.glassfish.jersey.internal.Errors.process(Errors.java:315)
	at com.spotify.docker.client.shaded.org.glassfish.jersey.internal.Errors.process(Errors.java:297)
	at com.spotify.docker.client.shaded.org.glassfish.jersey.internal.Errors.process(Errors.java:267)
	at com.spotify.docker.client.shaded.org.glassfish.jersey.process.internal.RequestScope.runInScope(RequestScope.java:340)
	at com.spotify.docker.client.shaded.org.glassfish.jersey.client.ClientRuntime$3.run(ClientRuntime.java:210)
	at java.util.concurrent.Executors$RunnableAdapter.call(Executors.java:511)
	at java.util.concurrent.FutureTask.run(FutureTask.java:266)
	at java.util.concurrent.ThreadPoolExecutor.runWorker(ThreadPoolExecutor.java:1149)
	at java.util.concurrent.ThreadPoolExecutor$Worker.run(ThreadPoolExecutor.java:624)
	at java.lang.Thread.run(Thread.java:748)


FAILED:  org.apache.jackrabbit.oak.segment.azure.AzureRepositoryLockTest.org.apache.jackrabbit.oak.segment.azure.AzureRepositoryLockTest

Error Message:
Unable to start docker container: DockerConfig{name=oak-test-azurite}

Stack Trace:
java.lang.RuntimeException: Unable to start docker container: DockerConfig{name=oak-test-azurite}
	at com.arakelian.docker.junit.DockerRule$StatementWithDockerRule.evaluate(DockerRule.java:79)
	at org.junit.rules.RunRules.evaluate(RunRules.java:20)
	at org.junit.runners.ParentRunner.run(ParentRunner.java:363)
	at org.apache.maven.surefire.junit4.JUnit4Provider.execute(JUnit4Provider.java:365)
	at org.apache.maven.surefire.junit4.JUnit4Provider.executeWithRerun(JUnit4Provider.java:273)
	at org.apache.maven.surefire.junit4.JUnit4Provider.executeTestSet(JUnit4Provider.java:238)
	at org.apache.maven.surefire.junit4.JUnit4Provider.invoke(JUnit4Provider.java:159)
	at org.apache.maven.surefire.booter.ForkedBooter.invokeProviderInSameClassLoader(ForkedBooter.java:384)
	at org.apache.maven.surefire.booter.ForkedBooter.runSuitesInProcess(ForkedBooter.java:345)
	at org.apache.maven.surefire.booter.ForkedBooter.execute(ForkedBooter.java:126)
	at org.apache.maven.surefire.booter.ForkedBooter.main(ForkedBooter.java:418)
Caused by: java.lang.IllegalStateException: Unable to create container using ContainerConfig{hostname=null, domainname=null, user=null, attachStdin=null, attachStdout=null, attachStderr=null, portSpecs=null, exposedPorts=[10000], tty=null, openStdin=null, stdinOnce=null, env=[executable=blob], cmd=null, image=trekawek/azurite, volumes=[], workingDir=null, entrypoint=null, networkDisabled=false, onBuild=null, labels=null, macAddress=null, hostConfig=HostConfig{binds=null, blkioWeight=null, blkioWeightDevice=null, blkioDeviceReadBps=null, blkioDeviceWriteBps=null, blkioDeviceReadIOps=null, blkioDeviceWriteIOps=null, containerIdFile=null, lxcConf=null, privileged=null, portBindings={10000=[PortBinding{hostIp=0.0.0.0, hostPort=}]}, links=null, publishAllPorts=null, dns=null, dnsOptions=null, dnsSearch=null, extraHosts=null, volumesFrom=null, capAdd=null, capDrop=null, networkMode=null, securityOpt=null, devices=null, memory=null, memorySwap=null, memorySwappiness=null, memoryReservation=null, nanoCpus=null, cpuPeriod=null, cpuShares=null, cpusetCpus=null, cpusetMems=null, cpuQuota=null, cgroupParent=null, restartPolicy=null, logConfig=null, ipcMode=null, ulimits=null, pidMode=null, shmSize=null, oomKillDisable=null, oomScoreAdj=null, autoRemove=null, pidsLimit=null, tmpfs=null, readonlyRootfs=null, storageOpt=null}, stopSignal=null, healthcheck=null, networkingConfig=null}
	at com.arakelian.docker.junit.Container.createContainer(Container.java:486)
	at com.arakelian.docker.junit.Container.start(Container.java:288)
	at com.arakelian.docker.junit.DockerRule$StatementWithDockerRule.evaluate(DockerRule.java:75)
	... 10 more
Caused by: com.spotify.docker.client.exceptions.ImageNotFoundException: Image not found: trekawek/azurite
	at com.spotify.docker.client.DefaultDockerClient.createContainer(DefaultDockerClient.java:727)
	at com.arakelian.docker.junit.Container.createContainer(Container.java:482)
	... 12 more
Caused by: com.spotify.docker.client.exceptions.DockerRequestException: Request error: POST unix://localhost:80/containers/create?name=oak-test-azurite: 404, body: {"message":"open /var/lib/docker/aufs/layers/43fd5be9e594113c6b55cad4904a407a17c6b3419ba4c91ffdac7c3e9bc1eb45: no such file or directory"}

	at com.spotify.docker.client.DefaultDockerClient.propagate(DefaultDockerClient.java:2820)
	at com.spotify.docker.client.DefaultDockerClient.request(DefaultDockerClient.java:2703)
	at com.spotify.docker.client.DefaultDockerClient.createContainer(DefaultDockerClient.java:722)
	... 13 more
Caused by: com.spotify.docker.client.shaded.javax.ws.rs.NotFoundException: HTTP 404 Not Found
	at com.spotify.docker.client.shaded.org.glassfish.jersey.client.JerseyInvocation.convertToException(JerseyInvocation.java:1008)
	at com.spotify.docker.client.shaded.org.glassfish.jersey.client.JerseyInvocation.translate(JerseyInvocation.java:816)
	at com.spotify.docker.client.shaded.org.glassfish.jersey.client.JerseyInvocation.access$700(JerseyInvocation.java:92)
	at com.spotify.docker.client.shaded.org.glassfish.jersey.client.JerseyInvocation$5.completed(JerseyInvocation.java:773)
	at com.spotify.docker.client.shaded.org.glassfish.jersey.client.ClientRuntime.processResponse(ClientRuntime.java:198)
	at com.spotify.docker.client.shaded.org.glassfish.jersey.client.ClientRuntime.access$300(ClientRuntime.java:79)
	at com.spotify.docker.client.shaded.org.glassfish.jersey.client.ClientRuntime$2.run(ClientRuntime.java:180)
	at com.spotify.docker.client.shaded.org.glassfish.jersey.internal.Errors$1.call(Errors.java:271)
	at com.spotify.docker.client.shaded.org.glassfish.jersey.internal.Errors$1.call(Errors.java:267)
	at com.spotify.docker.client.shaded.org.glassfish.jersey.internal.Errors.process(Errors.java:315)
	at com.spotify.docker.client.shaded.org.glassfish.jersey.internal.Errors.process(Errors.java:297)
	at com.spotify.docker.client.shaded.org.glassfish.jersey.internal.Errors.process(Errors.java:267)
	at com.spotify.docker.client.shaded.org.glassfish.jersey.process.internal.RequestScope.runInScope(RequestScope.java:340)
	at com.spotify.docker.client.shaded.org.glassfish.jersey.client.ClientRuntime$3.run(ClientRuntime.java:210)
	at java.util.concurrent.Executors$RunnableAdapter.call(Executors.java:511)
	at java.util.concurrent.FutureTask.run(FutureTask.java:266)
	at java.util.concurrent.ThreadPoolExecutor.runWorker(ThreadPoolExecutor.java:1149)
	at java.util.concurrent.ThreadPoolExecutor$Worker.run(ThreadPoolExecutor.java:624)
	at java.lang.Thread.run(Thread.java:748)


FAILED:  org.apache.jackrabbit.oak.segment.azure.AzureTarFileTest.org.apache.jackrabbit.oak.segment.azure.AzureTarFileTest

Error Message:
Unable to start docker container: DockerConfig{name=oak-test-azurite}

Stack Trace:
java.lang.RuntimeException: Unable to start docker container: DockerConfig{name=oak-test-azurite}
	at com.arakelian.docker.junit.DockerRule$StatementWithDockerRule.evaluate(DockerRule.java:79)
	at org.junit.rules.RunRules.evaluate(RunRules.java:20)
	at org.junit.runners.ParentRunner.run(ParentRunner.java:363)
	at org.apache.maven.surefire.junit4.JUnit4Provider.execute(JUnit4Provider.java:365)
	at org.apache.maven.surefire.junit4.JUnit4Provider.executeWithRerun(JUnit4Provider.java:273)
	at org.apache.maven.surefire.junit4.JUnit4Provider.executeTestSet(JUnit4Provider.java:238)
	at org.apache.maven.surefire.junit4.JUnit4Provider.invoke(JUnit4Provider.java:159)
	at org.apache.maven.surefire.booter.ForkedBooter.invokeProviderInSameClassLoader(ForkedBooter.java:384)
	at org.apache.maven.surefire.booter.ForkedBooter.runSuitesInProcess(ForkedBooter.java:345)
	at org.apache.maven.surefire.booter.ForkedBooter.execute(ForkedBooter.java:126)
	at org.apache.maven.surefire.booter.ForkedBooter.main(ForkedBooter.java:418)
Caused by: java.lang.IllegalStateException: Unable to create container using ContainerConfig{hostname=null, domainname=null, user=null, attachStdin=null, attachStdout=null, attachStderr=null, portSpecs=null, exposedPorts=[10000], tty=null, openStdin=null, stdinOnce=null, env=[executable=blob], cmd=null, image=trekawek/azurite, volumes=[], workingDir=null, entrypoint=null, networkDisabled=false, onBuild=null, labels=null, macAddress=null, hostConfig=HostConfig{binds=null, blkioWeight=null, blkioWeightDevice=null, blkioDeviceReadBps=null, blkioDeviceWriteBps=null, blkioDeviceReadIOps=null, blkioDeviceWriteIOps=null, containerIdFile=null, lxcConf=null, privileged=null, portBindings={10000=[PortBinding{hostIp=0.0.0.0, hostPort=}]}, links=null, publishAllPorts=null, dns=null, dnsOptions=null, dnsSearch=null, extraHosts=null, volumesFrom=null, capAdd=null, capDrop=null, networkMode=null, securityOpt=null, devices=null, memory=null, memorySwap=null, memorySwappiness=null, memoryReservation=null, nanoCpus=null, cpuPeriod=null, cpuShares=null, cpusetCpus=null, cpusetMems=null, cpuQuota=null, cgroupParent=null, restartPolicy=null, logConfig=null, ipcMode=null, ulimits=null, pidMode=null, shmSize=null, oomKillDisable=null, oomScoreAdj=null, autoRemove=null, pidsLimit=null, tmpfs=null, readonlyRootfs=null, storageOpt=null}, stopSignal=null, healthcheck=null, networkingConfig=null}
	at com.arakelian.docker.junit.Container.createContainer(Container.java:486)
	at com.arakelian.docker.junit.Container.start(Container.java:288)
	at com.arakelian.docker.junit.DockerRule$StatementWithDockerRule.evaluate(DockerRule.java:75)
	... 10 more
Caused by: com.spotify.docker.client.exceptions.ImageNotFoundException: Image not found: trekawek/azurite
	at com.spotify.docker.client.DefaultDockerClient.createContainer(DefaultDockerClient.java:727)
	at com.arakelian.docker.junit.Container.createContainer(Container.java:482)
	... 12 more
Caused by: com.spotify.docker.client.exceptions.DockerRequestException: Request error: POST unix://localhost:80/containers/create?name=oak-test-azurite: 404, body: {"message":"open /var/lib/docker/aufs/layers/43fd5be9e594113c6b55cad4904a407a17c6b3419ba4c91ffdac7c3e9bc1eb45: no such file or directory"}

	at com.spotify.docker.client.DefaultDockerClient.propagate(DefaultDockerClient.java:2820)
	at com.spotify.docker.client.DefaultDockerClient.request(DefaultDockerClient.java:2703)
	at com.spotify.docker.client.DefaultDockerClient.createContainer(DefaultDockerClient.java:722)
	... 13 more
Caused by: com.spotify.docker.client.shaded.javax.ws.rs.NotFoundException: HTTP 404 Not Found
	at com.spotify.docker.client.shaded.org.glassfish.jersey.client.JerseyInvocation.convertToException(JerseyInvocation.java:1008)
	at com.spotify.docker.client.shaded.org.glassfish.jersey.client.JerseyInvocation.translate(JerseyInvocation.java:816)
	at com.spotify.docker.client.shaded.org.glassfish.jersey.client.JerseyInvocation.access$700(JerseyInvocation.java:92)
	at com.spotify.docker.client.shaded.org.glassfish.jersey.client.JerseyInvocation$5.completed(JerseyInvocation.java:773)
	at com.spotify.docker.client.shaded.org.glassfish.jersey.client.ClientRuntime.processResponse(ClientRuntime.java:198)
	at com.spotify.docker.client.shaded.org.glassfish.jersey.client.ClientRuntime.access$300(ClientRuntime.java:79)
	at com.spotify.docker.client.shaded.org.glassfish.jersey.client.ClientRuntime$2.run(ClientRuntime.java:180)
	at com.spotify.docker.client.shaded.org.glassfish.jersey.internal.Errors$1.call(Errors.java:271)
	at com.spotify.docker.client.shaded.org.glassfish.jersey.internal.Errors$1.call(Errors.java:267)
	at com.spotify.docker.client.shaded.org.glassfish.jersey.internal.Errors.process(Errors.java:315)
	at com.spotify.docker.client.shaded.org.glassfish.jersey.internal.Errors.process(Errors.java:297)
	at com.spotify.docker.client.shaded.org.glassfish.jersey.internal.Errors.process(Errors.java:267)
	at com.spotify.docker.client.shaded.org.glassfish.jersey.process.internal.RequestScope.runInScope(RequestScope.java:340)
	at com.spotify.docker.client.shaded.org.glassfish.jersey.client.ClientRuntime$3.run(ClientRuntime.java:210)
	at java.util.concurrent.Executors$RunnableAdapter.call(Executors.java:511)
	at java.util.concurrent.FutureTask.run(FutureTask.java:266)
	at java.util.concurrent.ThreadPoolExecutor.runWorker(ThreadPoolExecutor.java:1149)
	at java.util.concurrent.ThreadPoolExecutor$Worker.run(ThreadPoolExecutor.java:624)
	at java.lang.Thread.run(Thread.java:748)


FAILED:  org.apache.jackrabbit.oak.segment.azure.AzureTarFilesTest.org.apache.jackrabbit.oak.segment.azure.AzureTarFilesTest

Error Message:
Unable to start docker container: DockerConfig{name=oak-test-azurite}

Stack Trace:
java.lang.RuntimeException: Unable to start docker container: DockerConfig{name=oak-test-azurite}
	at com.arakelian.docker.junit.DockerRule$StatementWithDockerRule.evaluate(DockerRule.java:79)
	at org.junit.rules.RunRules.evaluate(RunRules.java:20)
	at org.junit.runners.ParentRunner.run(ParentRunner.java:363)
	at org.apache.maven.surefire.junit4.JUnit4Provider.execute(JUnit4Provider.java:365)
	at org.apache.maven.surefire.junit4.JUnit4Provider.executeWithRerun(JUnit4Provider.java:273)
	at org.apache.maven.surefire.junit4.JUnit4Provider.executeTestSet(JUnit4Provider.java:238)
	at org.apache.maven.surefire.junit4.JUnit4Provider.invoke(JUnit4Provider.java:159)
	at org.apache.maven.surefire.booter.ForkedBooter.invokeProviderInSameClassLoader(ForkedBooter.java:384)
	at org.apache.maven.surefire.booter.ForkedBooter.runSuitesInProcess(ForkedBooter.java:345)
	at org.apache.maven.surefire.booter.ForkedBooter.execute(ForkedBooter.java:126)
	at org.apache.maven.surefire.booter.ForkedBooter.main(ForkedBooter.java:418)
Caused by: java.lang.IllegalStateException: Unable to create container using ContainerConfig{hostname=null, domainname=null, user=null, attachStdin=null, attachStdout=null, attachStderr=null, portSpecs=null, exposedPorts=[10000], tty=null, openStdin=null, stdinOnce=null, env=[executable=blob], cmd=null, image=trekawek/azurite, volumes=[], workingDir=null, entrypoint=null, networkDisabled=false, onBuild=null, labels=null, macAddress=null, hostConfig=HostConfig{binds=null, blkioWeight=null, blkioWeightDevice=null, blkioDeviceReadBps=null, blkioDeviceWriteBps=null, blkioDeviceReadIOps=null, blkioDeviceWriteIOps=null, containerIdFile=null, lxcConf=null, privileged=null, portBindings={10000=[PortBinding{hostIp=0.0.0.0, hostPort=}]}, links=null, publishAllPorts=null, dns=null, dnsOptions=null, dnsSearch=null, extraHosts=null, volumesFrom=null, capAdd=null, capDrop=null, networkMode=null, securityOpt=null, devices=null, memory=null, memorySwap=null, memorySwappiness=null, memoryReservation=null, nanoCpus=null, cpuPeriod=null, cpuShares=null, cpusetCpus=null, cpusetMems=null, cpuQuota=null, cgroupParent=null, restartPolicy=null, logConfig=null, ipcMode=null, ulimits=null, pidMode=null, shmSize=null, oomKillDisable=null, oomScoreAdj=null, autoRemove=null, pidsLimit=null, tmpfs=null, readonlyRootfs=null, storageOpt=null}, stopSignal=null, healthcheck=null, networkingConfig=null}
	at com.arakelian.docker.junit.Container.createContainer(Container.java:486)
	at com.arakelian.docker.junit.Container.start(Container.java:288)
	at com.arakelian.docker.junit.DockerRule$StatementWithDockerRule.evaluate(DockerRule.java:75)
	... 10 more
Caused by: com.spotify.docker.client.exceptions.ImageNotFoundException: Image not found: trekawek/azurite
	at com.spotify.docker.client.DefaultDockerClient.createContainer(DefaultDockerClient.java:727)
	at com.arakelian.docker.junit.Container.createContainer(Container.java:482)
	... 12 more
Caused by: com.spotify.docker.client.exceptions.DockerRequestException: Request error: POST unix://localhost:80/containers/create?name=oak-test-azurite: 404, body: {"message":"open /var/lib/docker/aufs/layers/43fd5be9e594113c6b55cad4904a407a17c6b3419ba4c91ffdac7c3e9bc1eb45: no such file or directory"}

	at com.spotify.docker.client.DefaultDockerClient.propagate(DefaultDockerClient.java:2820)
	at com.spotify.docker.client.DefaultDockerClient.request(DefaultDockerClient.java:2703)
	at com.spotify.docker.client.DefaultDockerClient.createContainer(DefaultDockerClient.java:722)
	... 13 more
Caused by: com.spotify.docker.client.shaded.javax.ws.rs.NotFoundException: HTTP 404 Not Found
	at com.spotify.docker.client.shaded.org.glassfish.jersey.client.JerseyInvocation.convertToException(JerseyInvocation.java:1008)
	at com.spotify.docker.client.shaded.org.glassfish.jersey.client.JerseyInvocation.translate(JerseyInvocation.java:816)
	at com.spotify.docker.client.shaded.org.glassfish.jersey.client.JerseyInvocation.access$700(JerseyInvocation.java:92)
	at com.spotify.docker.client.shaded.org.glassfish.jersey.client.JerseyInvocation$5.completed(JerseyInvocation.java:773)
	at com.spotify.docker.client.shaded.org.glassfish.jersey.client.ClientRuntime.processResponse(ClientRuntime.java:198)
	at com.spotify.docker.client.shaded.org.glassfish.jersey.client.ClientRuntime.access$300(ClientRuntime.java:79)
	at com.spotify.docker.client.shaded.org.glassfish.jersey.client.ClientRuntime$2.run(ClientRuntime.java:180)
	at com.spotify.docker.client.shaded.org.glassfish.jersey.internal.Errors$1.call(Errors.java:271)
	at com.spotify.docker.client.shaded.org.glassfish.jersey.internal.Errors$1.call(Errors.java:267)
	at com.spotify.docker.client.shaded.org.glassfish.jersey.internal.Errors.process(Errors.java:315)
	at com.spotify.docker.client.shaded.org.glassfish.jersey.internal.Errors.process(Errors.java:297)
	at com.spotify.docker.client.shaded.org.glassfish.jersey.internal.Errors.process(Errors.java:267)
	at com.spotify.docker.client.shaded.org.glassfish.jersey.process.internal.RequestScope.runInScope(RequestScope.java:340)
	at com.spotify.docker.client.shaded.org.glassfish.jersey.client.ClientRuntime$3.run(ClientRuntime.java:210)
	at java.util.concurrent.Executors$RunnableAdapter.call(Executors.java:511)
	at java.util.concurrent.FutureTask.run(FutureTask.java:266)
	at java.util.concurrent.ThreadPoolExecutor.runWorker(ThreadPoolExecutor.java:1149)
	at java.util.concurrent.ThreadPoolExecutor$Worker.run(ThreadPoolExecutor.java:624)
	at java.lang.Thread.run(Thread.java:748)


FAILED:  org.apache.jackrabbit.oak.segment.azure.AzureTarWriterTest.org.apache.jackrabbit.oak.segment.azure.AzureTarWriterTest

Error Message:
Unable to start docker container: DockerConfig{name=oak-test-azurite}

Stack Trace:
java.lang.RuntimeException: Unable to start docker container: DockerConfig{name=oak-test-azurite}
	at com.arakelian.docker.junit.DockerRule$StatementWithDockerRule.evaluate(DockerRule.java:79)
	at org.junit.rules.RunRules.evaluate(RunRules.java:20)
	at org.junit.runners.ParentRunner.run(ParentRunner.java:363)
	at org.apache.maven.surefire.junit4.JUnit4Provider.execute(JUnit4Provider.java:365)
	at org.apache.maven.surefire.junit4.JUnit4Provider.executeWithRerun(JUnit4Provider.java:273)
	at org.apache.maven.surefire.junit4.JUnit4Provider.executeTestSet(JUnit4Provider.java:238)
	at org.apache.maven.surefire.junit4.JUnit4Provider.invoke(JUnit4Provider.java:159)
	at org.apache.maven.surefire.booter.ForkedBooter.invokeProviderInSameClassLoader(ForkedBooter.java:384)
	at org.apache.maven.surefire.booter.ForkedBooter.runSuitesInProcess(ForkedBooter.java:345)
	at org.apache.maven.surefire.booter.ForkedBooter.execute(ForkedBooter.java:126)
	at org.apache.maven.surefire.booter.ForkedBooter.main(ForkedBooter.java:418)
Caused by: java.lang.IllegalStateException: Unable to create container using ContainerConfig{hostname=null, domainname=null, user=null, attachStdin=null, attachStdout=null, attachStderr=null, portSpecs=null, exposedPorts=[10000], tty=null, openStdin=null, stdinOnce=null, env=[executable=blob], cmd=null, image=trekawek/azurite, volumes=[], workingDir=null, entrypoint=null, networkDisabled=false, onBuild=null, labels=null, macAddress=null, hostConfig=HostConfig{binds=null, blkioWeight=null, blkioWeightDevice=null, blkioDeviceReadBps=null, blkioDeviceWriteBps=null, blkioDeviceReadIOps=null, blkioDeviceWriteIOps=null, containerIdFile=null, lxcConf=null, privileged=null, portBindings={10000=[PortBinding{hostIp=0.0.0.0, hostPort=}]}, links=null, publishAllPorts=null, dns=null, dnsOptions=null, dnsSearch=null, extraHosts=null, volumesFrom=null, capAdd=null, capDrop=null, networkMode=null, securityOpt=null, devices=null, memory=null, memorySwap=null, memorySwappiness=null, memoryReservation=null, nanoCpus=null, cpuPeriod=null, cpuShares=null, cpusetCpus=null, cpusetMems=null, cpuQuota=null, cgroupParent=null, restartPolicy=null, logConfig=null, ipcMode=null, ulimits=null, pidMode=null, shmSize=null, oomKillDisable=null, oomScoreAdj=null, autoRemove=null, pidsLimit=null, tmpfs=null, readonlyRootfs=null, storageOpt=null}, stopSignal=null, healthcheck=null, networkingConfig=null}
	at com.arakelian.docker.junit.Container.createContainer(Container.java:486)
	at com.arakelian.docker.junit.Container.start(Container.java:288)
	at com.arakelian.docker.junit.DockerRule$StatementWithDockerRule.evaluate(DockerRule.java:75)
	... 10 more
Caused by: com.spotify.docker.client.exceptions.ImageNotFoundException: Image not found: trekawek/azurite
	at com.spotify.docker.client.DefaultDockerClient.createContainer(DefaultDockerClient.java:727)
	at com.arakelian.docker.junit.Container.createContainer(Container.java:482)
	... 12 more
Caused by: com.spotify.docker.client.exceptions.DockerRequestException: Request error: POST unix://localhost:80/containers/create?name=oak-test-azurite: 404, body: {"message":"open /var/lib/docker/aufs/layers/43fd5be9e594113c6b55cad4904a407a17c6b3419ba4c91ffdac7c3e9bc1eb45: no such file or directory"}

	at com.spotify.docker.client.DefaultDockerClient.propagate(DefaultDockerClient.java:2820)
	at com.spotify.docker.client.DefaultDockerClient.request(DefaultDockerClient.java:2703)
	at com.spotify.docker.client.DefaultDockerClient.createContainer(DefaultDockerClient.java:722)
	... 13 more
Caused by: com.spotify.docker.client.shaded.javax.ws.rs.NotFoundException: HTTP 404 Not Found
	at com.spotify.docker.client.shaded.org.glassfish.jersey.client.JerseyInvocation.convertToException(JerseyInvocation.java:1008)
	at com.spotify.docker.client.shaded.org.glassfish.jersey.client.JerseyInvocation.translate(JerseyInvocation.java:816)
	at com.spotify.docker.client.shaded.org.glassfish.jersey.client.JerseyInvocation.access$700(JerseyInvocation.java:92)
	at com.spotify.docker.client.shaded.org.glassfish.jersey.client.JerseyInvocation$5.completed(JerseyInvocation.java:773)
	at com.spotify.docker.client.shaded.org.glassfish.jersey.client.ClientRuntime.processResponse(ClientRuntime.java:198)
	at com.spotify.docker.client.shaded.org.glassfish.jersey.client.ClientRuntime.access$300(ClientRuntime.java:79)
	at com.spotify.docker.client.shaded.org.glassfish.jersey.client.ClientRuntime$2.run(ClientRuntime.java:180)
	at com.spotify.docker.client.shaded.org.glassfish.jersey.internal.Errors$1.call(Errors.java:271)
	at com.spotify.docker.client.shaded.org.glassfish.jersey.internal.Errors$1.call(Errors.java:267)
	at com.spotify.docker.client.shaded.org.glassfish.jersey.internal.Errors.process(Errors.java:315)
	at com.spotify.docker.client.shaded.org.glassfish.jersey.internal.Errors.process(Errors.java:297)
	at com.spotify.docker.client.shaded.org.glassfish.jersey.internal.Errors.process(Errors.java:267)
	at com.spotify.docker.client.shaded.org.glassfish.jersey.process.internal.RequestScope.runInScope(RequestScope.java:340)
	at com.spotify.docker.client.shaded.org.glassfish.jersey.client.ClientRuntime$3.run(ClientRuntime.java:210)
	at java.util.concurrent.Executors$RunnableAdapter.call(Executors.java:511)
	at java.util.concurrent.FutureTask.run(FutureTask.java:266)
	at java.util.concurrent.ThreadPoolExecutor.runWorker(ThreadPoolExecutor.java:1149)
	at java.util.concurrent.ThreadPoolExecutor$Worker.run(ThreadPoolExecutor.java:624)
	at java.lang.Thread.run(Thread.java:748)


FAILED:  org.apache.jackrabbit.oak.segment.azure.journal.AzureJournalReaderTest.org.apache.jackrabbit.oak.segment.azure.journal.AzureJournalReaderTest

Error Message:
Unable to start docker container: DockerConfig{name=oak-test-azurite}

Stack Trace:
java.lang.RuntimeException: Unable to start docker container: DockerConfig{name=oak-test-azurite}
	at com.arakelian.docker.junit.DockerRule$StatementWithDockerRule.evaluate(DockerRule.java:79)
	at org.junit.rules.RunRules.evaluate(RunRules.java:20)
	at org.junit.runners.ParentRunner.run(ParentRunner.java:363)
	at org.apache.maven.surefire.junit4.JUnit4Provider.execute(JUnit4Provider.java:365)
	at org.apache.maven.surefire.junit4.JUnit4Provider.executeWithRerun(JUnit4Provider.java:273)
	at org.apache.maven.surefire.junit4.JUnit4Provider.executeTestSet(JUnit4Provider.java:238)
	at org.apache.maven.surefire.junit4.JUnit4Provider.invoke(JUnit4Provider.java:159)
	at org.apache.maven.surefire.booter.ForkedBooter.invokeProviderInSameClassLoader(ForkedBooter.java:384)
	at org.apache.maven.surefire.booter.ForkedBooter.runSuitesInProcess(ForkedBooter.java:345)
	at org.apache.maven.surefire.booter.ForkedBooter.execute(ForkedBooter.java:126)
	at org.apache.maven.surefire.booter.ForkedBooter.main(ForkedBooter.java:418)
Caused by: java.lang.IllegalStateException: Unable to create container using ContainerConfig{hostname=null, domainname=null, user=null, attachStdin=null, attachStdout=null, attachStderr=null, portSpecs=null, exposedPorts=[10000], tty=null, openStdin=null, stdinOnce=null, env=[executable=blob], cmd=null, image=trekawek/azurite, volumes=[], workingDir=null, entrypoint=null, networkDisabled=false, onBuild=null, labels=null, macAddress=null, hostConfig=HostConfig{binds=null, blkioWeight=null, blkioWeightDevice=null, blkioDeviceReadBps=null, blkioDeviceWriteBps=null, blkioDeviceReadIOps=null, blkioDeviceWriteIOps=null, containerIdFile=null, lxcConf=null, privileged=null, portBindings={10000=[PortBinding{hostIp=0.0.0.0, hostPort=}]}, links=null, publishAllPorts=null, dns=null, dnsOptions=null, dnsSearch=null, extraHosts=null, volumesFrom=null, capAdd=null, capDrop=null, networkMode=null, securityOpt=null, devices=null, memory=null, memorySwap=null, memorySwappiness=null, memoryReservation=null, nanoCpus=null, cpuPeriod=null, cpuShares=null, cpusetCpus=null, cpusetMems=null, cpuQuota=null, cgroupParent=null, restartPolicy=null, logConfig=null, ipcMode=null, ulimits=null, pidMode=null, shmSize=null, oomKillDisable=null, oomScoreAdj=null, autoRemove=null, pidsLimit=null, tmpfs=null, readonlyRootfs=null, storageOpt=null}, stopSignal=null, healthcheck=null, networkingConfig=null}
	at com.arakelian.docker.junit.Container.createContainer(Container.java:486)
	at com.arakelian.docker.junit.Container.start(Container.java:288)
	at com.arakelian.docker.junit.DockerRule$StatementWithDockerRule.evaluate(DockerRule.java:75)
	... 10 more
Caused by: com.spotify.docker.client.exceptions.ImageNotFoundException: Image not found: trekawek/azurite
	at com.spotify.docker.client.DefaultDockerClient.createContainer(DefaultDockerClient.java:727)
	at com.arakelian.docker.junit.Container.createContainer(Container.java:482)
	... 12 more
Caused by: com.spotify.docker.client.exceptions.DockerRequestException: Request error: POST unix://localhost:80/containers/create?name=oak-test-azurite: 404, body: {"message":"open /var/lib/docker/aufs/layers/43fd5be9e594113c6b55cad4904a407a17c6b3419ba4c91ffdac7c3e9bc1eb45: no such file or directory"}

	at com.spotify.docker.client.DefaultDockerClient.propagate(DefaultDockerClient.java:2820)
	at com.spotify.docker.client.DefaultDockerClient.request(DefaultDockerClient.java:2703)
	at com.spotify.docker.client.DefaultDockerClient.createContainer(DefaultDockerClient.java:722)
	... 13 more
Caused by: com.spotify.docker.client.shaded.javax.ws.rs.NotFoundException: HTTP 404 Not Found
	at com.spotify.docker.client.shaded.org.glassfish.jersey.client.JerseyInvocation.convertToException(JerseyInvocation.java:1008)
	at com.spotify.docker.client.shaded.org.glassfish.jersey.client.JerseyInvocation.translate(JerseyInvocation.java:816)
	at com.spotify.docker.client.shaded.org.glassfish.jersey.client.JerseyInvocation.access$700(JerseyInvocation.java:92)
	at com.spotify.docker.client.shaded.org.glassfish.jersey.client.JerseyInvocation$5.completed(JerseyInvocation.java:773)
	at com.spotify.docker.client.shaded.org.glassfish.jersey.client.ClientRuntime.processResponse(ClientRuntime.java:198)
	at com.spotify.docker.client.shaded.org.glassfish.jersey.client.ClientRuntime.access$300(ClientRuntime.java:79)
	at com.spotify.docker.client.shaded.org.glassfish.jersey.client.ClientRuntime$2.run(ClientRuntime.java:180)
	at com.spotify.docker.client.shaded.org.glassfish.jersey.internal.Errors$1.call(Errors.java:271)
	at com.spotify.docker.client.shaded.org.glassfish.jersey.internal.Errors$1.call(Errors.java:267)
	at com.spotify.docker.client.shaded.org.glassfish.jersey.internal.Errors.process(Errors.java:315)
	at com.spotify.docker.client.shaded.org.glassfish.jersey.internal.Errors.process(Errors.java:297)
	at com.spotify.docker.client.shaded.org.glassfish.jersey.internal.Errors.process(Errors.java:267)
	at com.spotify.docker.client.shaded.org.glassfish.jersey.process.internal.RequestScope.runInScope(RequestScope.java:340)
	at com.spotify.docker.client.shaded.org.glassfish.jersey.client.ClientRuntime$3.run(ClientRuntime.java:210)
	at java.util.concurrent.Executors$RunnableAdapter.call(Executors.java:511)
	at java.util.concurrent.FutureTask.run(FutureTask.java:266)
	at java.util.concurrent.ThreadPoolExecutor.runWorker(ThreadPoolExecutor.java:1149)
	at java.util.concurrent.ThreadPoolExecutor$Worker.run(ThreadPoolExecutor.java:624)
	at java.lang.Thread.run(Thread.java:748)


FAILED:  org.apache.jackrabbit.oak.segment.azure.journal.AzureTarRevisionsTest.org.apache.jackrabbit.oak.segment.azure.journal.AzureTarRevisionsTest

Error Message:
Unable to start docker container: DockerConfig{name=oak-test-azurite}

Stack Trace:
java.lang.RuntimeException: Unable to start docker container: DockerConfig{name=oak-test-azurite}
	at com.arakelian.docker.junit.DockerRule$StatementWithDockerRule.evaluate(DockerRule.java:79)
	at org.junit.rules.RunRules.evaluate(RunRules.java:20)
	at org.junit.runners.ParentRunner.run(ParentRunner.java:363)
	at org.apache.maven.surefire.junit4.JUnit4Provider.execute(JUnit4Provider.java:365)
	at org.apache.maven.surefire.junit4.JUnit4Provider.executeWithRerun(JUnit4Provider.java:273)
	at org.apache.maven.surefire.junit4.JUnit4Provider.executeTestSet(JUnit4Provider.java:238)
	at org.apache.maven.surefire.junit4.JUnit4Provider.invoke(JUnit4Provider.java:159)
	at org.apache.maven.surefire.booter.ForkedBooter.invokeProviderInSameClassLoader(ForkedBooter.java:384)
	at org.apache.maven.surefire.booter.ForkedBooter.runSuitesInProcess(ForkedBooter.java:345)
	at org.apache.maven.surefire.booter.ForkedBooter.execute(ForkedBooter.java:126)
	at org.apache.maven.surefire.booter.ForkedBooter.main(ForkedBooter.java:418)
Caused by: java.lang.IllegalStateException: Unable to create container using ContainerConfig{hostname=null, domainname=null, user=null, attachStdin=null, attachStdout=null, attachStderr=null, portSpecs=null, exposedPorts=[10000], tty=null, openStdin=null, stdinOnce=null, env=[executable=blob], cmd=null, image=trekawek/azurite, volumes=[], workingDir=null, entrypoint=null, networkDisabled=false, onBuild=null, labels=null, macAddress=null, hostConfig=HostConfig{binds=null, blkioWeight=null, blkioWeightDevice=null, blkioDeviceReadBps=null, blkioDeviceWriteBps=null, blkioDeviceReadIOps=null, blkioDeviceWriteIOps=null, containerIdFile=null, lxcConf=null, privileged=null, portBindings={10000=[PortBinding{hostIp=0.0.0.0, hostPort=}]}, links=null, publishAllPorts=null, dns=null, dnsOptions=null, dnsSearch=null, extraHosts=null, volumesFrom=null, capAdd=null, capDrop=null, networkMode=null, securityOpt=null, devices=null, memory=null, memorySwap=null, memorySwappiness=null, memoryReservation=null, nanoCpus=null, cpuPeriod=null, cpuShares=null, cpusetCpus=null, cpusetMems=null, cpuQuota=null, cgroupParent=null, restartPolicy=null, logConfig=null, ipcMode=null, ulimits=null, pidMode=null, shmSize=null, oomKillDisable=null, oomScoreAdj=null, autoRemove=null, pidsLimit=null, tmpfs=null, readonlyRootfs=null, storageOpt=null}, stopSignal=null, healthcheck=null, networkingConfig=null}
	at com.arakelian.docker.junit.Container.createContainer(Container.java:486)
	at com.arakelian.docker.junit.Container.start(Container.java:288)
	at com.arakelian.docker.junit.DockerRule$StatementWithDockerRule.evaluate(DockerRule.java:75)
	... 10 more
Caused by: com.spotify.docker.client.exceptions.ImageNotFoundException: Image not found: trekawek/azurite
	at com.spotify.docker.client.DefaultDockerClient.createContainer(DefaultDockerClient.java:727)
	at com.arakelian.docker.junit.Container.createContainer(Container.java:482)
	... 12 more
Caused by: com.spotify.docker.client.exceptions.DockerRequestException: Request error: POST unix://localhost:80/containers/create?name=oak-test-azurite: 404, body: {"message":"open /var/lib/docker/aufs/layers/43fd5be9e594113c6b55cad4904a407a17c6b3419ba4c91ffdac7c3e9bc1eb45: no such file or directory"}

	at com.spotify.docker.client.DefaultDockerClient.propagate(DefaultDockerClient.java:2820)
	at com.spotify.docker.client.DefaultDockerClient.request(DefaultDockerClient.java:2703)
	at com.spotify.docker.client.DefaultDockerClient.createContainer(DefaultDockerClient.java:722)
	... 13 more
Caused by: com.spotify.docker.client.shaded.javax.ws.rs.NotFoundException: HTTP 404 Not Found
	at com.spotify.docker.client.shaded.org.glassfish.jersey.client.JerseyInvocation.convertToException(JerseyInvocation.java:1008)
	at com.spotify.docker.client.shaded.org.glassfish.jersey.client.JerseyInvocation.translate(JerseyInvocation.java:816)
	at com.spotify.docker.client.shaded.org.glassfish.jersey.client.JerseyInvocation.access$700(JerseyInvocation.java:92)
	at com.spotify.docker.client.shaded.org.glassfish.jersey.client.JerseyInvocation$5.completed(JerseyInvocation.java:773)
	at com.spotify.docker.client.shaded.org.glassfish.jersey.client.ClientRuntime.processResponse(ClientRuntime.java:198)
	at com.spotify.docker.client.shaded.org.glassfish.jersey.client.ClientRuntime.access$300(ClientRuntime.java:79)
	at com.spotify.docker.client.shaded.org.glassfish.jersey.client.ClientRuntime$2.run(ClientRuntime.java:180)
	at com.spotify.docker.client.shaded.org.glassfish.jersey.internal.Errors$1.call(Errors.java:271)
	at com.spotify.docker.client.shaded.org.glassfish.jersey.internal.Errors$1.call(Errors.java:267)
	at com.spotify.docker.client.shaded.org.glassfish.jersey.internal.Errors.process(Errors.java:315)
	at com.spotify.docker.client.shaded.org.glassfish.jersey.internal.Errors.process(Errors.java:297)
	at com.spotify.docker.client.shaded.org.glassfish.jersey.internal.Errors.process(Errors.java:267)
	at com.spotify.docker.client.shaded.org.glassfish.jersey.process.internal.RequestScope.runInScope(RequestScope.java:340)
	at com.spotify.docker.client.shaded.org.glassfish.jersey.client.ClientRuntime$3.run(ClientRuntime.java:210)
	at java.util.concurrent.Executors$RunnableAdapter.call(Executors.java:511)
	at java.util.concurrent.FutureTask.run(FutureTask.java:266)
	at java.util.concurrent.ThreadPoolExecutor.runWorker(ThreadPoolExecutor.java:1149)
	at java.util.concurrent.ThreadPoolExecutor$Worker.run(ThreadPoolExecutor.java:624)
	at java.lang.Thread.run(Thread.java:748)


FAILED:  org.apache.jackrabbit.oak.segment.azure.journal.ReverseFileReaderTest.org.apache.jackrabbit.oak.segment.azure.journal.ReverseFileReaderTest

Error Message:
Unable to start docker container: DockerConfig{name=oak-test-azurite}

Stack Trace:
java.lang.RuntimeException: Unable to start docker container: DockerConfig{name=oak-test-azurite}
	at com.arakelian.docker.junit.DockerRule$StatementWithDockerRule.evaluate(DockerRule.java:79)
	at org.junit.rules.RunRules.evaluate(RunRules.java:20)
	at org.junit.runners.ParentRunner.run(ParentRunner.java:363)
	at org.apache.maven.surefire.junit4.JUnit4Provider.execute(JUnit4Provider.java:365)
	at org.apache.maven.surefire.junit4.JUnit4Provider.executeWithRerun(JUnit4Provider.java:273)
	at org.apache.maven.surefire.junit4.JUnit4Provider.executeTestSet(JUnit4Provider.java:238)
	at org.apache.maven.surefire.junit4.JUnit4Provider.invoke(JUnit4Provider.java:159)
	at org.apache.maven.surefire.booter.ForkedBooter.invokeProviderInSameClassLoader(ForkedBooter.java:384)
	at org.apache.maven.surefire.booter.ForkedBooter.runSuitesInProcess(ForkedBooter.java:345)
	at org.apache.maven.surefire.booter.ForkedBooter.execute(ForkedBooter.java:126)
	at org.apache.maven.surefire.booter.ForkedBooter.main(ForkedBooter.java:418)
Caused by: java.lang.IllegalStateException: Unable to create container using ContainerConfig{hostname=null, domainname=null, user=null, attachStdin=null, attachStdout=null, attachStderr=null, portSpecs=null, exposedPorts=[10000], tty=null, openStdin=null, stdinOnce=null, env=[executable=blob], cmd=null, image=trekawek/azurite, volumes=[], workingDir=null, entrypoint=null, networkDisabled=false, onBuild=null, labels=null, macAddress=null, hostConfig=HostConfig{binds=null, blkioWeight=null, blkioWeightDevice=null, blkioDeviceReadBps=null, blkioDeviceWriteBps=null, blkioDeviceReadIOps=null, blkioDeviceWriteIOps=null, containerIdFile=null, lxcConf=null, privileged=null, portBindings={10000=[PortBinding{hostIp=0.0.0.0, hostPort=}]}, links=null, publishAllPorts=null, dns=null, dnsOptions=null, dnsSearch=null, extraHosts=null, volumesFrom=null, capAdd=null, capDrop=null, networkMode=null, securityOpt=null, devices=null, memory=null, memorySwap=null, memorySwappiness=null, memoryReservation=null, nanoCpus=null, cpuPeriod=null, cpuShares=null, cpusetCpus=null, cpusetMems=null, cpuQuota=null, cgroupParent=null, restartPolicy=null, logConfig=null, ipcMode=null, ulimits=null, pidMode=null, shmSize=null, oomKillDisable=null, oomScoreAdj=null, autoRemove=null, pidsLimit=null, tmpfs=null, readonlyRootfs=null, storageOpt=null}, stopSignal=null, healthcheck=null, networkingConfig=null}
	at com.arakelian.docker.junit.Container.createContainer(Container.java:486)
	at com.arakelian.docker.junit.Container.start(Container.java:288)
	at com.arakelian.docker.junit.DockerRule$StatementWithDockerRule.evaluate(DockerRule.java:75)
	... 10 more
Caused by: com.spotify.docker.client.exceptions.ImageNotFoundException: Image not found: trekawek/azurite
	at com.spotify.docker.client.DefaultDockerClient.createContainer(DefaultDockerClient.java:727)
	at com.arakelian.docker.junit.Container.createContainer(Container.java:482)
	... 12 more
Caused by: com.spotify.docker.client.exceptions.DockerRequestException: Request error: POST unix://localhost:80/containers/create?name=oak-test-azurite: 404, body: {"message":"open /var/lib/docker/aufs/layers/43fd5be9e594113c6b55cad4904a407a17c6b3419ba4c91ffdac7c3e9bc1eb45: no such file or directory"}

	at com.spotify.docker.client.DefaultDockerClient.propagate(DefaultDockerClient.java:2820)
	at com.spotify.docker.client.DefaultDockerClient.request(DefaultDockerClient.java:2703)
	at com.spotify.docker.client.DefaultDockerClient.createContainer(DefaultDockerClient.java:722)
	... 13 more
Caused by: com.spotify.docker.client.shaded.javax.ws.rs.NotFoundException: HTTP 404 Not Found
	at com.spotify.docker.client.shaded.org.glassfish.jersey.client.JerseyInvocation.convertToException(JerseyInvocation.java:1008)
	at com.spotify.docker.client.shaded.org.glassfish.jersey.client.JerseyInvocation.translate(JerseyInvocation.java:816)
	at com.spotify.docker.client.shaded.org.glassfish.jersey.client.JerseyInvocation.access$700(JerseyInvocation.java:92)
	at com.spotify.docker.client.shaded.org.glassfish.jersey.client.JerseyInvocation$5.completed(JerseyInvocation.java:773)
	at com.spotify.docker.client.shaded.org.glassfish.jersey.client.ClientRuntime.processResponse(ClientRuntime.java:198)
	at com.spotify.docker.client.shaded.org.glassfish.jersey.client.ClientRuntime.access$300(ClientRuntime.java:79)
	at com.spotify.docker.client.shaded.org.glassfish.jersey.client.ClientRuntime$2.run(ClientRuntime.java:180)
	at com.spotify.docker.client.shaded.org.glassfish.jersey.internal.Errors$1.call(Errors.java:271)
	at com.spotify.docker.client.shaded.org.glassfish.jersey.internal.Errors$1.call(Errors.java:267)
	at com.spotify.docker.client.shaded.org.glassfish.jersey.internal.Errors.process(Errors.java:315)
	at com.spotify.docker.client.shaded.org.glassfish.jersey.internal.Errors.process(Errors.java:297)
	at com.spotify.docker.client.shaded.org.glassfish.jersey.internal.Errors.process(Errors.java:267)
	at com.spotify.docker.client.shaded.org.glassfish.jersey.process.internal.RequestScope.runInScope(RequestScope.java:340)
	at com.spotify.docker.client.shaded.org.glassfish.jersey.client.ClientRuntime$3.run(ClientRuntime.java:210)
	at java.util.concurrent.Executors$RunnableAdapter.call(Executors.java:511)
	at java.util.concurrent.FutureTask.run(FutureTask.java:266)
	at java.util.concurrent.ThreadPoolExecutor.runWorker(ThreadPoolExecutor.java:1149)
	at java.util.concurrent.ThreadPoolExecutor$Worker.run(ThreadPoolExecutor.java:624)
	at java.lang.Thread.run(Thread.java:748)


FAILED:  org.apache.jackrabbit.oak.segment.split.SplitPersistenceBlobTest.org.apache.jackrabbit.oak.segment.split.SplitPersistenceBlobTest

Error Message:
Unable to start docker container: DockerConfig{name=oak-test-azurite}

Stack Trace:
java.lang.RuntimeException: Unable to start docker container: DockerConfig{name=oak-test-azurite}
	at com.arakelian.docker.junit.DockerRule$StatementWithDockerRule.evaluate(DockerRule.java:79)
	at org.junit.rules.RunRules.evaluate(RunRules.java:20)
	at org.junit.runners.ParentRunner.run(ParentRunner.java:363)
	at org.apache.maven.surefire.junit4.JUnit4Provider.execute(JUnit4Provider.java:365)
	at org.apache.maven.surefire.junit4.JUnit4Provider.executeWithRerun(JUnit4Provider.java:273)
	at org.apache.maven.surefire.junit4.JUnit4Provider.executeTestSet(JUnit4Provider.java:238)
	at org.apache.maven.surefire.junit4.JUnit4Provider.invoke(JUnit4Provider.java:159)
	at org.apache.maven.surefire.booter.ForkedBooter.invokeProviderInSameClassLoader(ForkedBooter.java:384)
	at org.apache.maven.surefire.booter.ForkedBooter.runSuitesInProcess(ForkedBooter.java:345)
	at org.apache.maven.surefire.booter.ForkedBooter.execute(ForkedBooter.java:126)
	at org.apache.maven.surefire.booter.ForkedBooter.main(ForkedBooter.java:418)
Caused by: java.lang.IllegalStateException: Unable to create container using ContainerConfig{hostname=null, domainname=null, user=null, attachStdin=null, attachStdout=null, attachStderr=null, portSpecs=null, exposedPorts=[10000], tty=null, openStdin=null, stdinOnce=null, env=[executable=blob], cmd=null, image=trekawek/azurite, volumes=[], workingDir=null, entrypoint=null, networkDisabled=false, onBuild=null, labels=null, macAddress=null, hostConfig=HostConfig{binds=null, blkioWeight=null, blkioWeightDevice=null, blkioDeviceReadBps=null, blkioDeviceWriteBps=null, blkioDeviceReadIOps=null, blkioDeviceWriteIOps=null, containerIdFile=null, lxcConf=null, privileged=null, portBindings={10000=[PortBinding{hostIp=0.0.0.0, hostPort=}]}, links=null, publishAllPorts=null, dns=null, dnsOptions=null, dnsSearch=null, extraHosts=null, volumesFrom=null, capAdd=null, capDrop=null, networkMode=null, securityOpt=null, devices=null, memory=null, memorySwap=null, memorySwappiness=null, memoryReservation=null, nanoCpus=null, cpuPeriod=null, cpuShares=null, cpusetCpus=null, cpusetMems=null, cpuQuota=null, cgroupParent=null, restartPolicy=null, logConfig=null, ipcMode=null, ulimits=null, pidMode=null, shmSize=null, oomKillDisable=null, oomScoreAdj=null, autoRemove=null, pidsLimit=null, tmpfs=null, readonlyRootfs=null, storageOpt=null}, stopSignal=null, healthcheck=null, networkingConfig=null}
	at com.arakelian.docker.junit.Container.createContainer(Container.java:486)
	at com.arakelian.docker.junit.Container.start(Container.java:288)
	at com.arakelian.docker.junit.DockerRule$StatementWithDockerRule.evaluate(DockerRule.java:75)
	... 10 more
Caused by: com.spotify.docker.client.exceptions.ImageNotFoundException: Image not found: trekawek/azurite
	at com.spotify.docker.client.DefaultDockerClient.createContainer(DefaultDockerClient.java:727)
	at com.arakelian.docker.junit.Container.createContainer(Container.java:482)
	... 12 more
Caused by: com.spotify.docker.client.exceptions.DockerRequestException: Request error: POST unix://localhost:80/containers/create?name=oak-test-azurite: 404, body: {"message":"open /var/lib/docker/aufs/layers/43fd5be9e594113c6b55cad4904a407a17c6b3419ba4c91ffdac7c3e9bc1eb45: no such file or directory"}

	at com.spotify.docker.client.DefaultDockerClient.propagate(DefaultDockerClient.java:2820)
	at com.spotify.docker.client.DefaultDockerClient.request(DefaultDockerClient.java:2703)
	at com.spotify.docker.client.DefaultDockerClient.createContainer(DefaultDockerClient.java:722)
	... 13 more
Caused by: com.spotify.docker.client.shaded.javax.ws.rs.NotFoundException: HTTP 404 Not Found
	at com.spotify.docker.client.shaded.org.glassfish.jersey.client.JerseyInvocation.convertToException(JerseyInvocation.java:1008)
	at com.spotify.docker.client.shaded.org.glassfish.jersey.client.JerseyInvocation.translate(JerseyInvocation.java:816)
	at com.spotify.docker.client.shaded.org.glassfish.jersey.client.JerseyInvocation.access$700(JerseyInvocation.java:92)
	at com.spotify.docker.client.shaded.org.glassfish.jersey.client.JerseyInvocation$5.completed(JerseyInvocation.java:773)
	at com.spotify.docker.client.shaded.org.glassfish.jersey.client.ClientRuntime.processResponse(ClientRuntime.java:198)
	at com.spotify.docker.client.shaded.org.glassfish.jersey.client.ClientRuntime.access$300(ClientRuntime.java:79)
	at com.spotify.docker.client.shaded.org.glassfish.jersey.client.ClientRuntime$2.run(ClientRuntime.java:180)
	at com.spotify.docker.client.shaded.org.glassfish.jersey.internal.Errors$1.call(Errors.java:271)
	at com.spotify.docker.client.shaded.org.glassfish.jersey.internal.Errors$1.call(Errors.java:267)
	at com.spotify.docker.client.shaded.org.glassfish.jersey.internal.Errors.process(Errors.java:315)
	at com.spotify.docker.client.shaded.org.glassfish.jersey.internal.Errors.process(Errors.java:297)
	at com.spotify.docker.client.shaded.org.glassfish.jersey.internal.Errors.process(Errors.java:267)
	at com.spotify.docker.client.shaded.org.glassfish.jersey.process.internal.RequestScope.runInScope(RequestScope.java:340)
	at com.spotify.docker.client.shaded.org.glassfish.jersey.client.ClientRuntime$3.run(ClientRuntime.java:210)
	at java.util.concurrent.Executors$RunnableAdapter.call(Executors.java:511)
	at java.util.concurrent.FutureTask.run(FutureTask.java:266)
	at java.util.concurrent.ThreadPoolExecutor.runWorker(ThreadPoolExecutor.java:1149)
	at java.util.concurrent.ThreadPoolExecutor$Worker.run(ThreadPoolExecutor.java:624)
	at java.lang.Thread.run(Thread.java:748)


FAILED:  org.apache.jackrabbit.oak.segment.split.SplitPersistenceTest.org.apache.jackrabbit.oak.segment.split.SplitPersistenceTest

Error Message:
Unable to start docker container: DockerConfig{name=oak-test-azurite}

Stack Trace:
java.lang.RuntimeException: Unable to start docker container: DockerConfig{name=oak-test-azurite}
	at com.arakelian.docker.junit.DockerRule$StatementWithDockerRule.evaluate(DockerRule.java:79)
	at org.junit.rules.RunRules.evaluate(RunRules.java:20)
	at org.junit.runners.ParentRunner.run(ParentRunner.java:363)
	at org.apache.maven.surefire.junit4.JUnit4Provider.execute(JUnit4Provider.java:365)
	at org.apache.maven.surefire.junit4.JUnit4Provider.executeWithRerun(JUnit4Provider.java:273)
	at org.apache.maven.surefire.junit4.JUnit4Provider.executeTestSet(JUnit4Provider.java:238)
	at org.apache.maven.surefire.junit4.JUnit4Provider.invoke(JUnit4Provider.java:159)
	at org.apache.maven.surefire.booter.ForkedBooter.invokeProviderInSameClassLoader(ForkedBooter.java:384)
	at org.apache.maven.surefire.booter.ForkedBooter.runSuitesInProcess(ForkedBooter.java:345)
	at org.apache.maven.surefire.booter.ForkedBooter.execute(ForkedBooter.java:126)
	at org.apache.maven.surefire.booter.ForkedBooter.main(ForkedBooter.java:418)
Caused by: java.lang.IllegalStateException: Unable to create container using ContainerConfig{hostname=null, domainname=null, user=null, attachStdin=null, attachStdout=null, attachStderr=null, portSpecs=null, exposedPorts=[10000], tty=null, openStdin=null, stdinOnce=null, env=[executable=blob], cmd=null, image=trekawek/azurite, volumes=[], workingDir=null, entrypoint=null, networkDisabled=false, onBuild=null, labels=null, macAddress=null, hostConfig=HostConfig{binds=null, blkioWeight=null, blkioWeightDevice=null, blkioDeviceReadBps=null, blkioDeviceWriteBps=null, blkioDeviceReadIOps=null, blkioDeviceWriteIOps=null, containerIdFile=null, lxcConf=null, privileged=null, portBindings={10000=[PortBinding{hostIp=0.0.0.0, hostPort=}]}, links=null, publishAllPorts=null, dns=null, dnsOptions=null, dnsSearch=null, extraHosts=null, volumesFrom=null, capAdd=null, capDrop=null, networkMode=null, securityOpt=null, devices=null, memory=null, memorySwap=null, memorySwappiness=null, memoryReservation=null, nanoCpus=null, cpuPeriod=null, cpuShares=null, cpusetCpus=null, cpusetMems=null, cpuQuota=null, cgroupParent=null, restartPolicy=null, logConfig=null, ipcMode=null, ulimits=null, pidMode=null, shmSize=null, oomKillDisable=null, oomScoreAdj=null, autoRemove=null, pidsLimit=null, tmpfs=null, readonlyRootfs=null, storageOpt=null}, stopSignal=null, healthcheck=null, networkingConfig=null}
	at com.arakelian.docker.junit.Container.createContainer(Container.java:486)
	at com.arakelian.docker.junit.Container.start(Container.java:288)
	at com.arakelian.docker.junit.DockerRule$StatementWithDockerRule.evaluate(DockerRule.java:75)
	... 10 more
Caused by: com.spotify.docker.client.exceptions.ImageNotFoundException: Image not found: trekawek/azurite
	at com.spotify.docker.client.DefaultDockerClient.createContainer(DefaultDockerClient.java:727)
	at com.arakelian.docker.junit.Container.createContainer(Container.java:482)
	... 12 more
Caused by: com.spotify.docker.client.exceptions.DockerRequestException: Request error: POST unix://localhost:80/containers/create?name=oak-test-azurite: 404, body: {"message":"open /var/lib/docker/aufs/layers/43fd5be9e594113c6b55cad4904a407a17c6b3419ba4c91ffdac7c3e9bc1eb45: no such file or directory"}

	at com.spotify.docker.client.DefaultDockerClient.propagate(DefaultDockerClient.java:2820)
	at com.spotify.docker.client.DefaultDockerClient.request(DefaultDockerClient.java:2703)
	at com.spotify.docker.client.DefaultDockerClient.createContainer(DefaultDockerClient.java:722)
	... 13 more
Caused by: com.spotify.docker.client.shaded.javax.ws.rs.NotFoundException: HTTP 404 Not Found
	at com.spotify.docker.client.shaded.org.glassfish.jersey.client.JerseyInvocation.convertToException(JerseyInvocation.java:1008)
	at com.spotify.docker.client.shaded.org.glassfish.jersey.client.JerseyInvocation.translate(JerseyInvocation.java:816)
	at com.spotify.docker.client.shaded.org.glassfish.jersey.client.JerseyInvocation.access$700(JerseyInvocation.java:92)
	at com.spotify.docker.client.shaded.org.glassfish.jersey.client.JerseyInvocation$5.completed(JerseyInvocation.java:773)
	at com.spotify.docker.client.shaded.org.glassfish.jersey.client.ClientRuntime.processResponse(ClientRuntime.java:198)
	at com.spotify.docker.client.shaded.org.glassfish.jersey.client.ClientRuntime.access$300(ClientRuntime.java:79)
	at com.spotify.docker.client.shaded.org.glassfish.jersey.client.ClientRuntime$2.run(ClientRuntime.java:180)
	at com.spotify.docker.client.shaded.org.glassfish.jersey.internal.Errors$1.call(Errors.java:271)
	at com.spotify.docker.client.shaded.org.glassfish.jersey.internal.Errors$1.call(Errors.java:267)
	at com.spotify.docker.client.shaded.org.glassfish.jersey.internal.Errors.process(Errors.java:315)
	at com.spotify.docker.client.shaded.org.glassfish.jersey.internal.Errors.process(Errors.java:297)
	at com.spotify.docker.client.shaded.org.glassfish.jersey.internal.Errors.process(Errors.java:267)
	at com.spotify.docker.client.shaded.org.glassfish.jersey.process.internal.RequestScope.runInScope(RequestScope.java:340)
	at com.spotify.docker.client.shaded.org.glassfish.jersey.client.ClientRuntime$3.run(ClientRuntime.java:210)
	at java.util.concurrent.Executors$RunnableAdapter.call(Executors.java:511)
	at java.util.concurrent.FutureTask.run(FutureTask.java:266)
	at java.util.concurrent.ThreadPoolExecutor.runWorker(ThreadPoolExecutor.java:1149)
	at java.util.concurrent.ThreadPoolExecutor$Worker.run(ThreadPoolExecutor.java:624)
	at java.lang.Thread.run(Thread.java:748)
Mime
View raw message