jackrabbit-oak-issues mailing list archives

Site index · List index
Message view « Date » · « Thread »
Top « Date » · « Thread »
From Michael Dürig (JIRA) <j...@apache.org>
Subject [jira] [Updated] (OAK-1267) Failure in ObservationRefreshTest
Date Mon, 03 Mar 2014 13:55:20 GMT

     [ https://issues.apache.org/jira/browse/OAK-1267?page=com.atlassian.jira.plugin.system.issuetabpanels:all-tabpanel
]

Michael Dürig updated OAK-1267:
-------------------------------

    Labels: observation  (was: )

> Failure in ObservationRefreshTest 
> ----------------------------------
>
>                 Key: OAK-1267
>                 URL: https://issues.apache.org/jira/browse/OAK-1267
>             Project: Jackrabbit Oak
>          Issue Type: Bug
>          Components: jcr
>            Reporter: angela
>            Assignee: Michael Dürig
>              Labels: observation
>             Fix For: 0.18
>
>
> Failed tests:   observation[2](org.apache.jackrabbit.oak.jcr.observation.ObservationRefreshTest):
added nodes expected:<1000> but was:<442>
> Tests run: 4, Failures: 2, Errors: 0, Skipped: 0, Time elapsed: 106.957 sec <<<
FAILURE!
> observation[3](org.apache.jackrabbit.oak.jcr.observation.ObservationRefreshTest)  Time
elapsed: 53.047 sec  <<< FAILURE!
> java.lang.AssertionError: added nodes expected:<1000> but was:<906>
> 	at org.junit.Assert.fail(Assert.java:93)
> 	at org.junit.Assert.failNotEquals(Assert.java:647)
> 	at org.junit.Assert.assertEquals(Assert.java:128)
> 	at org.junit.Assert.assertEquals(Assert.java:472)
> 	at org.apache.jackrabbit.oak.jcr.observation.ObservationRefreshTest.observation(ObservationRefreshTest.java:119)
> 	at sun.reflect.NativeMethodAccessorImpl.invoke0(Native Method)
> 	at sun.reflect.NativeMethodAccessorImpl.invoke(NativeMethodAccessorImpl.java:39)
> 	at sun.reflect.DelegatingMethodAccessorImpl.invoke(DelegatingMethodAccessorImpl.java:25)
> 	at java.lang.reflect.Method.invoke(Method.java:597)
> 	at org.junit.runners.model.FrameworkMethod$1.runReflectiveCall(FrameworkMethod.java:45)
> 	at org.junit.internal.runners.model.ReflectiveCallable.run(ReflectiveCallable.java:15)
> 	at org.junit.runners.model.FrameworkMethod.invokeExplosively(FrameworkMethod.java:42)
> 	at org.junit.internal.runners.statements.InvokeMethod.evaluate(InvokeMethod.java:20)
> 	at org.junit.internal.runners.statements.RunBefores.evaluate(RunBefores.java:28)
> 	at org.junit.internal.runners.statements.RunAfters.evaluate(RunAfters.java:30)
> 	at org.junit.runners.ParentRunner.runLeaf(ParentRunner.java:263)
> 	at org.junit.runners.BlockJUnit4ClassRunner.runChild(BlockJUnit4ClassRunner.java:68)
> 	at org.junit.runners.BlockJUnit4ClassRunner.runChild(BlockJUnit4ClassRunner.java:47)
> 	at org.junit.runners.ParentRunner$3.run(ParentRunner.java:231)
> 	at org.junit.runners.ParentRunner$1.schedule(ParentRunner.java:60)
> 	at org.junit.runners.ParentRunner.runChildren(ParentRunner.java:229)
> 	at org.junit.runners.ParentRunner.access$000(ParentRunner.java:50)
> 	at org.junit.runners.ParentRunner$2.evaluate(ParentRunner.java:222)
> 	at org.junit.runners.ParentRunner.run(ParentRunner.java:300)
> 	at org.junit.runners.Suite.runChild(Suite.java:128)
> 	at org.junit.runners.Suite.runChild(Suite.java:24)
> 	at org.junit.runners.ParentRunner$3.run(ParentRunner.java:231)
> 	at java.util.concurrent.Executors$RunnableAdapter.call(Executors.java:439)
> 	at java.util.concurrent.FutureTask$Sync.innerRun(FutureTask.java:303)
> 	at java.util.concurrent.FutureTask.run(FutureTask.java:138)
> 	at java.util.concurrent.ThreadPoolExecutor$Worker.runTask(ThreadPoolExecutor.java:895)
> 	at java.util.concurrent.ThreadPoolExecutor$Worker.run(ThreadPoolExecutor.java:918)
> 	at java.lang.Thread.run(Thread.java:695)
> observation[2](org.apache.jackrabbit.oak.jcr.observation.ObservationRefreshTest)  Time
elapsed: 58.379 sec  <<< FAILURE!
> java.lang.AssertionError: added nodes expected:<1000> but was:<396>
> 	at org.junit.Assert.fail(Assert.java:93)
> 	at org.junit.Assert.failNotEquals(Assert.java:647)
> 	at org.junit.Assert.assertEquals(Assert.java:128)
> 	at org.junit.Assert.assertEquals(Assert.java:472)
> 	at org.apache.jackrabbit.oak.jcr.observation.ObservationRefreshTest.observation(ObservationRefreshTest.java:119)
> 	at sun.reflect.NativeMethodAccessorImpl.invoke0(Native Method)
> 	at sun.reflect.NativeMethodAccessorImpl.invoke(NativeMethodAccessorImpl.java:39)
> 	at sun.reflect.DelegatingMethodAccessorImpl.invoke(DelegatingMethodAccessorImpl.java:25)
> 	at java.lang.reflect.Method.invoke(Method.java:597)
> 	at org.junit.runners.model.FrameworkMethod$1.runReflectiveCall(FrameworkMethod.java:45)
> 	at org.junit.internal.runners.model.ReflectiveCallable.run(ReflectiveCallable.java:15)
> 	at org.junit.runners.model.FrameworkMethod.invokeExplosively(FrameworkMethod.java:42)
> 	at org.junit.internal.runners.statements.InvokeMethod.evaluate(InvokeMethod.java:20)
> 	at org.junit.internal.runners.statements.RunBefores.evaluate(RunBefores.java:28)
> 	at org.junit.internal.runners.statements.RunAfters.evaluate(RunAfters.java:30)
> 	at org.junit.runners.ParentRunner.runLeaf(ParentRunner.java:263)
> 	at org.junit.runners.BlockJUnit4ClassRunner.runChild(BlockJUnit4ClassRunner.java:68)
> 	at org.junit.runners.BlockJUnit4ClassRunner.runChild(BlockJUnit4ClassRunner.java:47)
> 	at org.junit.runners.ParentRunner$3.run(ParentRunner.java:231)
> 	at org.junit.runners.ParentRunner$1.schedule(ParentRunner.java:60)
> 	at org.junit.runners.ParentRunner.runChildren(ParentRunner.java:229)
> 	at org.junit.runners.ParentRunner.access$000(ParentRunner.java:50)
> 	at org.junit.runners.ParentRunner$2.evaluate(ParentRunner.java:222)
> 	at org.junit.runners.ParentRunner.run(ParentRunner.java:300)
> 	at org.junit.runners.Suite.runChild(Suite.java:128)
> 	at org.junit.runners.Suite.runChild(Suite.java:24)
> 	at org.junit.runners.ParentRunner$3.run(ParentRunner.java:231)
> 	at java.util.concurrent.Executors$RunnableAdapter.call(Executors.java:439)
> 	at java.util.concurrent.FutureTask$Sync.innerRun(FutureTask.java:303)
> 	at java.util.concurrent.FutureTask.run(FutureTask.java:138)
> 	at java.util.concurrent.ThreadPoolExecutor$Worker.runTask(ThreadPoolExecutor.java:895)
> 	at java.util.concurrent.ThreadPoolExecutor$Worker.run(ThreadPoolExecutor.java:918)
> 	at java.lang.Thread.run(Thread.java:695)



--
This message was sent by Atlassian JIRA
(v6.2#6252)

Mime
View raw message