jackrabbit-oak-issues mailing list archives

Site index · List index
Message view « Date » · « Thread »
Top « Date » · « Thread »
From Michael Dürig (JIRA) <j...@apache.org>
Subject [jira] [Updated] (OAK-2859) Test failure: OrderableNodesTest
Date Tue, 07 Jul 2015 08:04:04 GMT

     [ https://issues.apache.org/jira/browse/OAK-2859?page=com.atlassian.jira.plugin.system.issuetabpanels:all-tabpanel
]

Michael Dürig updated OAK-2859:
-------------------------------
    Description: 
{{org.apache.jackrabbit.oak.jcr.OrderableNodesTest}} fails on Jenkins when running the {{DOCUMENT_RDB}}
fixture.

{noformat}
Tests run: 5, Failures: 0, Errors: 1, Skipped: 0, Time elapsed: 12.572 sec <<< FAILURE!
orderableFolder[0](org.apache.jackrabbit.oak.jcr.OrderableNodesTest)  Time elapsed: 3.858
sec  <<< ERROR!
javax.jcr.nodetype.ConstraintViolationException: No default node type available for /testdata
	at org.apache.jackrabbit.oak.util.TreeUtil.addChild(TreeUtil.java:186)
	at org.apache.jackrabbit.oak.jcr.delegate.NodeDelegate.addChild(NodeDelegate.java:692)
	at org.apache.jackrabbit.oak.jcr.session.NodeImpl$5.perform(NodeImpl.java:296)
	at org.apache.jackrabbit.oak.jcr.session.NodeImpl$5.perform(NodeImpl.java:262)
	at org.apache.jackrabbit.oak.jcr.delegate.SessionDelegate.perform(SessionDelegate.java:202)
	at org.apache.jackrabbit.oak.jcr.session.ItemImpl.perform(ItemImpl.java:112)
	at org.apache.jackrabbit.oak.jcr.session.NodeImpl.addNode(NodeImpl.java:262)
	at org.apache.jackrabbit.oak.jcr.session.NodeImpl.addNode(NodeImpl.java:247)
	at org.apache.jackrabbit.oak.jcr.TestContentLoader.getOrAddNode(TestContentLoader.java:90)
	at org.apache.jackrabbit.oak.jcr.TestContentLoader.loadTestContent(TestContentLoader.java:57)
	at org.apache.jackrabbit.oak.jcr.OrderableNodesTest.orderableFolder(OrderableNodesTest.java:47)
	at sun.reflect.NativeMethodAccessorImpl.invoke0(Native Method)
	at sun.reflect.NativeMethodAccessorImpl.invoke(NativeMethodAccessorImpl.java:39)
	at sun.reflect.DelegatingMethodAccessorImpl.invoke(DelegatingMethodAccessorImpl.java:25)
	at java.lang.reflect.Method.invoke(Method.java:597)
	at org.junit.runners.model.FrameworkMethod$1.runReflectiveCall(FrameworkMethod.java:45)
	at org.junit.internal.runners.model.ReflectiveCallable.run(ReflectiveCallable.java:15)
	at org.junit.runners.model.FrameworkMethod.invokeExplosively(FrameworkMethod.java:42)
	at org.junit.internal.runners.statements.InvokeMethod.evaluate(InvokeMethod.java:20)
	at org.junit.internal.runners.statements.RunBefores.evaluate(RunBefores.java:28)
	at org.junit.internal.runners.statements.RunAfters.evaluate(RunAfters.java:30)
	at org.junit.runners.ParentRunner.runLeaf(ParentRunner.java:263)
	at org.junit.runners.BlockJUnit4ClassRunner.runChild(BlockJUnit4ClassRunner.java:68)
	at org.junit.runners.BlockJUnit4ClassRunner.runChild(BlockJUnit4ClassRunner.java:47)
	at org.junit.runners.ParentRunner$3.run(ParentRunner.java:231)
	at org.junit.runners.ParentRunner$1.schedule(ParentRunner.java:60)
	at org.junit.runners.ParentRunner.runChildren(ParentRunner.java:229)
	at org.junit.runners.ParentRunner.access$000(ParentRunner.java:50)
	at org.junit.runners.ParentRunner$2.evaluate(ParentRunner.java:222)
	at org.junit.runners.ParentRunner.run(ParentRunner.java:300)
	at org.junit.runners.Suite.runChild(Suite.java:128)
	at org.junit.runners.Suite.runChild(Suite.java:24)
	at org.junit.runners.ParentRunner$3.run(ParentRunner.java:231)
	at java.util.concurrent.Executors$RunnableAdapter.call(Executors.java:439)
	at java.util.concurrent.FutureTask$Sync.innerRun(FutureTask.java:303)
	at java.util.concurrent.FutureTask.run(FutureTask.java:138)
	at java.util.concurrent.ThreadPoolExecutor$Worker.runTask(ThreadPoolExecutor.java:895)
	at java.util.concurrent.ThreadPoolExecutor$Worker.run(ThreadPoolExecutor.java:918)
	at java.lang.Thread.run(Thread.java:662)
{noformat}

Failure seen at builds: 81, 87, 92, 95, 96, 114, 120, 128, 134, 186, 243

See e.g. https://builds.apache.org/job/Apache%20Jackrabbit%20Oak%20matrix/128/jdk=jdk-1.6u45,label=Ubuntu,nsfixtures=DOCUMENT_RDB,profile=unittesting/console

  was:
{{org.apache.jackrabbit.oak.jcr.OrderableNodesTest}} fails on Jenkins when running the {{DOCUMENT_RDB}}
fixture.

{noformat}
Tests run: 5, Failures: 0, Errors: 1, Skipped: 0, Time elapsed: 12.572 sec <<< FAILURE!
orderableFolder[0](org.apache.jackrabbit.oak.jcr.OrderableNodesTest)  Time elapsed: 3.858
sec  <<< ERROR!
javax.jcr.nodetype.ConstraintViolationException: No default node type available for /testdata
	at org.apache.jackrabbit.oak.util.TreeUtil.addChild(TreeUtil.java:186)
	at org.apache.jackrabbit.oak.jcr.delegate.NodeDelegate.addChild(NodeDelegate.java:692)
	at org.apache.jackrabbit.oak.jcr.session.NodeImpl$5.perform(NodeImpl.java:296)
	at org.apache.jackrabbit.oak.jcr.session.NodeImpl$5.perform(NodeImpl.java:262)
	at org.apache.jackrabbit.oak.jcr.delegate.SessionDelegate.perform(SessionDelegate.java:202)
	at org.apache.jackrabbit.oak.jcr.session.ItemImpl.perform(ItemImpl.java:112)
	at org.apache.jackrabbit.oak.jcr.session.NodeImpl.addNode(NodeImpl.java:262)
	at org.apache.jackrabbit.oak.jcr.session.NodeImpl.addNode(NodeImpl.java:247)
	at org.apache.jackrabbit.oak.jcr.TestContentLoader.getOrAddNode(TestContentLoader.java:90)
	at org.apache.jackrabbit.oak.jcr.TestContentLoader.loadTestContent(TestContentLoader.java:57)
	at org.apache.jackrabbit.oak.jcr.OrderableNodesTest.orderableFolder(OrderableNodesTest.java:47)
	at sun.reflect.NativeMethodAccessorImpl.invoke0(Native Method)
	at sun.reflect.NativeMethodAccessorImpl.invoke(NativeMethodAccessorImpl.java:39)
	at sun.reflect.DelegatingMethodAccessorImpl.invoke(DelegatingMethodAccessorImpl.java:25)
	at java.lang.reflect.Method.invoke(Method.java:597)
	at org.junit.runners.model.FrameworkMethod$1.runReflectiveCall(FrameworkMethod.java:45)
	at org.junit.internal.runners.model.ReflectiveCallable.run(ReflectiveCallable.java:15)
	at org.junit.runners.model.FrameworkMethod.invokeExplosively(FrameworkMethod.java:42)
	at org.junit.internal.runners.statements.InvokeMethod.evaluate(InvokeMethod.java:20)
	at org.junit.internal.runners.statements.RunBefores.evaluate(RunBefores.java:28)
	at org.junit.internal.runners.statements.RunAfters.evaluate(RunAfters.java:30)
	at org.junit.runners.ParentRunner.runLeaf(ParentRunner.java:263)
	at org.junit.runners.BlockJUnit4ClassRunner.runChild(BlockJUnit4ClassRunner.java:68)
	at org.junit.runners.BlockJUnit4ClassRunner.runChild(BlockJUnit4ClassRunner.java:47)
	at org.junit.runners.ParentRunner$3.run(ParentRunner.java:231)
	at org.junit.runners.ParentRunner$1.schedule(ParentRunner.java:60)
	at org.junit.runners.ParentRunner.runChildren(ParentRunner.java:229)
	at org.junit.runners.ParentRunner.access$000(ParentRunner.java:50)
	at org.junit.runners.ParentRunner$2.evaluate(ParentRunner.java:222)
	at org.junit.runners.ParentRunner.run(ParentRunner.java:300)
	at org.junit.runners.Suite.runChild(Suite.java:128)
	at org.junit.runners.Suite.runChild(Suite.java:24)
	at org.junit.runners.ParentRunner$3.run(ParentRunner.java:231)
	at java.util.concurrent.Executors$RunnableAdapter.call(Executors.java:439)
	at java.util.concurrent.FutureTask$Sync.innerRun(FutureTask.java:303)
	at java.util.concurrent.FutureTask.run(FutureTask.java:138)
	at java.util.concurrent.ThreadPoolExecutor$Worker.runTask(ThreadPoolExecutor.java:895)
	at java.util.concurrent.ThreadPoolExecutor$Worker.run(ThreadPoolExecutor.java:918)
	at java.lang.Thread.run(Thread.java:662)
{noformat}

Failure seen at builds: 81, 87, 92, 95, 96, 114, 120, 128, 186

See e.g. https://builds.apache.org/job/Apache%20Jackrabbit%20Oak%20matrix/128/jdk=jdk-1.6u45,label=Ubuntu,nsfixtures=DOCUMENT_RDB,profile=unittesting/console


> Test failure: OrderableNodesTest
> --------------------------------
>
>                 Key: OAK-2859
>                 URL: https://issues.apache.org/jira/browse/OAK-2859
>             Project: Jackrabbit Oak
>          Issue Type: Bug
>          Components: rdbmk
>         Environment: https://builds.apache.org/
>            Reporter: Michael Dürig
>            Assignee: Julian Reschke
>              Labels: ci, jenkins
>
> {{org.apache.jackrabbit.oak.jcr.OrderableNodesTest}} fails on Jenkins when running the
{{DOCUMENT_RDB}} fixture.
> {noformat}
> Tests run: 5, Failures: 0, Errors: 1, Skipped: 0, Time elapsed: 12.572 sec <<<
FAILURE!
> orderableFolder[0](org.apache.jackrabbit.oak.jcr.OrderableNodesTest)  Time elapsed: 3.858
sec  <<< ERROR!
> javax.jcr.nodetype.ConstraintViolationException: No default node type available for /testdata
> 	at org.apache.jackrabbit.oak.util.TreeUtil.addChild(TreeUtil.java:186)
> 	at org.apache.jackrabbit.oak.jcr.delegate.NodeDelegate.addChild(NodeDelegate.java:692)
> 	at org.apache.jackrabbit.oak.jcr.session.NodeImpl$5.perform(NodeImpl.java:296)
> 	at org.apache.jackrabbit.oak.jcr.session.NodeImpl$5.perform(NodeImpl.java:262)
> 	at org.apache.jackrabbit.oak.jcr.delegate.SessionDelegate.perform(SessionDelegate.java:202)
> 	at org.apache.jackrabbit.oak.jcr.session.ItemImpl.perform(ItemImpl.java:112)
> 	at org.apache.jackrabbit.oak.jcr.session.NodeImpl.addNode(NodeImpl.java:262)
> 	at org.apache.jackrabbit.oak.jcr.session.NodeImpl.addNode(NodeImpl.java:247)
> 	at org.apache.jackrabbit.oak.jcr.TestContentLoader.getOrAddNode(TestContentLoader.java:90)
> 	at org.apache.jackrabbit.oak.jcr.TestContentLoader.loadTestContent(TestContentLoader.java:57)
> 	at org.apache.jackrabbit.oak.jcr.OrderableNodesTest.orderableFolder(OrderableNodesTest.java:47)
> 	at sun.reflect.NativeMethodAccessorImpl.invoke0(Native Method)
> 	at sun.reflect.NativeMethodAccessorImpl.invoke(NativeMethodAccessorImpl.java:39)
> 	at sun.reflect.DelegatingMethodAccessorImpl.invoke(DelegatingMethodAccessorImpl.java:25)
> 	at java.lang.reflect.Method.invoke(Method.java:597)
> 	at org.junit.runners.model.FrameworkMethod$1.runReflectiveCall(FrameworkMethod.java:45)
> 	at org.junit.internal.runners.model.ReflectiveCallable.run(ReflectiveCallable.java:15)
> 	at org.junit.runners.model.FrameworkMethod.invokeExplosively(FrameworkMethod.java:42)
> 	at org.junit.internal.runners.statements.InvokeMethod.evaluate(InvokeMethod.java:20)
> 	at org.junit.internal.runners.statements.RunBefores.evaluate(RunBefores.java:28)
> 	at org.junit.internal.runners.statements.RunAfters.evaluate(RunAfters.java:30)
> 	at org.junit.runners.ParentRunner.runLeaf(ParentRunner.java:263)
> 	at org.junit.runners.BlockJUnit4ClassRunner.runChild(BlockJUnit4ClassRunner.java:68)
> 	at org.junit.runners.BlockJUnit4ClassRunner.runChild(BlockJUnit4ClassRunner.java:47)
> 	at org.junit.runners.ParentRunner$3.run(ParentRunner.java:231)
> 	at org.junit.runners.ParentRunner$1.schedule(ParentRunner.java:60)
> 	at org.junit.runners.ParentRunner.runChildren(ParentRunner.java:229)
> 	at org.junit.runners.ParentRunner.access$000(ParentRunner.java:50)
> 	at org.junit.runners.ParentRunner$2.evaluate(ParentRunner.java:222)
> 	at org.junit.runners.ParentRunner.run(ParentRunner.java:300)
> 	at org.junit.runners.Suite.runChild(Suite.java:128)
> 	at org.junit.runners.Suite.runChild(Suite.java:24)
> 	at org.junit.runners.ParentRunner$3.run(ParentRunner.java:231)
> 	at java.util.concurrent.Executors$RunnableAdapter.call(Executors.java:439)
> 	at java.util.concurrent.FutureTask$Sync.innerRun(FutureTask.java:303)
> 	at java.util.concurrent.FutureTask.run(FutureTask.java:138)
> 	at java.util.concurrent.ThreadPoolExecutor$Worker.runTask(ThreadPoolExecutor.java:895)
> 	at java.util.concurrent.ThreadPoolExecutor$Worker.run(ThreadPoolExecutor.java:918)
> 	at java.lang.Thread.run(Thread.java:662)
> {noformat}
> Failure seen at builds: 81, 87, 92, 95, 96, 114, 120, 128, 134, 186, 243
> See e.g. https://builds.apache.org/job/Apache%20Jackrabbit%20Oak%20matrix/128/jdk=jdk-1.6u45,label=Ubuntu,nsfixtures=DOCUMENT_RDB,profile=unittesting/console



--
This message was sent by Atlassian JIRA
(v6.3.4#6332)

Mime
View raw message