jackrabbit-oak-issues mailing list archives

Site index · List index
Message view « Date » · « Thread »
Top « Date » · « Thread »
From Michael Dürig (JIRA) <j...@apache.org>
Subject [jira] [Updated] (OAK-6139) Test failure: SecurityProviderRegistrationTest.testRequiredAuthorizationConfigurationNotAvailable()
Date Mon, 13 Nov 2017 07:48:00 GMT

     [ https://issues.apache.org/jira/browse/OAK-6139?page=com.atlassian.jira.plugin.system.issuetabpanels:all-tabpanel
]

Michael Dürig updated OAK-6139:
-------------------------------
    Labels: CI Jenkins test-failure  (was: CI Jenkins)

> Test failure: SecurityProviderRegistrationTest.testRequiredAuthorizationConfigurationNotAvailable()
> ---------------------------------------------------------------------------------------------------
>
>                 Key: OAK-6139
>                 URL: https://issues.apache.org/jira/browse/OAK-6139
>             Project: Jackrabbit Oak
>          Issue Type: Bug
>          Components: continuous integration, pojosr
>            Reporter: Hudson
>              Labels: CI, Jenkins, test-failure
>             Fix For: 1.8
>
>
> Jenkins CI failure: https://builds.apache.org/view/J/job/Jackrabbit%20Oak/
> The build Jackrabbit Oak #220 has failed.
> First failed run: [Jackrabbit Oak #220|https://builds.apache.org/job/Jackrabbit%20Oak/220/]
[console log|https://builds.apache.org/job/Jackrabbit%20Oak/220/console]
> {noformat}
> [ERROR] Tests run: 11, Failures: 1, Errors: 0, Skipped: 0, Time elapsed: 2.813 s <<<
FAILURE! - in org.apache.jackrabbit.oak.run.osgi.SecurityProviderRegistrationTest
> [ERROR] testRequiredAuthorizationConfigurationNotAvailable(org.apache.jackrabbit.oak.run.osgi.SecurityProviderRegistrationTest)
 Time elapsed: 0.219 s  <<< FAILURE!
> org.codehaus.groovy.runtime.powerassert.PowerAssertionError: 
> assert securityProviderServiceReferences != null
>        |                                 |
>        null                              false
> 	at org.apache.jackrabbit.oak.run.osgi.SecurityProviderRegistrationTest.testRequiredService(SecurityProviderRegistrationTest.groovy:318)
> 	at org.apache.jackrabbit.oak.run.osgi.SecurityProviderRegistrationTest.this$3$testRequiredService(SecurityProviderRegistrationTest.groovy)
> 	at org.apache.jackrabbit.oak.run.osgi.SecurityProviderRegistrationTest.testRequiredAuthorizationConfigurationNotAvailable(SecurityProviderRegistrationTest.groovy:81)
> {noformat}



--
This message was sent by Atlassian JIRA
(v6.4.14#64029)

Mime
View raw message