jackrabbit-oak-issues mailing list archives

Site index · List index
Message view « Date » · « Thread »
Top « Date » · « Thread »
From "Amit Jain (JIRA)" <j...@apache.org>
Subject [jira] [Updated] (OAK-3658) Test failures: JackrabbitNodeTest#testRename and testRenameEventHandling
Date Tue, 12 Dec 2017 04:24:00 GMT

     [ https://issues.apache.org/jira/browse/OAK-3658?page=com.atlassian.jira.plugin.system.issuetabpanels:all-tabpanel
]

Amit Jain updated OAK-3658:
---------------------------
    Fix Version/s:     (was: 1.8)
                   1.10

> Test failures: JackrabbitNodeTest#testRename and testRenameEventHandling
> ------------------------------------------------------------------------
>
>                 Key: OAK-3658
>                 URL: https://issues.apache.org/jira/browse/OAK-3658
>             Project: Jackrabbit Oak
>          Issue Type: Bug
>          Components: jcr
>            Reporter: Amit Jain
>            Assignee: Amit Jain
>            Priority: Minor
>             Fix For: 1.10
>
>
> Tests fail regularly on trunk - {{JackrabbitNodeTest#testRename}} and {{JackrabbitNodeTest#testRenameEventHandling}}.
> {noformat}
> Test set: org.apache.jackrabbit.oak.jcr.JackrabbitNodeTest
> -------------------------------------------------------------------------------
> Tests run: 8, Failures: 1, Errors: 1, Skipped: 0, Time elapsed: 0.106 sec <<<
FAILURE!
> testRenameEventHandling(org.apache.jackrabbit.oak.jcr.JackrabbitNodeTest)  Time elapsed:
0.01 sec  <<< ERROR!
> javax.jcr.nodetype.ConstraintViolationException: Item is protected.
> 	at org.apache.jackrabbit.oak.jcr.session.ItemImpl$ItemWriteOperation.checkPreconditions(ItemImpl.java:98)
> 	at org.apache.jackrabbit.oak.jcr.delegate.SessionDelegate.prePerform(SessionDelegate.java:614)
> 	at org.apache.jackrabbit.oak.jcr.delegate.SessionDelegate.performVoid(SessionDelegate.java:270)
> 	at org.apache.jackrabbit.oak.jcr.session.NodeImpl.rename(NodeImpl.java:1485)
> 	at org.apache.jackrabbit.oak.jcr.JackrabbitNodeTest.testRenameEventHandling(JackrabbitNodeTest.java:124)
> 	at sun.reflect.NativeMethodAccessorImpl.invoke0(Native Method)
> 	at sun.reflect.NativeMethodAccessorImpl.invoke(NativeMethodAccessorImpl.java:57)
> 	at sun.reflect.DelegatingMethodAccessorImpl.invoke(DelegatingMethodAccessorImpl.java:43)
> 	at java.lang.reflect.Method.invoke(Method.java:606)
> 	at junit.framework.TestCase.runTest(TestCase.java:176)
> 	at junit.framework.TestCase.runBare(TestCase.java:141)
> 	at junit.framework.TestResult$1.protect(TestResult.java:122)
> 	at junit.framework.TestResult.runProtected(TestResult.java:142)
> 	at junit.framework.TestResult.run(TestResult.java:125)
> 	at junit.framework.TestCase.run(TestCase.java:129)
> 	at org.apache.jackrabbit.test.AbstractJCRTest.run(AbstractJCRTest.java:464)
> 	at junit.framework.TestSuite.runTest(TestSuite.java:252)
> 	at junit.framework.TestSuite.run(TestSuite.java:247)
> 	at org.junit.internal.runners.JUnit38ClassRunner.run(JUnit38ClassRunner.java:86)
> 	at org.apache.maven.surefire.junit4.JUnit4Provider.execute(JUnit4Provider.java:252)
> 	at org.apache.maven.surefire.junit4.JUnit4Provider.executeTestSet(JUnit4Provider.java:141)
> 	at org.apache.maven.surefire.junit4.JUnit4Provider.invoke(JUnit4Provider.java:112)
> 	at sun.reflect.NativeMethodAccessorImpl.invoke0(Native Method)
> 	at sun.reflect.NativeMethodAccessorImpl.invoke(NativeMethodAccessorImpl.java:57)
> 	at sun.reflect.DelegatingMethodAccessorImpl.invoke(DelegatingMethodAccessorImpl.java:43)
> 	at java.lang.reflect.Method.invoke(Method.java:606)
> 	at org.apache.maven.surefire.util.ReflectionUtils.invokeMethodWithArray(ReflectionUtils.java:189)
> 	at org.apache.maven.surefire.booter.ProviderFactory$ProviderProxy.invoke(ProviderFactory.java:165)
> 	at org.apache.maven.surefire.booter.ProviderFactory.invokeProvider(ProviderFactory.java:85)
> 	at org.apache.maven.surefire.booter.ForkedBooter.runSuitesInProcess(ForkedBooter.java:115)
> 	at org.apache.maven.surefire.booter.ForkedBooter.main(ForkedBooter.java:75)
> testRename(org.apache.jackrabbit.oak.jcr.JackrabbitNodeTest)  Time elapsed: 0.007 sec
 <<< FAILURE!
> junit.framework.ComparisonFailure: expected:<[a]> but was:<[rep:policy]>
> 	at junit.framework.Assert.assertEquals(Assert.java:100)
> 	at junit.framework.Assert.assertEquals(Assert.java:107)
> 	at junit.framework.TestCase.assertEquals(TestCase.java:269)
> 	at org.apache.jackrabbit.oak.jcr.JackrabbitNodeTest.testRename(JackrabbitNodeTest.java:74)
> 	at sun.reflect.NativeMethodAccessorImpl.invoke0(Native Method)
> 	at sun.reflect.NativeMethodAccessorImpl.invoke(NativeMethodAccessorImpl.java:57)
> 	at sun.reflect.DelegatingMethodAccessorImpl.invoke(DelegatingMethodAccessorImpl.java:43)
> 	at java.lang.reflect.Method.invoke(Method.java:606)
> 	at junit.framework.TestCase.runTest(TestCase.java:176)
> 	at junit.framework.TestCase.runBare(TestCase.java:141)
> 	at junit.framework.TestResult$1.protect(TestResult.java:122)
> 	at junit.framework.TestResult.runProtected(TestResult.java:142)
> 	at junit.framework.TestResult.run(TestResult.java:125)
> 	at junit.framework.TestCase.run(TestCase.java:129)
> 	at org.apache.jackrabbit.test.AbstractJCRTest.run(AbstractJCRTest.java:464)
> 	at junit.framework.TestSuite.runTest(TestSuite.java:252)
> 	at junit.framework.TestSuite.run(TestSuite.java:247)
> 	at org.junit.internal.runners.JUnit38ClassRunner.run(JUnit38ClassRunner.java:86)
> 	at org.apache.maven.surefire.junit4.JUnit4Provider.execute(JUnit4Provider.java:252)
> 	at org.apache.maven.surefire.junit4.JUnit4Provider.executeTestSet(JUnit4Provider.java:141)
> 	at org.apache.maven.surefire.junit4.JUnit4Provider.invoke(JUnit4Provider.java:112)
> 	at sun.reflect.NativeMethodAccessorImpl.invoke0(Native Method)
> 	at sun.reflect.NativeMethodAccessorImpl.invoke(NativeMethodAccessorImpl.java:57)
> 	at sun.reflect.DelegatingMethodAccessorImpl.invoke(DelegatingMethodAccessorImpl.java:43)
> 	at java.lang.reflect.Method.invoke(Method.java:606)
> 	at org.apache.maven.surefire.util.ReflectionUtils.invokeMethodWithArray(ReflectionUtils.java:189)
> 	at org.apache.maven.surefire.booter.ProviderFactory$ProviderProxy.invoke(ProviderFactory.java:165)
> 	at org.apache.maven.surefire.booter.ProviderFactory.invokeProvider(ProviderFactory.java:85)
> 	at org.apache.maven.surefire.booter.ForkedBooter.runSuitesInProcess(ForkedBooter.java:115)
> 	at org.apache.maven.surefire.booter.ForkedBooter.main(ForkedBooter.java:75)
> {noformat}



--
This message was sent by Atlassian JIRA
(v6.4.14#64029)

Mime
View raw message