jackrabbit-oak-issues mailing list archives

Site index · List index
Message view « Date » · « Thread »
Top « Date » · « Thread »
From "Marcel Reutegger (JIRA)" <j...@apache.org>
Subject [jira] [Updated] (OAK-7014) Build Jackrabbit Oak #1027 failed
Date Tue, 05 Dec 2017 07:26:00 GMT

     [ https://issues.apache.org/jira/browse/OAK-7014?page=com.atlassian.jira.plugin.system.issuetabpanels:all-tabpanel
]

Marcel Reutegger updated OAK-7014:
----------------------------------
    Description: 
No description is provided

The build Jackrabbit Oak #1027 has failed.
First failed run: [Jackrabbit Oak #1027|https://builds.apache.org/job/Jackrabbit%20Oak/1027/]
[console log|https://builds.apache.org/job/Jackrabbit%20Oak/1027/console]

{noformat}
[ERROR] Tests run: 1, Failures: 0, Errors: 1, Skipped: 0, Time elapsed: 1.571 s <<<
FAILURE! - in org.apache.jackrabbit.oak.plugins.index.solr.server.EmbeddedSolrServerProviderTest
[ERROR] testEmbeddedSolrServerInitialization(org.apache.jackrabbit.oak.plugins.index.solr.server.EmbeddedSolrServerProviderTest)
 Time elapsed: 1.571 s  <<< ERROR!
org.apache.solr.common.SolrException: SolrCore 'oak' is not available due to init failure:
Error loading class 'solr.JsonUpdateRequestHandler'
{noformat}

  was:
No description is provided

The build Jackrabbit Oak #1027 has failed.
First failed run: [Jackrabbit Oak #1027|https://builds.apache.org/job/Jackrabbit%20Oak/1027/]
[console log|https://builds.apache.org/job/Jackrabbit%20Oak/1027/console]

    Component/s: solr

Most likely caused by OAK-4318. The build went back to green once those changes were reverted.

> Build Jackrabbit Oak #1027 failed
> ---------------------------------
>
>                 Key: OAK-7014
>                 URL: https://issues.apache.org/jira/browse/OAK-7014
>             Project: Jackrabbit Oak
>          Issue Type: Bug
>          Components: continuous integration, solr
>            Reporter: Hudson
>
> No description is provided
> The build Jackrabbit Oak #1027 has failed.
> First failed run: [Jackrabbit Oak #1027|https://builds.apache.org/job/Jackrabbit%20Oak/1027/]
[console log|https://builds.apache.org/job/Jackrabbit%20Oak/1027/console]
> {noformat}
> [ERROR] Tests run: 1, Failures: 0, Errors: 1, Skipped: 0, Time elapsed: 1.571 s <<<
FAILURE! - in org.apache.jackrabbit.oak.plugins.index.solr.server.EmbeddedSolrServerProviderTest
> [ERROR] testEmbeddedSolrServerInitialization(org.apache.jackrabbit.oak.plugins.index.solr.server.EmbeddedSolrServerProviderTest)
 Time elapsed: 1.571 s  <<< ERROR!
> org.apache.solr.common.SolrException: SolrCore 'oak' is not available due to init failure:
Error loading class 'solr.JsonUpdateRequestHandler'
> {noformat}



--
This message was sent by Atlassian JIRA
(v6.4.14#64029)

Mime
View raw message