jackrabbit-oak-issues mailing list archives

Site index · List index
Message view « Date » · « Thread »
Top « Date » · « Thread »
From "Alex Deparvu (JIRA)" <j...@apache.org>
Subject [jira] [Reopened] (OAK-2155) TokenAuthenticationTest#tokenCreationWithPreAuth test failing repeatedly
Date Fri, 06 Apr 2018 07:55:00 GMT

     [ https://issues.apache.org/jira/browse/OAK-2155?page=com.atlassian.jira.plugin.system.issuetabpanels:all-tabpanel
]

Alex Deparvu reopened OAK-2155:
-------------------------------

started failing again, [build 1358|https://builds.apache.org/job/Jackrabbit%20Oak/1358/console]:

{noformat}
[ERROR] Tests run: 1, Failures: 0, Errors: 1, Skipped: 0, Time elapsed: 0.977 s <<<
FAILURE! - in org.apache.jackrabbit.oak.run.osgi.TokenAuthenticationTest
[ERROR] tokenCreationWithPreAuth(org.apache.jackrabbit.oak.run.osgi.TokenAuthenticationTest)
 Time elapsed: 0.976 s  <<< ERROR!
java.lang.reflect.UndeclaredThrowableException
	at org.apache.jackrabbit.oak.run.osgi.TokenAuthenticationTest.tokenCreationWithPreAuth(TokenAuthenticationTest.groovy:59)
Caused by: java.lang.reflect.InvocationTargetException
	at org.apache.jackrabbit.oak.run.osgi.TokenAuthenticationTest.tokenCreationWithPreAuth(TokenAuthenticationTest.groovy:59)
Caused by: javax.jcr.LoginException: Login Failure: all modules ignored
	at org.apache.jackrabbit.oak.run.osgi.TokenAuthenticationTest.tokenCreationWithPreAuth(TokenAuthenticationTest.groovy:59)
Caused by: javax.security.auth.login.LoginException: Login Failure: all modules ignored
	at org.apache.jackrabbit.oak.run.osgi.TokenAuthenticationTest.tokenCreationWithPreAuth(TokenAuthenticationTest.groovy:59)
{noformat}

> TokenAuthenticationTest#tokenCreationWithPreAuth test failing repeatedly
> ------------------------------------------------------------------------
>
>                 Key: OAK-2155
>                 URL: https://issues.apache.org/jira/browse/OAK-2155
>             Project: Jackrabbit Oak
>          Issue Type: Bug
>          Components: continuous integration, pojosr
>            Reporter: Amit Jain
>            Assignee: Alex Deparvu
>            Priority: Major
>              Labels: CI, test
>             Fix For: 1.9.0, 1.10
>
>
> The test {{org.apache.jackrabbit.oak.run.osgi.TokenAuthenticationTest#tokenCreationWithPreAuth}}
in oak-pojosr component failing repeatedly on the local system.
> Also, failing repeatedly on http://ci.apache.org/builders/oak-trunk-win7.



--
This message was sent by Atlassian JIRA
(v7.6.3#76005)

Mime
View raw message