jackrabbit-oak-issues mailing list archives

Site index · List index
Message view « Date » · « Thread »
Top « Date » · « Thread »
From "Alex Deparvu (JIRA)" <j...@apache.org>
Subject [jira] [Commented] (OAK-7804) Build Jackrabbit Oak #1699 failed
Date Wed, 10 Oct 2018 09:25:00 GMT

    [ https://issues.apache.org/jira/browse/OAK-7804?page=com.atlassian.jira.plugin.system.issuetabpanels:comment-tabpanel&focusedCommentId=16644712#comment-16644712
] 

Alex Deparvu commented on OAK-7804:
-----------------------------------

{noformat}
[ERROR] Tests run: 14, Failures: 0, Errors: 1, Skipped: 2, Time elapsed: 37.407 s <<<
FAILURE! - in org.apache.jackrabbit.oak.plugins.document.DocumentMKDiffTest
[ERROR] changeProperty(org.apache.jackrabbit.oak.plugins.document.DocumentMKDiffTest)  Time
elapsed: 2.362 s  <<< ERROR!
java.lang.NullPointerException
{noformat}

> Build Jackrabbit Oak #1699 failed
> ---------------------------------
>
>                 Key: OAK-7804
>                 URL: https://issues.apache.org/jira/browse/OAK-7804
>             Project: Jackrabbit Oak
>          Issue Type: Bug
>          Components: continuous integration
>            Reporter: Hudson
>            Priority: Major
>
> No description is provided
> The build Jackrabbit Oak #1699 has failed.
> First failed run: [Jackrabbit Oak #1699|https://builds.apache.org/job/Jackrabbit%20Oak/1699/]
[console log|https://builds.apache.org/job/Jackrabbit%20Oak/1699/console]



--
This message was sent by Atlassian JIRA
(v7.6.3#76005)

Mime
View raw message