jackrabbit-oak-issues mailing list archives

Site index · List index
Message view « Date » · « Thread »
Top « Date » · « Thread »
From "Davide Giannella (JIRA)" <j...@apache.org>
Subject [jira] [Updated] (OAK-7274) Test failure: various upgrade tests
Date Wed, 09 Jan 2019 16:14:02 GMT

     [ https://issues.apache.org/jira/browse/OAK-7274?page=com.atlassian.jira.plugin.system.issuetabpanels:all-tabpanel
]

Davide Giannella updated OAK-7274:
----------------------------------
    Fix Version/s: 1.10

Adding 1.10 version before 1.10.0 release

> Test failure: various upgrade tests
> -----------------------------------
>
>                 Key: OAK-7274
>                 URL: https://issues.apache.org/jira/browse/OAK-7274
>             Project: Jackrabbit Oak
>          Issue Type: Bug
>          Components: continuous integration
>            Reporter: Hudson
>            Priority: Major
>             Fix For: 1.9.0, 1.10
>
>
> No description is provided
> The build Jackrabbit Oak #1253 has failed.
> First failed run: [Jackrabbit Oak #1253|https://builds.apache.org/job/Jackrabbit%20Oak/1253/]
[console log|https://builds.apache.org/job/Jackrabbit%20Oak/1253/console]
> {noformat}
> [ERROR] Tests run: 1, Failures: 0, Errors: 1, Skipped: 0, Time elapsed: 4.172 s <<<
FAILURE! - in org.apache.jackrabbit.oak.upgrade.cli.JdbcToSegmentWithMetadataTest
> [ERROR] validateMigration(org.apache.jackrabbit.oak.upgrade.cli.JdbcToSegmentWithMetadataTest)
 Time elapsed: 4.146 s  <<< ERROR!
> java.lang.RuntimeException: javax.jcr.RepositoryException: Failed to copy content
> Caused by: javax.jcr.RepositoryException: Failed to copy content
> Caused by: java.lang.IllegalArgumentException
> {noformat}



--
This message was sent by Atlassian JIRA
(v7.6.3#76005)

Mime
View raw message