jackrabbit-oak-issues mailing list archives

Site index · List index
Message view « Date » · « Thread »
Top « Date » · « Thread »
From "Alex Deparvu (JIRA)" <j...@apache.org>
Subject [jira] [Updated] (OAK-8292) Build Jackrabbit Oak #2124 failed
Date Wed, 08 May 2019 16:49:00 GMT

     [ https://issues.apache.org/jira/browse/OAK-8292?page=com.atlassian.jira.plugin.system.issuetabpanels:all-tabpanel
]

Alex Deparvu updated OAK-8292:
------------------------------
    Description: 
Test Result (2 failures / +2)
* org.apache.jackrabbit.oak.run.osgi.JsonConfigRepFactoryTest.testRepositoryTar
{noformat}
Caused by: org.osgi.framework.BundleException: Timed out while waiting for repository shutdown
for 60 secs
	at org.apache.jackrabbit.oak.run.osgi.OakOSGiRepositoryFactory.shutdown(OakOSGiRepositoryFactory.java:281)
	at org.apache.jackrabbit.oak.run.osgi.OakOSGiRepositoryFactory$RepositoryTracker.shutdownRepository(OakOSGiRepositoryFactory.java:443)
	at org.apache.jackrabbit.oak.run.osgi.OakOSGiRepositoryFactory$RepositoryProxy.invoke(OakOSGiRepositoryFactory.java:475)
	... 33 more
{noformat}

* org.apache.jackrabbit.oak.run.osgi.TokenAuthenticationTest.tokenCreationWithPreAuth
{noformat}
Caused by: javax.security.auth.login.LoginException: Login Failure: all modules ignored
	at javax.security.auth.login.LoginContext.invoke(LoginContext.java:906)
	at javax.security.auth.login.LoginContext.access$000(LoginContext.java:195)
	at javax.security.auth.login.LoginContext$4.run(LoginContext.java:682)
	at javax.security.auth.login.LoginContext$4.run(LoginContext.java:680)
	at java.security.AccessController.doPrivileged(Native Method)
	at javax.security.auth.login.LoginContext.invokePriv(LoginContext.java:680)
	at javax.security.auth.login.LoginContext.login(LoginContext.java:587)
	at org.apache.jackrabbit.oak.core.ContentRepositoryImpl.login(ContentRepositoryImpl.java:163)
	at org.apache.jackrabbit.oak.jcr.repository.RepositoryImpl.login(RepositoryImpl.java:282)
	... 41 more
{noformat}

The build Jackrabbit Oak #2124 has failed.
First failed run: [Jackrabbit Oak #2124|https://builds.apache.org/job/Jackrabbit%20Oak/2124/]
[console log|https://builds.apache.org/job/Jackrabbit%20Oak/2124/console]

  was:
No description is provided

The build Jackrabbit Oak #2124 has failed.
First failed run: [Jackrabbit Oak #2124|https://builds.apache.org/job/Jackrabbit%20Oak/2124/]
[console log|https://builds.apache.org/job/Jackrabbit%20Oak/2124/console]

Test Result (2 failures / +2)
* org.apache.jackrabbit.oak.run.osgi.JsonConfigRepFactoryTest.testRepositoryTar
* org.apache.jackrabbit.oak.run.osgi.TokenAuthenticationTest.tokenCreationWithPreAuth



> Build Jackrabbit Oak #2124 failed
> ---------------------------------
>
>                 Key: OAK-8292
>                 URL: https://issues.apache.org/jira/browse/OAK-8292
>             Project: Jackrabbit Oak
>          Issue Type: Bug
>          Components: continuous integration
>            Reporter: Hudson
>            Priority: Major
>
> Test Result (2 failures / +2)
> * org.apache.jackrabbit.oak.run.osgi.JsonConfigRepFactoryTest.testRepositoryTar
> {noformat}
> Caused by: org.osgi.framework.BundleException: Timed out while waiting for repository
shutdown for 60 secs
> 	at org.apache.jackrabbit.oak.run.osgi.OakOSGiRepositoryFactory.shutdown(OakOSGiRepositoryFactory.java:281)
> 	at org.apache.jackrabbit.oak.run.osgi.OakOSGiRepositoryFactory$RepositoryTracker.shutdownRepository(OakOSGiRepositoryFactory.java:443)
> 	at org.apache.jackrabbit.oak.run.osgi.OakOSGiRepositoryFactory$RepositoryProxy.invoke(OakOSGiRepositoryFactory.java:475)
> 	... 33 more
> {noformat}
> * org.apache.jackrabbit.oak.run.osgi.TokenAuthenticationTest.tokenCreationWithPreAuth
> {noformat}
> Caused by: javax.security.auth.login.LoginException: Login Failure: all modules ignored
> 	at javax.security.auth.login.LoginContext.invoke(LoginContext.java:906)
> 	at javax.security.auth.login.LoginContext.access$000(LoginContext.java:195)
> 	at javax.security.auth.login.LoginContext$4.run(LoginContext.java:682)
> 	at javax.security.auth.login.LoginContext$4.run(LoginContext.java:680)
> 	at java.security.AccessController.doPrivileged(Native Method)
> 	at javax.security.auth.login.LoginContext.invokePriv(LoginContext.java:680)
> 	at javax.security.auth.login.LoginContext.login(LoginContext.java:587)
> 	at org.apache.jackrabbit.oak.core.ContentRepositoryImpl.login(ContentRepositoryImpl.java:163)
> 	at org.apache.jackrabbit.oak.jcr.repository.RepositoryImpl.login(RepositoryImpl.java:282)
> 	... 41 more
> {noformat}
> The build Jackrabbit Oak #2124 has failed.
> First failed run: [Jackrabbit Oak #2124|https://builds.apache.org/job/Jackrabbit%20Oak/2124/]
[console log|https://builds.apache.org/job/Jackrabbit%20Oak/2124/console]



--
This message was sent by Atlassian JIRA
(v7.6.3#76005)

Mime
View raw message