jackrabbit-oak-issues mailing list archives

Site index · List index
Message view « Date » · « Thread »
Top « Date » · « Thread »
From "Marcel Reutegger (JIRA)" <j...@apache.org>
Subject [jira] [Updated] (OAK-8440) Test failure: SegmentWriteQueueTest.testFlush()
Date Wed, 26 Jun 2019 06:40:00 GMT

     [ https://issues.apache.org/jira/browse/OAK-8440?page=com.atlassian.jira.plugin.system.issuetabpanels:all-tabpanel
]

Marcel Reutegger updated OAK-8440:
----------------------------------
    Description: 
No description is provided

The build Jackrabbit Oak #2235 has failed.
First failed run: [Jackrabbit Oak #2235|https://builds.apache.org/job/Jackrabbit%20Oak/2235/]
[console log|https://builds.apache.org/job/Jackrabbit%20Oak/2235/console]

{noformat}
[ERROR] testFlush(org.apache.jackrabbit.oak.segment.azure.queue.SegmentWriteQueueTest)  Time
elapsed: 0.317 s  <<< FAILURE!
java.lang.AssertionError
	at org.junit.Assert.fail(Assert.java:86)
	at org.junit.Assert.assertTrue(Assert.java:41)
	at org.junit.Assert.assertTrue(Assert.java:52)
	at org.apache.jackrabbit.oak.segment.azure.queue.SegmentWriteQueueTest.testFlush(SegmentWriteQueueTest.java:137)
{noformat}

  was:
No description is provided

The build Jackrabbit Oak #2235 has failed.
First failed run: [Jackrabbit Oak #2235|https://builds.apache.org/job/Jackrabbit%20Oak/2235/]
[console log|https://builds.apache.org/job/Jackrabbit%20Oak/2235/console]

    Component/s: segment-azure
        Summary: Test failure: SegmentWriteQueueTest.testFlush()  (was: Build Jackrabbit Oak
#2235 failed)

> Test failure: SegmentWriteQueueTest.testFlush()
> -----------------------------------------------
>
>                 Key: OAK-8440
>                 URL: https://issues.apache.org/jira/browse/OAK-8440
>             Project: Jackrabbit Oak
>          Issue Type: Bug
>          Components: continuous integration, segment-azure
>            Reporter: Hudson
>            Priority: Major
>
> No description is provided
> The build Jackrabbit Oak #2235 has failed.
> First failed run: [Jackrabbit Oak #2235|https://builds.apache.org/job/Jackrabbit%20Oak/2235/]
[console log|https://builds.apache.org/job/Jackrabbit%20Oak/2235/console]
> {noformat}
> [ERROR] testFlush(org.apache.jackrabbit.oak.segment.azure.queue.SegmentWriteQueueTest)
 Time elapsed: 0.317 s  <<< FAILURE!
> java.lang.AssertionError
> 	at org.junit.Assert.fail(Assert.java:86)
> 	at org.junit.Assert.assertTrue(Assert.java:41)
> 	at org.junit.Assert.assertTrue(Assert.java:52)
> 	at org.apache.jackrabbit.oak.segment.azure.queue.SegmentWriteQueueTest.testFlush(SegmentWriteQueueTest.java:137)
> {noformat}



--
This message was sent by Atlassian JIRA
(v7.6.3#76005)

Mime
View raw message