jackrabbit-oak-issues mailing list archives

Site index · List index
Message view « Date » · « Thread »
Top « Date » · « Thread »
From "Davide Giannella (JIRA)" <j...@apache.org>
Subject [jira] [Closed] (OAK-8459) Intermittent issue with MongoStatusTest
Date Mon, 15 Jul 2019 09:38:00 GMT

     [ https://issues.apache.org/jira/browse/OAK-8459?page=com.atlassian.jira.plugin.system.issuetabpanels:all-tabpanel
]

Davide Giannella closed OAK-8459.
---------------------------------

bulk close 1.10.3

> Intermittent issue with MongoStatusTest
> ---------------------------------------
>
>                 Key: OAK-8459
>                 URL: https://issues.apache.org/jira/browse/OAK-8459
>             Project: Jackrabbit Oak
>          Issue Type: Bug
>          Components: mongomk
>            Reporter: Vinod Holani
>            Assignee: Marcel Reutegger
>            Priority: Minor
>             Fix For: 1.10.3, 1.16.0
>
>
> Issue is happening while running test cases for a pull request for OAK, below test case
fails intermittently.
> Error stacktrace is as below :
> [INFO] Running org.apache.jackrabbit.oak.plugins.document.mongo.MongoStatusTest
>  [ERROR] Tests run: 6, Failures: 1, Errors: 0, Skipped: 0, Time elapsed: 0.137 s <<<
FAILURE! - in org.apache.jackrabbit.oak.plugins.document.mongo.MongoStatusTest
>  [ERROR] unauthorized(org.apache.jackrabbit.oak.plugins.document.mongo.MongoStatusTest)
Time elapsed: 0.027 s <<< FAILURE!
>  java.lang.AssertionError
>  at org.junit.Assert.fail(Assert.java:86)
>  at org.junit.Assert.assertTrue(Assert.java:41)
>  at org.junit.Assert.assertNotNull(Assert.java:712)
>  at org.junit.Assert.assertNotNull(Assert.java:722)
>  at org.apache.jackrabbit.oak.plugins.document.mongo.MongoStatusTest$1.unauthorizedIfServerStatus(MongoStatusTest.java:208)
>  at org.apache.jackrabbit.oak.plugins.document.mongo.MongoStatusTest$1.access$000(MongoStatusTest.java:131)
>  at org.apache.jackrabbit.oak.plugins.document.mongo.MongoStatusTest$1$1.runCommand(MongoStatusTest.java:155)
>  at org.apache.jackrabbit.oak.plugins.document.mongo.MongoStatus.getServerStatus(MongoStatus.java:241)
>  at org.apache.jackrabbit.oak.plugins.document.mongo.MongoStatus.getVersion(MongoStatus.java:149)
>  at org.apache.jackrabbit.oak.plugins.document.mongo.MongoStatusTest.unauthorized(MongoStatusTest.java:214)
>  at sun.reflect.NativeMethodAccessorImpl.invoke0(Native Method)
>  at sun.reflect.NativeMethodAccessorImpl.invoke(NativeMethodAccessorImpl.java:62)
>  at sun.reflect.DelegatingMethodAccessorImpl.invoke(DelegatingMethodAccessorImpl.java:43)
>  at java.lang.reflect.Method.invoke(Method.java:498)
>  at org.junit.runners.model.FrameworkMethod$1.runReflectiveCall(FrameworkMethod.java:50)
>  at org.junit.internal.runners.model.ReflectiveCallable.run(ReflectiveCallable.java:12)
>  at org.junit.runners.model.FrameworkMethod.invokeExplosively(FrameworkMethod.java:47)
>  at org.junit.internal.runners.statements.InvokeMethod.evaluate(InvokeMethod.java:17)
>  at org.junit.internal.runners.statements.RunBefores.evaluate(RunBefores.java:26)
>  at org.junit.rules.ExternalResource$1.evaluate(ExternalResource.java:48)
>  at com.arakelian.docker.junit.DockerRule$StatementWithDockerRule.evaluate(DockerRule.java:76)
>  at org.junit.rules.RunRules.evaluate(RunRules.java:20)
>  at org.junit.runners.ParentRunner.runLeaf(ParentRunner.java:325)
>  at org.junit.runners.BlockJUnit4ClassRunner.runChild(BlockJUnit4ClassRunner.java:78)
>  at org.junit.runners.BlockJUnit4ClassRunner.runChild(BlockJUnit4ClassRunner.java:57)
>  at org.junit.runners.ParentRunner$3.run(ParentRunner.java:290)
>  at org.junit.runners.ParentRunner$1.schedule(ParentRunner.java:71)
>  at org.junit.runners.ParentRunner.runChildren(ParentRunner.java:288)
>  at org.junit.runners.ParentRunner.access$000(ParentRunner.java:58)
>  at org.junit.runners.ParentRunner$2.evaluate(ParentRunner.java:268)
>  at org.junit.internal.runners.statements.RunBefores.evaluate(RunBefores.java:26)
>  at org.junit.runners.ParentRunner.run(ParentRunner.java:363)
>  at org.apache.maven.surefire.junit4.JUnit4Provider.execute(JUnit4Provider.java:365)
>  at org.apache.maven.surefire.junit4.JUnit4Provider.executeWithRerun(JUnit4Provider.java:273)
>  at org.apache.maven.surefire.junit4.JUnit4Provider.executeTestSet(JUnit4Provider.java:238)
>  at org.apache.maven.surefire.junit4.JUnit4Provider.invoke(JUnit4Provider.java:159)
>  at org.apache.maven.surefire.booter.ForkedBooter.invokeProviderInSameClassLoader(ForkedBooter.java:384)
>  at org.apache.maven.surefire.booter.ForkedBooter.runSuitesInProcess(ForkedBooter.java:345)
>  at org.apache.maven.surefire.booter.ForkedBooter.execute(ForkedBooter.java:126)
>  at org.apache.maven.surefire.booter.ForkedBooter.main(ForkedBooter.java:418)



--
This message was sent by Atlassian JIRA
(v7.6.14#76016)

Mime
View raw message