jackrabbit-oak-issues mailing list archives

Site index · List index
Message view « Date » · « Thread »
Top « Date » · « Thread »
From "Marcel Reutegger (Jira)" <j...@apache.org>
Subject [jira] [Updated] (OAK-9064) Build failure: The forked VM terminated without properly saying goodbye
Date Fri, 05 Jun 2020 14:12:00 GMT

     [ https://issues.apache.org/jira/browse/OAK-9064?page=com.atlassian.jira.plugin.system.issuetabpanels:all-tabpanel
]

Marcel Reutegger updated OAK-9064:
----------------------------------
    Summary: Build failure: The forked VM terminated without properly saying goodbye  (was:
Build failure: )

> Build failure: The forked VM terminated without properly saying goodbye
> -----------------------------------------------------------------------
>
>                 Key: OAK-9064
>                 URL: https://issues.apache.org/jira/browse/OAK-9064
>             Project: Jackrabbit Oak
>          Issue Type: Bug
>          Components: continuous integration, segmentmk
>            Reporter: Hudson
>            Assignee: Marcel Reutegger
>            Priority: Major
>
> No description is provided
> The build Jackrabbit Oak #2754 has failed.
> First failed run: [Jackrabbit Oak #2754|https://builds.apache.org/job/Jackrabbit%20Oak/2754/]
[console log|https://builds.apache.org/job/Jackrabbit%20Oak/2754/console]
> Recent failure reports:
> {noformat}
> [ERROR] Failed to execute goal org.apache.maven.plugins:maven-surefire-plugin:3.0.0-M4:test
(default-test) on project oak-segment-aws: There are test failures.
> [ERROR] 
> [ERROR] Please refer to /home/jenkins/jenkins-slave/workspace/Jackrabbit Oak/oak-segment-aws/target/surefire-reports
for the individual test results.
> [ERROR] Please refer to dump files (if any exist) [date].dump, [date]-jvmRun[N].dump
and [date].dumpstream.
> [ERROR] The forked VM terminated without properly saying goodbye. VM crash or System.exit
called?
> [ERROR] Command was /bin/sh -c cd "/home/jenkins/jenkins-slave/workspace/Jackrabbit Oak/oak-segment-aws"
&& /usr/local/asfpackages/java/jdk1.8.0_241/jre/bin/java -Dsqlite4java.library.path=/home/jenkins/jenkins-slave/workspace/Jackrabbit
Oak/oak-segment-aws/target/dependencies -jar '/home/jenkins/jenkins-slave/workspace/Jackrabbit
Oak/oak-segment-aws/target/surefire/surefirebooter1009043844018690969.jar' '/home/jenkins/jenkins-slave/workspace/Jackrabbit
Oak/oak-segment-aws/target/surefire' 2020-06-05T11-07-49_644-jvmRun1 surefire1317142457351706711tmp
surefire_07720470502511092497tmp
> [ERROR] Error occurred in starting fork, check output in log
> [ERROR] Process Exit Code: 1
> [ERROR] org.apache.maven.surefire.booter.SurefireBooterForkException: The forked VM terminated
without properly saying goodbye. VM crash or System.exit called?
> [ERROR] Command was /bin/sh -c cd "/home/jenkins/jenkins-slave/workspace/Jackrabbit Oak/oak-segment-aws"
&& /usr/local/asfpackages/java/jdk1.8.0_241/jre/bin/java -Dsqlite4java.library.path=/home/jenkins/jenkins-slave/workspace/Jackrabbit
Oak/oak-segment-aws/target/dependencies -jar '/home/jenkins/jenkins-slave/workspace/Jackrabbit
Oak/oak-segment-aws/target/surefire/surefirebooter1009043844018690969.jar' '/home/jenkins/jenkins-slave/workspace/Jackrabbit
Oak/oak-segment-aws/target/surefire' 2020-06-05T11-07-49_644-jvmRun1 surefire1317142457351706711tmp
surefire_07720470502511092497tmp
> [ERROR] Error occurred in starting fork, check output in log
> [ERROR] Process Exit Code: 1
> [ERROR] at org.apache.maven.plugin.surefire.booterclient.ForkStarter.fork(ForkStarter.java:690)
> [ERROR] at org.apache.maven.plugin.surefire.booterclient.ForkStarter.run(ForkStarter.java:285)
> [ERROR] at org.apache.maven.plugin.surefire.booterclient.ForkStarter.run(ForkStarter.java:248)
> [ERROR] at org.apache.maven.plugin.surefire.AbstractSurefireMojo.executeProvider(AbstractSurefireMojo.java:1217)
> [ERROR] at org.apache.maven.plugin.surefire.AbstractSurefireMojo.executeAfterPreconditionsChecked(AbstractSurefireMojo.java:1063)
> [ERROR] at org.apache.maven.plugin.surefire.AbstractSurefireMojo.execute(AbstractSurefireMojo.java:889)
> [ERROR] at org.apache.maven.plugin.DefaultBuildPluginManager.executeMojo(DefaultBuildPluginManager.java:134)
> [ERROR] at org.apache.maven.lifecycle.internal.MojoExecutor.execute(MojoExecutor.java:207)
> [ERROR] at org.apache.maven.lifecycle.internal.MojoExecutor.execute(MojoExecutor.java:153)
> [ERROR] at org.apache.maven.lifecycle.internal.MojoExecutor.execute(MojoExecutor.java:145)
> [ERROR] at org.apache.maven.lifecycle.internal.LifecycleModuleBuilder.buildProject(LifecycleModuleBuilder.java:116)
> [ERROR] at org.apache.maven.lifecycle.internal.LifecycleModuleBuilder.buildProject(LifecycleModuleBuilder.java:80)
> [ERROR] at org.apache.maven.lifecycle.internal.builder.singlethreaded.SingleThreadedBuilder.build(SingleThreadedBuilder.java:51)
> [ERROR] at org.apache.maven.lifecycle.internal.LifecycleStarter.execute(LifecycleStarter.java:128)
> [ERROR] at org.apache.maven.DefaultMaven.doExecute(DefaultMaven.java:307)
> [ERROR] at org.apache.maven.DefaultMaven.doExecute(DefaultMaven.java:193)
> [ERROR] at org.apache.maven.DefaultMaven.execute(DefaultMaven.java:106)
> [ERROR] at org.jvnet.hudson.maven3.launcher.Maven33Launcher.main(Maven33Launcher.java:129)
> [ERROR] at sun.reflect.NativeMethodAccessorImpl.invoke0(Native Method)
> [ERROR] at sun.reflect.NativeMethodAccessorImpl.invoke(NativeMethodAccessorImpl.java:62)
> [ERROR] at sun.reflect.DelegatingMethodAccessorImpl.invoke(DelegatingMethodAccessorImpl.java:43)
> [ERROR] at java.lang.reflect.Method.invoke(Method.java:498)
> [ERROR] at org.codehaus.plexus.classworlds.launcher.Launcher.launchStandard(Launcher.java:330)
> [ERROR] at org.codehaus.plexus.classworlds.launcher.Launcher.launch(Launcher.java:238)
> [ERROR] at jenkins.maven3.agent.Maven33Main.launch(Maven33Main.java:178)
> [ERROR] at sun.reflect.NativeMethodAccessorImpl.invoke0(Native Method)
> [ERROR] at sun.reflect.NativeMethodAccessorImpl.invoke(NativeMethodAccessorImpl.java:62)
> [ERROR] at sun.reflect.DelegatingMethodAccessorImpl.invoke(DelegatingMethodAccessorImpl.java:43)
> [ERROR] at java.lang.reflect.Method.invoke(Method.java:498)
> [ERROR] at hudson.maven.Maven3Builder.call(Maven3Builder.java:139)
> [ERROR] at hudson.maven.Maven3Builder.call(Maven3Builder.java:70)
> [ERROR] at hudson.remoting.UserRequest.perform(UserRequest.java:212)
> [ERROR] at hudson.remoting.UserRequest.perform(UserRequest.java:54)
> [ERROR] at hudson.remoting.Request$2.run(Request.java:369)
> [ERROR] at hudson.remoting.InterceptingExecutorService$1.call(InterceptingExecutorService.java:72)
> [ERROR] at java.util.concurrent.FutureTask.run(FutureTask.java:266)
> [ERROR] at java.util.concurrent.ThreadPoolExecutor.runWorker(ThreadPoolExecutor.java:1149)
> [ERROR] at java.util.concurrent.ThreadPoolExecutor$Worker.run(ThreadPoolExecutor.java:624)
> [ERROR] at java.lang.Thread.run(Thread.java:748)
> [ERROR] -> [Help 1]
> [ERROR] 
> [ERROR] To see the full stack trace of the errors, re-run Maven with the -e switch.
> [ERROR] Re-run Maven using the -X switch to enable full debug logging.
> [ERROR] 
> [ERROR] For more information about the errors and possible solutions, please read the
following articles:
> [ERROR] [Help 1] http://cwiki.apache.org/confluence/display/MAVEN/MojoExecutionException
> [ERROR] 
> [ERROR] After correcting the problems, you can resume the build with the command
> [ERROR]   mvn <goals> -rf :oak-segment-aws
> {noformat}



--
This message was sent by Atlassian Jira
(v8.3.4#803005)

Mime
View raw message