jackrabbit-oak-issues mailing list archives

Site index · List index
Message view « Date » · « Thread »
Top « Date » · « Thread »
From "Marcel Reutegger (Jira)" <j...@apache.org>
Subject [jira] [Updated] (OAK-9313) Test failure: LoginModuleMonitorTest
Date Fri, 08 Jan 2021 08:14:00 GMT

     [ https://issues.apache.org/jira/browse/OAK-9313?page=com.atlassian.jira.plugin.system.issuetabpanels:all-tabpanel
]

Marcel Reutegger updated OAK-9313:
----------------------------------
    Component/s: security-spi
    Description: 
No description is provided

The build Jackrabbit/jackrabbit-oak-trunk #117 has failed.
First failed run: [Jackrabbit/jackrabbit-oak-trunk #117|https://ci-builds.apache.org/job/Jackrabbit/job/jackrabbit-oak-trunk/117/]
[console log|https://ci-builds.apache.org/job/Jackrabbit/job/jackrabbit-oak-trunk/117/console]

{noformat}
[ERROR] Tests run: 3, Failures: 0, Errors: 3, Skipped: 0, Time elapsed: 0.047 s <<<
FAILURE! - in org.apache.jackrabbit.oak.spi.security.authentication.LoginModuleMonitorTest
[ERROR] testGetMonitorClass(org.apache.jackrabbit.oak.spi.security.authentication.LoginModuleMonitorTest)
 Time elapsed: 0.025 s  <<< ERROR!
org.mockito.exceptions.base.MockitoException: 

Mockito cannot mock this class: class org.apache.jackrabbit.oak.spi.security.authentication.LoginModuleMonitor$1.

Mockito can only mock non-private & non-final classes.
{noformat}

  was:
No description is provided

The build Jackrabbit/jackrabbit-oak-trunk #117 has failed.
First failed run: [Jackrabbit/jackrabbit-oak-trunk #117|https://ci-builds.apache.org/job/Jackrabbit/job/jackrabbit-oak-trunk/117/]
[console log|https://ci-builds.apache.org/job/Jackrabbit/job/jackrabbit-oak-trunk/117/console]

        Summary: Test failure: LoginModuleMonitorTest  (was: Build Jackrabbit/jackrabbit-oak-trunk
#117 failed)

> Test failure: LoginModuleMonitorTest
> ------------------------------------
>
>                 Key: OAK-9313
>                 URL: https://issues.apache.org/jira/browse/OAK-9313
>             Project: Jackrabbit Oak
>          Issue Type: Bug
>          Components: continuous integration, security-spi
>            Reporter: Hudson
>            Priority: Major
>
> No description is provided
> The build Jackrabbit/jackrabbit-oak-trunk #117 has failed.
> First failed run: [Jackrabbit/jackrabbit-oak-trunk #117|https://ci-builds.apache.org/job/Jackrabbit/job/jackrabbit-oak-trunk/117/]
[console log|https://ci-builds.apache.org/job/Jackrabbit/job/jackrabbit-oak-trunk/117/console]
> {noformat}
> [ERROR] Tests run: 3, Failures: 0, Errors: 3, Skipped: 0, Time elapsed: 0.047 s <<<
FAILURE! - in org.apache.jackrabbit.oak.spi.security.authentication.LoginModuleMonitorTest
> [ERROR] testGetMonitorClass(org.apache.jackrabbit.oak.spi.security.authentication.LoginModuleMonitorTest)
 Time elapsed: 0.025 s  <<< ERROR!
> org.mockito.exceptions.base.MockitoException: 
> Mockito cannot mock this class: class org.apache.jackrabbit.oak.spi.security.authentication.LoginModuleMonitor$1.
> Mockito can only mock non-private & non-final classes.
> {noformat}



--
This message was sent by Atlassian Jira
(v8.3.4#803005)

Mime
View raw message