jakarta-notifications mailing list archives

Site index · List index
Message view « Date » · « Thread »
Top « Date » · « Thread »
From Gump <notificati...@jakarta.apache.org>
Subject [GUMP@vmgump]: Project jakarta-bsf3-test (in module jakarta-bsf3) failed
Date Wed, 02 Feb 2011 02:31:01 GMT
To whom it may engage...
        
This is an automated request, but not an unsolicited one. For 
more information please visit http://gump.apache.org/nagged.html, 
and/or contact the folk at general@gump.apache.org.

Project jakarta-bsf3-test has an issue affecting its community integration.
This issue affects 1 projects.
The current state of this project is 'Failed', with reason 'Build Failed'.
For reference only, the following projects are affected by this:
    - jakarta-bsf3-test :  Bean Scripting Framework


Full details are available at:
    http://vmgump.apache.org/gump/public/jakarta-bsf3/jakarta-bsf3-test/index.html

That said, some information snippets are provided here.

The following annotations (debug/informational/warning/error messages) were provided:
 -WARNING- Overriding Maven settings: [/srv/gump/public/workspace/jakarta-bsf3/gump_mvn_settings.xml]
 -DEBUG- (Apache Gump generated) Apache Maven Settings in: /srv/gump/public/workspace/jakarta-bsf3/gump_mvn_settings.xml
 -INFO- Failed with reason build failed
 -DEBUG- Maven POM in: /srv/gump/public/workspace/jakarta-bsf3/pom.xml



The following work was performed:
http://vmgump.apache.org/gump/public/jakarta-bsf3/jakarta-bsf3-test/gump_work/build_jakarta-bsf3_jakarta-bsf3-test.html
Work Name: build_jakarta-bsf3_jakarta-bsf3-test (Type: Build)
Work ended in a state of : Failed
Elapsed: 20 secs
Command Line: /opt/maven2/bin/mvn --batch-mode --settings /srv/gump/public/workspace/jakarta-bsf3/gump_mvn_settings.xml
package 
[Working Directory: /srv/gump/public/workspace/jakarta-bsf3]
M2_HOME: /opt/maven2
---------------------------------------------
Tests run: 3, Failures: 0, Errors: 0, Skipped: 0

[INFO] [jar:jar {execution: default-jar}]
[INFO] Building jar: /srv/gump/public/workspace/jakarta-bsf3/testing/javascript/target/bsf-testing-javascript-3.2-SNAPSHOT.jar
[INFO] ------------------------------------------------------------------------
[INFO] Building Apache BSF testing for Python
[INFO]    task-segment: [package]
[INFO] ------------------------------------------------------------------------
[INFO] [remote-resources:process {execution: default}]
[INFO] [resources:resources {execution: default-resources}]
[INFO] Using 'UTF-8' encoding to copy filtered resources.
[INFO] skip non existing resourceDirectory /srv/gump/public/workspace/jakarta-bsf3/testing/python/src/main/resources
[INFO] Copying 3 resources
[INFO] [compiler:compile {execution: default-compile}]
[INFO] No sources to compile
[INFO] [resources:testResources {execution: default-testResources}]
[INFO] Using 'UTF-8' encoding to copy filtered resources.
[INFO] skip non existing resourceDirectory /srv/gump/public/workspace/jakarta-bsf3/testing/python/src/test/resources
[INFO] Copying 3 resources
[INFO] [compiler:testCompile {execution: default-testCompile}]
[INFO] Nothing to compile - all classes are up to date
[INFO] [surefire:test {execution: default-test}]
[INFO] Surefire report directory: /srv/gump/public/workspace/jakarta-bsf3/testing/python/target/surefire-reports

-------------------------------------------------------
 T E S T S
-------------------------------------------------------
Running org.apache.bsf.testing.python.HelloTestCase
Tests run: 1, Failures: 0, Errors: 1, Skipped: 0, Time elapsed: 0.21 sec <<< FAILURE!

Results :

Tests in error: 
  testInvokeFunction(org.apache.bsf.testing.python.HelloTestCase)

Tests run: 1, Failures: 0, Errors: 1, Skipped: 0

[INFO] ------------------------------------------------------------------------
[ERROR] BUILD FAILURE
[INFO] ------------------------------------------------------------------------
[INFO] There are test failures.

Please refer to /srv/gump/public/workspace/jakarta-bsf3/testing/python/target/surefire-reports
for the individual test results.
[INFO] ------------------------------------------------------------------------
[INFO] For more information, run Maven with the -e switch
[INFO] ------------------------------------------------------------------------
[INFO] Total time: 19 seconds
[INFO] Finished at: Wed Feb 02 02:31:00 UTC 2011
[INFO] Final Memory: 34M/82M
[INFO] ------------------------------------------------------------------------
---------------------------------------------

To subscribe to this information via syndicated feeds:
- RSS: http://vmgump.apache.org/gump/public/jakarta-bsf3/jakarta-bsf3-test/rss.xml
- Atom: http://vmgump.apache.org/gump/public/jakarta-bsf3/jakarta-bsf3-test/atom.xml

============================== Gump Tracking Only ===
Produced by Apache Gump(TM) version 2.3.
Gump Run 05001801022011, vmgump.apache.org:vmgump:05001801022011
Gump E-mail Identifier (unique within run) #2.

--
Apache Gump
http://gump.apache.org/ [Instance: vmgump]

---------------------------------------------------------------------
To unsubscribe, e-mail: notifications-unsubscribe@jakarta.apache.org
For additional commands, e-mail: notifications-help@jakarta.apache.org


Mime
View raw message