jakarta-notifications mailing list archives

Site index · List index
Message view « Date » · « Thread »
Top « Date » · « Thread »
From Petar Tahchiev <ptahch...@apache.org>
Subject [GUMP@vmgump]: Project cargo-test (in module cargo) failed
Date Tue, 08 Mar 2011 14:52:22 GMT
To whom it may engage...
        
This is an automated request, but not an unsolicited one. For 
more information please visit http://gump.apache.org/nagged.html, 
and/or contact the folk at general@gump.apache.org.

Project cargo-test has an issue affecting its community integration.
This issue affects 1 projects.
The current state of this project is 'Failed', with reason 'Build Failed'.
For reference only, the following projects are affected by this:
    - cargo-test :  Cargo provides a Java API to manipulate Java Containers


Full details are available at:
    http://vmgump.apache.org/gump/public/cargo/cargo-test/index.html

That said, some information snippets are provided here.

The following annotations (debug/informational/warning/error messages) were provided:
 -DEBUG- (Apache Gump generated) Apache Maven Settings in: /srv/gump/public/workspace/cargo/gump_mvn_settings.xml
 -INFO- Failed with reason build failed
 -DEBUG- Maven POM in: /srv/gump/public/workspace/cargo/pom.xml
 -INFO- Project Reports in: /srv/gump/public/workspace/cargo/build/test-report
 -WARNING- No directory [/srv/gump/public/workspace/cargo/build/test-report]



The following work was performed:
http://vmgump.apache.org/gump/public/cargo/cargo-test/gump_work/build_cargo_cargo-test.html
Work Name: build_cargo_cargo-test (Type: Build)
Work ended in a state of : Failed
Elapsed: 1 min 19 secs
Command Line: /opt/maven2/bin/mvn --batch-mode -Dsurefire.useFile=false --settings /srv/gump/public/workspace/cargo/gump_mvn_settings.xml
test 
[Working Directory: /srv/gump/public/workspace/cargo]
M2_HOME: /opt/maven2
---------------------------------------------
Mar 8, 2011 2:52:20 PM org.apache.commons.vfs.VfsLog info
INFO: Using "/tmp/vfs_cache" as temporary files store.
Tests run: 3, Failures: 0, Errors: 0, Skipped: 0, Time elapsed: 0.671 sec
Running org.codehaus.cargo.util.Base64Test
Tests run: 1, Failures: 0, Errors: 0, Skipped: 0, Time elapsed: 0.005 sec
Running org.codehaus.cargo.util.VFSFileHandlerTest
Mar 8, 2011 2:52:20 PM org.apache.commons.vfs.VfsLog info
INFO: Using "/tmp/vfs_cache" as temporary files store.
Mar 8, 2011 2:52:20 PM org.apache.commons.vfs.VfsLog info
INFO: Using "/tmp/vfs_cache" as temporary files store.
Mar 8, 2011 2:52:20 PM org.apache.commons.vfs.VfsLog info
INFO: Using "/tmp/vfs_cache" as temporary files store.
Mar 8, 2011 2:52:20 PM org.apache.commons.vfs.VfsLog info
INFO: Using "/tmp/vfs_cache" as temporary files store.
Mar 8, 2011 2:52:21 PM org.apache.commons.vfs.VfsLog info
INFO: Using "/tmp/vfs_cache" as temporary files store.
Mar 8, 2011 2:52:21 PM org.apache.commons.vfs.VfsLog info
INFO: Using "/tmp/vfs_cache" as temporary files store.
Tests run: 6, Failures: 0, Errors: 0, Skipped: 0, Time elapsed: 0.211 sec
Running org.codehaus.cargo.util.Dom4JUtilTest
Tests run: 3, Failures: 0, Errors: 1, Skipped: 0, Time elapsed: 0.033 sec <<< FAILURE!
testNoElementThrowsException(org.codehaus.cargo.util.Dom4JUtilTest)  Time elapsed: 0.022 sec
 <<< ERROR!
org.dom4j.XPathException: Exception occurred evaluting XPath: weblogic:app-deployment. Exception:
XPath expression uses unbound namespace prefix weblogic
	at org.dom4j.xpath.DefaultXPath.handleJaxenException(DefaultXPath.java:374)
	at org.dom4j.xpath.DefaultXPath.selectNodes(DefaultXPath.java:134)
	at org.codehaus.cargo.util.Dom4JUtil.selectElementsMatchingXPath(Dom4JUtil.java:86)
	at org.codehaus.cargo.util.Dom4JUtil.selectElementMatchingXPath(Dom4JUtil.java:100)
	at org.codehaus.cargo.util.Dom4JUtilTest.testNoElementThrowsException(Dom4JUtilTest.java:93)


Results :

Tests in error: 
  testNoElementThrowsException(org.codehaus.cargo.util.Dom4JUtilTest)

Tests run: 17, Failures: 0, Errors: 1, Skipped: 0

[INFO] ------------------------------------------------------------------------
[ERROR] BUILD FAILURE
[INFO] ------------------------------------------------------------------------
[INFO] There are test failures.

Please refer to /srv/gump/public/workspace/cargo/core/api/util/target/surefire-reports for
the individual test results.
[INFO] ------------------------------------------------------------------------
[INFO] For more information, run Maven with the -e switch
[INFO] ------------------------------------------------------------------------
[INFO] Total time: 1 minute 17 seconds
[INFO] Finished at: Tue Mar 08 14:52:21 UTC 2011
[INFO] Final Memory: 74M/176M
[INFO] ------------------------------------------------------------------------
---------------------------------------------

To subscribe to this information via syndicated feeds:
- RSS: http://vmgump.apache.org/gump/public/cargo/cargo-test/rss.xml
- Atom: http://vmgump.apache.org/gump/public/cargo/cargo-test/atom.xml

============================== Gump Tracking Only ===
Produced by Apache Gump(TM) version 2.3.
Gump Run 07000608032011, vmgump.apache.org:vmgump:07000608032011
Gump E-mail Identifier (unique within run) #61.

--
Apache Gump
http://gump.apache.org/ [Instance: vmgump]

---------------------------------------------------------------------
To unsubscribe, e-mail: notifications-unsubscribe@jakarta.apache.org
For additional commands, e-mail: notifications-help@jakarta.apache.org


Mime
View raw message