james-server-dev mailing list archives

Site index · List index
Message view « Date » · « Thread »
Top « Date » · « Thread »
From Apache Hudson Server <hud...@hudson.apache.org>
Subject Build failed in Hudson: mailbox-integration-tests #127
Date Fri, 25 Feb 2011 01:47:35 GMT
See <https://hudson.apache.org/hudson/job/mailbox-integration-tests/127/>

------------------------------------------
[...truncated 40 lines...]
[INFO] snapshot org.apache.james:apache-james-mailbox-jcr:0.2-M2-SNAPSHOT: checking for updates
from maven2-repository.dev.java.net
[INFO] snapshot org.apache.james:apache-james-mailbox-jcr:0.2-M2-SNAPSHOT: checking for updates
from apache.snapshots
[INFO] snapshot org.apache.james:apache-james-mailbox-jpa:0.2-M2-SNAPSHOT: checking for updates
from maven2-repository.dev.java.net
[INFO] snapshot org.apache.james:apache-james-mailbox-jpa:0.2-M2-SNAPSHOT: checking for updates
from apache.snapshots
[INFO] snapshot org.apache.james:apache-james-mailbox-maildir:0.2-M2-SNAPSHOT: checking for
updates from maven2-repository.dev.java.net
[INFO] snapshot org.apache.james:apache-james-mailbox-maildir:0.2-M2-SNAPSHOT: checking for
updates from apache.snapshots
[INFO] snapshot org.apache.james:apache-james-mailbox-memory:0.2-M2-SNAPSHOT: checking for
updates from maven2-repository.dev.java.net
[INFO] snapshot org.apache.james:apache-james-mailbox-memory:0.2-M2-SNAPSHOT: checking for
updates from apache.snapshots
[INFO] snapshot org.apache.james:apache-james-mailbox-torque:0.2-M2-SNAPSHOT: checking for
updates from maven2-repository.dev.java.net
[INFO] snapshot org.apache.james:apache-james-mailbox-torque:0.2-M2-SNAPSHOT: checking for
updates from apache.snapshots
[INFO] [resources:resources {execution: default-resources}]
[INFO] Using 'UTF-8' encoding to copy filtered resources.
[INFO] Copying 113 resources
[INFO] Copying 3 resources
[INFO] [compiler:compile {execution: default-compile}]
[INFO] Compiling 39 source files to <https://hudson.apache.org/hudson/job/mailbox-integration-tests/ws/target/classes>
[INFO] [bundle:manifest {execution: bundle-manifest}]
[WARNING] Embed-Dependency: clause "*;scope=runtime" did not match any dependencies
[INFO] [resources:testResources {execution: default-testResources}]
[INFO] Using 'UTF-8' encoding to copy filtered resources.
[INFO] Copying 4 resources
[INFO] Copying 3 resources
[INFO] [compiler:testCompile {execution: default-testCompile}]
[INFO] Compiling 105 source files to <https://hudson.apache.org/hudson/job/mailbox-integration-tests/ws/target/test-classes>
[INFO] [surefire:test {execution: default-test}]
[INFO] Surefire report directory: <https://hudson.apache.org/hudson/job/mailbox-integration-tests/ws/target/surefire-reports>

-------------------------------------------------------
 T E S T S
-------------------------------------------------------
Running org.apache.james.mailbox.torque.PartContentBuilderMultipartAlternativeTest
Tests run: 3, Failures: 0, Errors: 0, Skipped: 0, Time elapsed: 0.415 sec
Running org.apache.james.mailbox.inmemory.imap.FetchBodySectionTest
Tests run: 9, Failures: 0, Errors: 0, Skipped: 0, Time elapsed: 0.802 sec
Running org.apache.james.mailbox.inmemory.imap.FetchTest
Tests run: 24, Failures: 0, Errors: 0, Skipped: 0, Time elapsed: 1.107 sec
Running org.apache.james.mailbox.torque.MessageUtilsCountUnnormalLinesTest
Tests run: 5, Failures: 0, Errors: 0, Skipped: 0, Time elapsed: 0.03 sec
Running org.apache.james.mailbox.torque.imap.ConcurrentSessionsTest
Tests run: 21, Failures: 0, Errors: 0, Skipped: 0, Time elapsed: 6.1 sec
Running org.apache.james.mailbox.inmemory.imap.SelectedStateTest
Tests run: 30, Failures: 0, Errors: 0, Skipped: 0, Time elapsed: 0.888 sec
Running org.apache.james.mailbox.torque.imap.FetchBodyStructureTest
Tests run: 12, Failures: 0, Errors: 12, Skipped: 0, Time elapsed: 125.493 sec <<<
FAILURE!
Running org.apache.james.mailbox.inmemory.imap.SelectTest
Tests run: 3, Failures: 0, Errors: 0, Skipped: 0, Time elapsed: 0.551 sec
Running org.apache.james.mailbox.jpa.imap.FetchBodyStructureTest
Tests run: 12, Failures: 0, Errors: 0, Skipped: 0, Time elapsed: 7.604 sec
Running org.apache.james.mailbox.jcr.imap.SelectedInboxTest
Tests run: 42, Failures: 0, Errors: 0, Skipped: 0, Time elapsed: 19.157 sec
Running org.apache.james.mailbox.torque.MessageRowUtilsTest
Tests run: 3, Failures: 0, Errors: 0, Skipped: 0, Time elapsed: 0.127 sec
Running org.apache.james.mailbox.jpa.imap.SecurityTest
Tests run: 21, Failures: 0, Errors: 0, Skipped: 0, Time elapsed: 1.815 sec
Running org.apache.james.mailbox.inmemory.imap.ConcurrentSessionsTest
Tests run: 21, Failures: 0, Errors: 0, Skipped: 0, Time elapsed: 0.766 sec
Running org.apache.james.mailbox.torque.imap.EventTest
Tests run: 3, Failures: 0, Errors: 0, Skipped: 0, Time elapsed: 3.146 sec
Running org.apache.james.mailbox.jpa.imap.ConcurrentSessionsTest
Tests run: 21, Failures: 0, Errors: 0, Skipped: 0, Time elapsed: 4.424 sec
Running org.apache.james.mailbox.maildir.imap.PartialFetchTest
Tests run: 12, Failures: 0, Errors: 0, Skipped: 0, Time elapsed: 1.318 sec
Running org.apache.james.mailbox.inmemory.imap.SecurityTest
Tests run: 21, Failures: 0, Errors: 0, Skipped: 0, Time elapsed: 0.279 sec
Running org.apache.james.mailbox.jcr.imap.SearchTest
Tests run: 6, Failures: 0, Errors: 0, Skipped: 0, Time elapsed: 19.74 sec
Running org.apache.james.mailbox.inmemory.imap.EventTest
Tests run: 3, Failures: 0, Errors: 0, Skipped: 0, Time elapsed: 0.541 sec
Running org.apache.james.mailbox.torque.imap.FetchTest
Tests run: 24, Failures: 0, Errors: 15, Skipped: 0, Time elapsed: 156.088 sec <<<
FAILURE!
Running org.apache.james.mailbox.jcr.imap.FetchBodySectionTest
Tests run: 9, Failures: 0, Errors: 0, Skipped: 0, Time elapsed: 11.85 sec
Running org.apache.james.mailbox.torque.SearchUtilsRFC822Test
Tests run: 6, Failures: 0, Errors: 0, Skipped: 0, Time elapsed: 0.389 sec
Running org.apache.james.mailbox.torque.imap.AuthenticatedStateTest
Tests run: 57, Failures: 0, Errors: 0, Skipped: 0, Time elapsed: 7.127 sec
Running org.apache.james.mailbox.maildir.imap.ConcurrentSessionsTest
Tests run: 21, Failures: 0, Errors: 0, Skipped: 0, Time elapsed: 1.135 sec
Running org.apache.james.mailbox.maildir.imap.FetchHeadersTest
Tests run: 6, Failures: 0, Errors: 0, Skipped: 0, Time elapsed: 1.061 sec
Running org.apache.james.mailbox.maildir.imap.SelectedInboxTest
Tests run: 42, Failures: 0, Errors: 0, Skipped: 0, Time elapsed: 1.164 sec
Running org.apache.james.mailbox.inmemory.imap.SelectedInboxTest
Tests run: 42, Failures: 0, Errors: 0, Skipped: 0, Time elapsed: 0.855 sec
Running org.apache.james.mailbox.maildir.imap.NonAuthenticatedStateTest
Tests run: 21, Failures: 0, Errors: 0, Skipped: 0, Time elapsed: 0.338 sec
Running org.apache.james.mailbox.maildir.imap.SelectedStateTest
Tests run: 30, Failures: 0, Errors: 0, Skipped: 0, Time elapsed: 1.518 sec
Running org.apache.james.mailbox.jpa.imap.SearchTest
Tests run: 6, Failures: 0, Errors: 0, Skipped: 0, Time elapsed: 11.333 sec
Running org.apache.james.mailbox.jpa.imap.ExpungeTest
Tests run: 3, Failures: 0, Errors: 0, Skipped: 0, Time elapsed: 3.739 sec
Running org.apache.james.mailbox.torque.imap.NonAuthenticatedStateTest
Tests run: 21, Failures: 0, Errors: 0, Skipped: 0, Time elapsed: 1.932 sec
Running org.apache.james.mailbox.jpa.imap.SelectedStateTest
Tests run: 30, Failures: 0, Errors: 0, Skipped: 0, Time elapsed: 6.332 sec
Running org.apache.james.mailbox.torque.imap.FetchHeadersTest
Tests run: 6, Failures: 0, Errors: 0, Skipped: 0, Time elapsed: 4.722 sec
Running org.apache.james.mailbox.jcr.imap.EventTest
Tests run: 3, Failures: 0, Errors: 0, Skipped: 0, Time elapsed: 7.275 sec
Running org.apache.james.mailbox.jcr.imap.FetchTest
Tests run: 24, Failures: 0, Errors: 0, Skipped: 0, Time elapsed: 20.397 sec
Running org.apache.james.mailbox.maildir.imap.AuthenticatedStateTest
Tests run: 57, Failures: 0, Errors: 0, Skipped: 0, Time elapsed: 1.253 sec
Running org.apache.james.mailbox.torque.SearchUtilsMultipartMixedTest
Tests run: 7, Failures: 0, Errors: 0, Skipped: 0, Time elapsed: 0.429 sec
Running org.apache.james.mailbox.torque.imap.PartialFetchTest
Tests run: 12, Failures: 0, Errors: 12, Skipped: 0, Time elapsed: 125.18 sec <<<
FAILURE!
Running org.apache.james.mailbox.jcr.imap.FetchHeadersTest
Tests run: 6, Failures: 0, Errors: 0, Skipped: 0, Time elapsed: 11.835 sec
Running org.apache.james.mailbox.torque.imap.SecurityTest
Tests run: 21, Failures: 0, Errors: 0, Skipped: 0, Time elapsed: 1.833 sec
Running org.apache.james.mailbox.torque.imap.ListingTest
Tests run: 6, Failures: 0, Errors: 0, Skipped: 0, Time elapsed: 2.693 sec
Running org.apache.james.mailbox.maildir.imap.EventTest
Tests run: 3, Failures: 0, Errors: 0, Skipped: 0, Time elapsed: 0.632 sec
Running org.apache.james.mailbox.inmemory.imap.ExpungeTest
Tests run: 3, Failures: 0, Errors: 0, Skipped: 0, Time elapsed: 0.626 sec
Running org.apache.james.mailbox.torque.imap.SelectedStateTest
Tests run: 30, Failures: 0, Errors: 3, Skipped: 0, Time elapsed: 37.467 sec <<< FAILURE!
Running org.apache.james.mailbox.torque.imap.SelectedInboxTest
Tests run: 42, Failures: 0, Errors: 0, Skipped: 0, Time elapsed: 7.171 sec
Running org.apache.james.mailbox.jpa.imap.RenameTest
Tests run: 9, Failures: 0, Errors: 0, Skipped: 0, Time elapsed: 6.929 sec
Running org.apache.james.mailbox.torque.imap.FetchBodySectionTest
Tests run: 9, Failures: 0, Errors: 9, Skipped: 0, Time elapsed: 94.236 sec <<< FAILURE!
Running org.apache.james.mailbox.jpa.imap.FetchHeadersTest
Tests run: 6, Failures: 0, Errors: 0, Skipped: 0, Time elapsed: 4.718 sec
Running org.apache.james.mailbox.torque.SearchUtilsTest
Tests run: 40, Failures: 0, Errors: 0, Skipped: 0, Time elapsed: 0.22 sec
Running org.apache.james.mailbox.jpa.imap.UidSearchTest
Tests run: 6, Failures: 0, Errors: 0, Skipped: 0, Time elapsed: 12.93 sec
Running org.apache.james.mailbox.jpa.imap.AuthenticatedStateTest
Tests run: 57, Failures: 0, Errors: 0, Skipped: 0, Time elapsed: 4.945 sec
Running org.apache.james.mailbox.jpa.imap.SelectedInboxTest
Tests run: 42, Failures: 0, Errors: 0, Skipped: 0, Time elapsed: 4.491 sec
Running org.apache.james.mailbox.torque.imap.ExpungeTest
Tests run: 3, Failures: 0, Errors: 0, Skipped: 0, Time elapsed: 3.719 sec
Running org.apache.james.mailbox.maildir.imap.FetchTest
Tests run: 24, Failures: 0, Errors: 0, Skipped: 0, Time elapsed: 1.547 sec
Running org.apache.james.mailbox.torque.MessageUtilsNormalisedWriteToTest
Tests run: 8, Failures: 0, Errors: 0, Skipped: 0, Time elapsed: 0.029 sec
Running org.apache.james.mailbox.torque.imap.SelectTest
Tests run: 3, Failures: 0, Errors: 3, Skipped: 0, Time elapsed: 32.754 sec <<< FAILURE!
Running org.apache.james.mailbox.maildir.imap.ListingTest
Tests run: 6, Failures: 0, Errors: 0, Skipped: 0, Time elapsed: 0.495 sec
Running org.apache.james.mailbox.jcr.imap.SelectedStateTest
Tests run: 30, Failures: 0, Errors: 0, Skipped: 0, Time elapsed: 21.283 sec
Running org.apache.james.mailbox.maildir.imap.RenameTest
Tests run: 9, Failures: 0, Errors: 0, Skipped: 0, Time elapsed: 1.706 sec
Running org.apache.james.mailbox.inmemory.imap.RenameTest
Tests run: 9, Failures: 0, Errors: 0, Skipped: 0, Time elapsed: 0.974 sec
Running org.apache.james.mailbox.jcr.imap.NonAuthenticatedStateTest
Tests run: 21, Failures: 0, Errors: 0, Skipped: 0, Time elapsed: 9.601 sec
Running org.apache.james.mailbox.maildir.imap.ExpungeTest
Tests run: 3, Failures: 0, Errors: 0, Skipped: 0, Time elapsed: 0.8 sec
Running org.apache.james.mailbox.jcr.imap.AuthenticatedStateTest
Tests run: 57, Failures: 0, Errors: 0, Skipped: 0, Time elapsed: 23.286 sec
Running org.apache.james.mailbox.jcr.imap.ListingTest
Tests run: 6, Failures: 0, Errors: 0, Skipped: 0, Time elapsed: 7.868 sec
Running org.apache.james.mailbox.inmemory.imap.ListingTest
Tests run: 6, Failures: 0, Errors: 0, Skipped: 0, Time elapsed: 0.337 sec
Running org.apache.james.mailbox.jpa.imap.SelectTest
Tests run: 3, Failures: 0, Errors: 0, Skipped: 0, Time elapsed: 2.547 sec
Running org.apache.james.mailbox.inmemory.imap.UidSearchTest
Tests run: 6, Failures: 0, Errors: 0, Skipped: 0, Time elapsed: 1.87 sec
Running org.apache.james.mailbox.jcr.imap.UidSearchTest
Tests run: 6, Failures: 0, Errors: 0, Skipped: 0, Time elapsed: 25.085 sec
Running org.apache.james.mailbox.torque.imap.RenameTest
Tests run: 9, Failures: 0, Errors: 0, Skipped: 0, Time elapsed: 8.53 sec
Running org.apache.james.mailbox.inmemory.imap.PartialFetchTest
Tests run: 12, Failures: 0, Errors: 0, Skipped: 0, Time elapsed: 0.922 sec
Running org.apache.james.mailbox.jpa.imap.PartialFetchTest
Tests run: 12, Failures: 0, Errors: 0, Skipped: 0, Time elapsed: 4.942 sec
Running org.apache.james.mailbox.jcr.imap.SecurityTest
Tests run: 21, Failures: 0, Errors: 0, Skipped: 0, Time elapsed: 9.318 sec
Running org.apache.james.mailbox.jcr.imap.FetchBodyStructureTest
Tests run: 12, Failures: 0, Errors: 0, Skipped: 0, Time elapsed: 17.701 sec
Running org.apache.james.mailbox.jpa.imap.ListingTest
Tests run: 6, Failures: 0, Errors: 0, Skipped: 0, Time elapsed: 2.491 sec
Running org.apache.james.mailbox.inmemory.imap.SearchTest
Tests run: 6, Failures: 0, Errors: 0, Skipped: 0, Time elapsed: 1.872 sec
Running org.apache.james.mailbox.maildir.imap.SelectTest
Tests run: 3, Failures: 0, Errors: 0, Skipped: 0, Time elapsed: 0.643 sec
Running org.apache.james.mailbox.maildir.imap.FetchBodyStructureTest
Tests run: 12, Failures: 0, Errors: 0, Skipped: 0, Time elapsed: 2.233 sec
Running org.apache.james.mailbox.inmemory.imap.FetchBodyStructureTest
Tests run: 12, Failures: 0, Errors: 0, Skipped: 0, Time elapsed: 1.524 sec
Running org.apache.james.mailbox.inmemory.imap.NonAuthenticatedStateTest
Tests run: 21, Failures: 0, Errors: 0, Skipped: 0, Time elapsed: 0.334 sec
Running org.apache.james.mailbox.torque.PartContentBuilderComplexMultipartTest
Tests run: 8, Failures: 0, Errors: 0, Skipped: 0, Time elapsed: 0.378 sec
Running org.apache.james.mailbox.inmemory.imap.FetchHeadersTest
Tests run: 6, Failures: 0, Errors: 0, Skipped: 0, Time elapsed: 0.761 sec
Running org.apache.james.mailbox.maildir.imap.SecurityTest
Tests run: 21, Failures: 0, Errors: 0, Skipped: 0, Time elapsed: 0.285 sec
Running org.apache.james.mailbox.jpa.imap.NonAuthenticatedStateTest
Tests run: 21, Failures: 0, Errors: 0, Skipped: 0, Time elapsed: 2.001 sec
Running org.apache.james.mailbox.maildir.imap.FetchBodySectionTest
Tests run: 9, Failures: 0, Errors: 0, Skipped: 0, Time elapsed: 1.131 sec
Running org.apache.james.mailbox.torque.imap.SearchTest
Tests run: 6, Failures: 0, Errors: 0, Skipped: 0, Time elapsed: 10.988 sec
Running org.apache.james.mailbox.jpa.imap.FetchBodySectionTest
Tests run: 9, Failures: 0, Errors: 0, Skipped: 0, Time elapsed: 4.213 sec
Running org.apache.james.mailbox.jpa.imap.FetchTest
Tests run: 24, Failures: 0, Errors: 0, Skipped: 0, Time elapsed: 5.667 sec
Running org.apache.james.mailbox.maildir.imap.UidSearchTest
Tests run: 6, Failures: 0, Errors: 0, Skipped: 0, Time elapsed: 3.312 sec
Running org.apache.james.mailbox.torque.imap.UidSearchTest
Tests run: 6, Failures: 0, Errors: 0, Skipped: 0, Time elapsed: 13.078 sec
Running org.apache.james.mailbox.jcr.imap.ExpungeTest
Tests run: 3, Failures: 0, Errors: 0, Skipped: 0, Time elapsed: 10.035 sec
Running org.apache.james.mailbox.jcr.imap.PartialFetchTest
Tests run: 12, Failures: 0, Errors: 0, Skipped: 0, Time elapsed: 14.037 sec
Running org.apache.james.mailbox.jcr.imap.SelectTest
Tests run: 3, Failures: 0, Errors: 0, Skipped: 0, Time elapsed: 6.413 sec
Running org.apache.james.mailbox.jpa.imap.EventTest
Tests run: 3, Failures: 0, Errors: 0, Skipped: 0, Time elapsed: 2.773 sec
Running org.apache.james.mailbox.jcr.imap.RenameTest
Tests run: 9, Failures: 0, Errors: 0, Skipped: 0, Time elapsed: 20.651 sec
Running org.apache.james.mailbox.jcr.imap.ConcurrentSessionsTest
Tests run: 21, Failures: 0, Errors: 0, Skipped: 0, Time elapsed: 15.431 sec
Running org.apache.james.mailbox.inmemory.imap.AuthenticatedStateTest
Tests run: 57, Failures: 0, Errors: 0, Skipped: 0, Time elapsed: 0.892 sec

Results :

Tests in error: 

Tests run: 1529, Failures: 0, Errors: 54, Skipped: 0

[HUDSON] Recording test results
[HUDSON] Archiving <https://hudson.apache.org/hudson/job/mailbox-integration-tests/ws/pom.xml>
to /home/hudson/hudson/jobs/mailbox-integration-tests/modules/org.apache.james$apache-james-mailbox-integration-tester/builds/2011-02-25_01-28-01/archive/org.apache.james/apache-james-mailbox-integration-tester/0.2-M2-SNAPSHOT/pom.xml
[INFO] ------------------------------------------------------------------------
[ERROR] BUILD FAILURE
[INFO] ------------------------------------------------------------------------
[INFO] There are test failures.

Please refer to <https://hudson.apache.org/hudson/job/mailbox-integration-tests/ws/target/surefire-reports>
for the individual test results.
[INFO] ------------------------------------------------------------------------
[INFO] For more information, run Maven with the -e switch
[INFO] ------------------------------------------------------------------------
[INFO] Total time: 19 minutes 3 seconds
[INFO] Finished at: Thu Feb 24 17:47:33 GMT-08:00 2011
[INFO] Final Memory: 34M/199M
[INFO] ------------------------------------------------------------------------
Maven failed with error.
Sending e-mails to: server-dev@james.apache.org
channel stopped


---------------------------------------------------------------------
To unsubscribe, e-mail: server-dev-unsubscribe@james.apache.org
For additional commands, e-mail: server-dev-help@james.apache.org


Mime
View raw message