james-server-dev mailing list archives

Site index · List index
Message view « Date » · « Thread »
Top « Date » · « Thread »
From Apache Hudson Server <hud...@hudson.apache.org>
Subject Build failed in Hudson: mailbox-integration-tests » Apache James Mailbox Integration Tester #106
Date Tue, 15 Feb 2011 20:43:35 GMT
See <https://hudson.apache.org/hudson/job/mailbox-integration-tests/org.apache.james$apache-james-mailbox-integration-tester/106/>

------------------------------------------
[...truncated 30 lines...]
[INFO] snapshot org.apache.james:apache-james-mailbox-jcr:0.2-M2-SNAPSHOT: checking for updates
from maven2-repository.dev.java.net
[INFO] snapshot org.apache.james:apache-james-mailbox-jcr:0.2-M2-SNAPSHOT: checking for updates
from apache.snapshots
[INFO] snapshot org.apache.james:apache-james-mailbox-jpa:0.2-M2-SNAPSHOT: checking for updates
from maven2-repository.dev.java.net
[INFO] snapshot org.apache.james:apache-james-mailbox-jpa:0.2-M2-SNAPSHOT: checking for updates
from apache.snapshots
[INFO] snapshot org.apache.james:apache-james-mailbox-maildir:0.2-M2-SNAPSHOT: checking for
updates from maven2-repository.dev.java.net
[INFO] snapshot org.apache.james:apache-james-mailbox-maildir:0.2-M2-SNAPSHOT: checking for
updates from apache.snapshots
[INFO] snapshot org.apache.james:apache-james-mailbox-memory:0.2-M2-SNAPSHOT: checking for
updates from maven2-repository.dev.java.net
[INFO] snapshot org.apache.james:apache-james-mailbox-memory:0.2-M2-SNAPSHOT: checking for
updates from apache.snapshots
[INFO] snapshot org.apache.james:apache-james-mailbox-torque:0.2-M2-SNAPSHOT: checking for
updates from maven2-repository.dev.java.net
[INFO] snapshot org.apache.james:apache-james-mailbox-torque:0.2-M2-SNAPSHOT: checking for
updates from apache.snapshots
Downloading: http://repository.apache.org/snapshots/org/apache/james/apache-james-mailbox-store/0.2-M2-SNAPSHOT/apache-james-mailbox-store-0.2-M2-20110215.193421-200-tests.jar
37K downloaded  (apache-james-mailbox-store-0.2-M2-20110215.193421-200-tests.jar)
[INFO] [resources:resources {execution: default-resources}]
[INFO] Using 'UTF-8' encoding to copy filtered resources.
[INFO] Copying 113 resources
[INFO] Copying 3 resources
[INFO] [compiler:compile {execution: default-compile}]
[INFO] Compiling 39 source files to <https://hudson.apache.org/hudson/job/mailbox-integration-tests/org.apache.james$apache-james-mailbox-integration-tester/ws/target/classes>
[INFO] [bundle:manifest {execution: bundle-manifest}]
[WARNING] Embed-Dependency: clause "*;scope=runtime" did not match any dependencies
[INFO] [resources:testResources {execution: default-testResources}]
[INFO] Using 'UTF-8' encoding to copy filtered resources.
[INFO] Copying 4 resources
[INFO] Copying 3 resources
[INFO] [compiler:testCompile {execution: default-testCompile}]
[INFO] Compiling 105 source files to <https://hudson.apache.org/hudson/job/mailbox-integration-tests/org.apache.james$apache-james-mailbox-integration-tester/ws/target/test-classes>
[INFO] [surefire:test {execution: default-test}]
[INFO] Surefire report directory: <https://hudson.apache.org/hudson/job/mailbox-integration-tests/org.apache.james$apache-james-mailbox-integration-tester/ws/target/surefire-reports>

-------------------------------------------------------
 T E S T S
-------------------------------------------------------
Running org.apache.james.mailbox.torque.PartContentBuilderMultipartAlternativeTest
Tests run: 3, Failures: 0, Errors: 0, Skipped: 0, Time elapsed: 0.323 sec
Running org.apache.james.mailbox.inmemory.imap.FetchBodySectionTest
Tests run: 9, Failures: 0, Errors: 0, Skipped: 0, Time elapsed: 0.818 sec
Running org.apache.james.mailbox.inmemory.imap.FetchTest
Tests run: 24, Failures: 0, Errors: 0, Skipped: 0, Time elapsed: 1.142 sec
Running org.apache.james.mailbox.torque.MessageUtilsCountUnnormalLinesTest
Tests run: 5, Failures: 0, Errors: 0, Skipped: 0, Time elapsed: 0.026 sec
Running org.apache.james.mailbox.torque.imap.ConcurrentSessionsTest
Tests run: 21, Failures: 0, Errors: 0, Skipped: 0, Time elapsed: 5.838 sec
Running org.apache.james.mailbox.inmemory.imap.SelectedStateTest
Tests run: 30, Failures: 0, Errors: 0, Skipped: 0, Time elapsed: 0.945 sec
Running org.apache.james.mailbox.torque.imap.FetchBodyStructureTest
Tests run: 12, Failures: 0, Errors: 0, Skipped: 0, Time elapsed: 8.018 sec
Running org.apache.james.mailbox.inmemory.imap.SelectTest
Tests run: 3, Failures: 0, Errors: 0, Skipped: 0, Time elapsed: 0.562 sec
Running org.apache.james.mailbox.jpa.imap.FetchBodyStructureTest
Tests run: 12, Failures: 0, Errors: 0, Skipped: 0, Time elapsed: 7.692 sec
Running org.apache.james.mailbox.jcr.imap.SelectedInboxTest
Tests run: 42, Failures: 0, Errors: 42, Skipped: 0, Time elapsed: 2.552 sec <<< FAILURE!
Running org.apache.james.mailbox.torque.MessageRowUtilsTest
Tests run: 3, Failures: 0, Errors: 0, Skipped: 0, Time elapsed: 0.121 sec
Running org.apache.james.mailbox.jpa.imap.SecurityTest
Tests run: 21, Failures: 0, Errors: 0, Skipped: 0, Time elapsed: 1.852 sec
Running org.apache.james.mailbox.inmemory.imap.ConcurrentSessionsTest
Tests run: 21, Failures: 0, Errors: 0, Skipped: 0, Time elapsed: 0.781 sec
Running org.apache.james.mailbox.torque.imap.EventTest
Tests run: 3, Failures: 0, Errors: 0, Skipped: 0, Time elapsed: 3.14 sec
Running org.apache.james.mailbox.jpa.imap.ConcurrentSessionsTest
Tests run: 21, Failures: 0, Errors: 0, Skipped: 0, Time elapsed: 4.673 sec
Running org.apache.james.mailbox.maildir.imap.PartialFetchTest
Tests run: 12, Failures: 0, Errors: 0, Skipped: 0, Time elapsed: 1.31 sec
Running org.apache.james.mailbox.inmemory.imap.SecurityTest
Tests run: 21, Failures: 0, Errors: 0, Skipped: 0, Time elapsed: 0.271 sec
Running org.apache.james.mailbox.jcr.imap.SearchTest
Tests run: 6, Failures: 0, Errors: 6, Skipped: 0, Time elapsed: 1.08 sec <<< FAILURE!
Running org.apache.james.mailbox.inmemory.imap.EventTest
Tests run: 3, Failures: 0, Errors: 0, Skipped: 0, Time elapsed: 0.518 sec
Running org.apache.james.mailbox.torque.imap.FetchTest
Tests run: 24, Failures: 0, Errors: 0, Skipped: 0, Time elapsed: 7.333 sec
Running org.apache.james.mailbox.jcr.imap.FetchBodySectionTest
Tests run: 9, Failures: 0, Errors: 9, Skipped: 0, Time elapsed: 1.184 sec <<< FAILURE!
Running org.apache.james.mailbox.torque.SearchUtilsRFC822Test
Tests run: 6, Failures: 0, Errors: 0, Skipped: 0, Time elapsed: 0.376 sec
Running org.apache.james.mailbox.torque.imap.AuthenticatedStateTest
Tests run: 57, Failures: 0, Errors: 0, Skipped: 0, Time elapsed: 7.151 sec
Running org.apache.james.mailbox.maildir.imap.ConcurrentSessionsTest
Tests run: 21, Failures: 0, Errors: 0, Skipped: 0, Time elapsed: 1.096 sec
Running org.apache.james.mailbox.maildir.imap.FetchHeadersTest
Tests run: 6, Failures: 0, Errors: 0, Skipped: 0, Time elapsed: 1.06 sec
Running org.apache.james.mailbox.maildir.imap.SelectedInboxTest
Tests run: 42, Failures: 0, Errors: 0, Skipped: 0, Time elapsed: 1.097 sec
Running org.apache.james.mailbox.inmemory.imap.SelectedInboxTest
Tests run: 42, Failures: 0, Errors: 0, Skipped: 0, Time elapsed: 0.838 sec
Running org.apache.james.mailbox.maildir.imap.NonAuthenticatedStateTest
Tests run: 21, Failures: 0, Errors: 0, Skipped: 0, Time elapsed: 0.345 sec
Running org.apache.james.mailbox.maildir.imap.SelectedStateTest
Tests run: 30, Failures: 0, Errors: 0, Skipped: 0, Time elapsed: 1.517 sec
Running org.apache.james.mailbox.jpa.imap.SearchTest
Tests run: 6, Failures: 0, Errors: 0, Skipped: 0, Time elapsed: 11.49 sec
Running org.apache.james.mailbox.jpa.imap.ExpungeTest
Tests run: 3, Failures: 0, Errors: 0, Skipped: 0, Time elapsed: 3.69 sec
Running org.apache.james.mailbox.torque.imap.NonAuthenticatedStateTest
Tests run: 21, Failures: 0, Errors: 0, Skipped: 0, Time elapsed: 1.927 sec
Running org.apache.james.mailbox.jpa.imap.SelectedStateTest
Tests run: 30, Failures: 0, Errors: 0, Skipped: 0, Time elapsed: 6.221 sec
Running org.apache.james.mailbox.torque.imap.FetchHeadersTest
Tests run: 6, Failures: 0, Errors: 0, Skipped: 0, Time elapsed: 4.743 sec
Running org.apache.james.mailbox.jcr.imap.EventTest
Tests run: 3, Failures: 0, Errors: 3, Skipped: 0, Time elapsed: 0.811 sec <<< FAILURE!
Running org.apache.james.mailbox.jcr.imap.FetchTest
Tests run: 24, Failures: 0, Errors: 24, Skipped: 0, Time elapsed: 1.776 sec <<< FAILURE!
Running org.apache.james.mailbox.maildir.imap.AuthenticatedStateTest
Tests run: 57, Failures: 0, Errors: 0, Skipped: 0, Time elapsed: 1.274 sec
Running org.apache.james.mailbox.torque.SearchUtilsMultipartMixedTest
Tests run: 7, Failures: 0, Errors: 0, Skipped: 0, Time elapsed: 0.429 sec
Running org.apache.james.mailbox.torque.imap.PartialFetchTest
Tests run: 12, Failures: 0, Errors: 0, Skipped: 0, Time elapsed: 6.094 sec
Running org.apache.james.mailbox.jcr.imap.FetchHeadersTest
Tests run: 6, Failures: 0, Errors: 6, Skipped: 0, Time elapsed: 1.049 sec <<< FAILURE!
Running org.apache.james.mailbox.torque.imap.SecurityTest
Tests run: 21, Failures: 0, Errors: 0, Skipped: 0, Time elapsed: 1.825 sec
Running org.apache.james.mailbox.torque.imap.ListingTest
Tests run: 6, Failures: 0, Errors: 0, Skipped: 0, Time elapsed: 2.696 sec
Running org.apache.james.mailbox.maildir.imap.EventTest
Tests run: 3, Failures: 0, Errors: 0, Skipped: 0, Time elapsed: 0.638 sec
Running org.apache.james.mailbox.inmemory.imap.ExpungeTest
Tests run: 3, Failures: 0, Errors: 0, Skipped: 0, Time elapsed: 0.621 sec
Running org.apache.james.mailbox.torque.imap.SelectedStateTest
Tests run: 30, Failures: 0, Errors: 0, Skipped: 0, Time elapsed: 7.481 sec
Running org.apache.james.mailbox.torque.imap.SelectedInboxTest
Tests run: 42, Failures: 0, Errors: 0, Skipped: 0, Time elapsed: 7.425 sec
Running org.apache.james.mailbox.jpa.imap.RenameTest
Tests run: 9, Failures: 0, Errors: 0, Skipped: 0, Time elapsed: 7.398 sec
Running org.apache.james.mailbox.torque.imap.FetchBodySectionTest
Tests run: 9, Failures: 0, Errors: 0, Skipped: 0, Time elapsed: 5.081 sec
Running org.apache.james.mailbox.jpa.imap.FetchHeadersTest
Tests run: 6, Failures: 0, Errors: 0, Skipped: 0, Time elapsed: 4.452 sec
Running org.apache.james.mailbox.torque.SearchUtilsTest
Tests run: 40, Failures: 0, Errors: 0, Skipped: 0, Time elapsed: 0.228 sec
Running org.apache.james.mailbox.jpa.imap.UidSearchTest
Tests run: 6, Failures: 0, Errors: 0, Skipped: 0, Time elapsed: 12.6 sec
Running org.apache.james.mailbox.jpa.imap.AuthenticatedStateTest
Tests run: 57, Failures: 0, Errors: 0, Skipped: 0, Time elapsed: 4.734 sec
Running org.apache.james.mailbox.jpa.imap.SelectedInboxTest
Tests run: 42, Failures: 0, Errors: 0, Skipped: 0, Time elapsed: 4.328 sec
Running org.apache.james.mailbox.torque.imap.ExpungeTest
Tests run: 3, Failures: 0, Errors: 0, Skipped: 0, Time elapsed: 3.737 sec
Running org.apache.james.mailbox.maildir.imap.FetchTest
Tests run: 24, Failures: 0, Errors: 0, Skipped: 0, Time elapsed: 1.46 sec
Running org.apache.james.mailbox.torque.MessageUtilsNormalisedWriteToTest
Tests run: 8, Failures: 0, Errors: 0, Skipped: 0, Time elapsed: 0.03 sec
Running org.apache.james.mailbox.torque.imap.SelectTest
Tests run: 3, Failures: 0, Errors: 0, Skipped: 0, Time elapsed: 2.932 sec
Running org.apache.james.mailbox.maildir.imap.ListingTest
Tests run: 6, Failures: 0, Errors: 0, Skipped: 0, Time elapsed: 0.532 sec
Running org.apache.james.mailbox.jcr.imap.SelectedStateTest
Tests run: 30, Failures: 0, Errors: 30, Skipped: 0, Time elapsed: 2.053 sec <<< FAILURE!
Running org.apache.james.mailbox.maildir.imap.RenameTest
Tests run: 9, Failures: 0, Errors: 0, Skipped: 0, Time elapsed: 1.759 sec
Running org.apache.james.mailbox.inmemory.imap.RenameTest
Tests run: 9, Failures: 0, Errors: 0, Skipped: 0, Time elapsed: 0.924 sec
Running org.apache.james.mailbox.jcr.imap.NonAuthenticatedStateTest
Tests run: 21, Failures: 0, Errors: 21, Skipped: 0, Time elapsed: 1.724 sec <<< FAILURE!
Running org.apache.james.mailbox.maildir.imap.ExpungeTest
Tests run: 3, Failures: 0, Errors: 0, Skipped: 0, Time elapsed: 0.802 sec
Running org.apache.james.mailbox.jcr.imap.AuthenticatedStateTest
Tests run: 57, Failures: 0, Errors: 57, Skipped: 0, Time elapsed: 2.929 sec <<< FAILURE!
Running org.apache.james.mailbox.jcr.imap.ListingTest
Tests run: 6, Failures: 0, Errors: 6, Skipped: 0, Time elapsed: 1.046 sec <<< FAILURE!
Running org.apache.james.mailbox.inmemory.imap.ListingTest
Tests run: 6, Failures: 0, Errors: 0, Skipped: 0, Time elapsed: 0.349 sec
Running org.apache.james.mailbox.jpa.imap.SelectTest
Tests run: 3, Failures: 0, Errors: 0, Skipped: 0, Time elapsed: 2.619 sec
Running org.apache.james.mailbox.inmemory.imap.UidSearchTest
Tests run: 6, Failures: 0, Errors: 0, Skipped: 0, Time elapsed: 1.891 sec
Running org.apache.james.mailbox.jcr.imap.UidSearchTest
Tests run: 6, Failures: 0, Errors: 6, Skipped: 0, Time elapsed: 0.949 sec <<< FAILURE!
Running org.apache.james.mailbox.torque.imap.RenameTest
Tests run: 9, Failures: 0, Errors: 0, Skipped: 0, Time elapsed: 8.576 sec
Running org.apache.james.mailbox.inmemory.imap.PartialFetchTest
Tests run: 12, Failures: 0, Errors: 0, Skipped: 0, Time elapsed: 0.919 sec
Running org.apache.james.mailbox.jpa.imap.PartialFetchTest
Tests run: 12, Failures: 0, Errors: 0, Skipped: 0, Time elapsed: 5.237 sec
Running org.apache.james.mailbox.jcr.imap.SecurityTest
Tests run: 21, Failures: 0, Errors: 21, Skipped: 0, Time elapsed: 1.621 sec <<< FAILURE!
Running org.apache.james.mailbox.jcr.imap.FetchBodyStructureTest
Tests run: 12, Failures: 0, Errors: 12, Skipped: 0, Time elapsed: 1.411 sec <<< FAILURE!
Running org.apache.james.mailbox.jpa.imap.ListingTest
Tests run: 6, Failures: 0, Errors: 0, Skipped: 0, Time elapsed: 2.468 sec
Running org.apache.james.mailbox.inmemory.imap.SearchTest
Tests run: 6, Failures: 0, Errors: 0, Skipped: 0, Time elapsed: 1.784 sec
Running org.apache.james.mailbox.maildir.imap.SelectTest
Tests run: 3, Failures: 0, Errors: 0, Skipped: 0, Time elapsed: 0.619 sec
Running org.apache.james.mailbox.maildir.imap.FetchBodyStructureTest
Tests run: 12, Failures: 0, Errors: 0, Skipped: 0, Time elapsed: 2.155 sec
Running org.apache.james.mailbox.inmemory.imap.FetchBodyStructureTest
Tests run: 12, Failures: 0, Errors: 0, Skipped: 0, Time elapsed: 1.341 sec
Running org.apache.james.mailbox.inmemory.imap.NonAuthenticatedStateTest
Tests run: 21, Failures: 0, Errors: 0, Skipped: 0, Time elapsed: 0.312 sec
Running org.apache.james.mailbox.torque.PartContentBuilderComplexMultipartTest
Tests run: 8, Failures: 0, Errors: 0, Skipped: 0, Time elapsed: 0.362 sec
Running org.apache.james.mailbox.inmemory.imap.FetchHeadersTest
Tests run: 6, Failures: 0, Errors: 0, Skipped: 0, Time elapsed: 0.719 sec
Running org.apache.james.mailbox.maildir.imap.SecurityTest
Tests run: 21, Failures: 0, Errors: 0, Skipped: 0, Time elapsed: 0.284 sec
Running org.apache.james.mailbox.jpa.imap.NonAuthenticatedStateTest
Tests run: 21, Failures: 0, Errors: 0, Skipped: 0, Time elapsed: 1.973 sec
Running org.apache.james.mailbox.maildir.imap.FetchBodySectionTest
Tests run: 9, Failures: 0, Errors: 0, Skipped: 0, Time elapsed: 1.03 sec
Running org.apache.james.mailbox.torque.imap.SearchTest
Tests run: 6, Failures: 0, Errors: 0, Skipped: 0, Time elapsed: 10.998 sec
Running org.apache.james.mailbox.jpa.imap.FetchBodySectionTest
Tests run: 9, Failures: 0, Errors: 0, Skipped: 0, Time elapsed: 4.289 sec
Running org.apache.james.mailbox.jpa.imap.FetchTest
Tests run: 24, Failures: 0, Errors: 0, Skipped: 0, Time elapsed: 5.842 sec
Running org.apache.james.mailbox.maildir.imap.UidSearchTest
Tests run: 6, Failures: 0, Errors: 0, Skipped: 0, Time elapsed: 3.256 sec
Running org.apache.james.mailbox.torque.imap.UidSearchTest
Tests run: 6, Failures: 0, Errors: 0, Skipped: 0, Time elapsed: 13.054 sec
Running org.apache.james.mailbox.jcr.imap.ExpungeTest
Tests run: 3, Failures: 0, Errors: 3, Skipped: 0, Time elapsed: 0.832 sec <<< FAILURE!
Running org.apache.james.mailbox.jcr.imap.PartialFetchTest
Tests run: 12, Failures: 0, Errors: 12, Skipped: 0, Time elapsed: 1.364 sec <<< FAILURE!
Running org.apache.james.mailbox.jcr.imap.SelectTest
Tests run: 3, Failures: 0, Errors: 3, Skipped: 0, Time elapsed: 0.778 sec <<< FAILURE!
Running org.apache.james.mailbox.jpa.imap.EventTest
Tests run: 3, Failures: 0, Errors: 0, Skipped: 0, Time elapsed: 2.88 sec
Running org.apache.james.mailbox.jcr.imap.RenameTest
Tests run: 9, Failures: 0, Errors: 9, Skipped: 0, Time elapsed: 1.246 sec <<< FAILURE!
Running org.apache.james.mailbox.jcr.imap.ConcurrentSessionsTest
Tests run: 21, Failures: 0, Errors: 21, Skipped: 0, Time elapsed: 1.667 sec <<< FAILURE!
Running org.apache.james.mailbox.inmemory.imap.AuthenticatedStateTest
Tests run: 57, Failures: 0, Errors: 0, Skipped: 0, Time elapsed: 0.867 sec

Results :

Tests in error: 

Tests run: 1529, Failures: 0, Errors: 291, Skipped: 0

[HUDSON] Recording test results
[HUDSON] Archiving <https://hudson.apache.org/hudson/job/mailbox-integration-tests/org.apache.james$apache-james-mailbox-integration-tester/ws/pom.xml>
to /home/hudson/hudson/jobs/mailbox-integration-tests/modules/org.apache.james$apache-james-mailbox-integration-tester/builds/2011-02-15_20-36-59/archive/org.apache.james/apache-james-mailbox-integration-tester/0.2-M2-SNAPSHOT/pom.xml
[INFO] ------------------------------------------------------------------------
[ERROR] BUILD FAILURE
[INFO] ------------------------------------------------------------------------
[INFO] There are test failures.

Please refer to <https://hudson.apache.org/hudson/job/mailbox-integration-tests/org.apache.james$apache-james-mailbox-integration-tester/ws/target/surefire-reports>
for the individual test results.
[INFO] ------------------------------------------------------------------------
[INFO] For more information, run Maven with the -e switch
[INFO] ------------------------------------------------------------------------
[INFO] Total time: 6 minutes 7 seconds
[INFO] Finished at: Tue Feb 15 12:43:33 GMT-08:00 2011
[INFO] Final Memory: 36M/203M
[INFO] ------------------------------------------------------------------------
Maven failed with error.


---------------------------------------------------------------------
To unsubscribe, e-mail: server-dev-unsubscribe@james.apache.org
For additional commands, e-mail: server-dev-help@james.apache.org


Mime
View raw message