james-server-dev mailing list archives

Site index · List index
Message view « Date » · « Thread »
Top « Date » · « Thread »
From Apache Hudson Server <hud...@hudson.apache.org>
Subject Build failed in Hudson: mailbox-integration-tests » Apache James Mailbox Integration Tester #110
Date Thu, 17 Feb 2011 06:49:03 GMT
See <https://hudson.apache.org/hudson/job/mailbox-integration-tests/org.apache.james$apache-james-mailbox-integration-tester/110/>

------------------------------------------
[...truncated 32 lines...]
[INFO] snapshot org.apache.james:apache-james-mailbox-jpa:0.2-M2-SNAPSHOT: checking for updates
from maven2-repository.dev.java.net
[INFO] snapshot org.apache.james:apache-james-mailbox-jpa:0.2-M2-SNAPSHOT: checking for updates
from apache.snapshots
[INFO] snapshot org.apache.james:apache-james-mailbox-maildir:0.2-M2-SNAPSHOT: checking for
updates from maven2-repository.dev.java.net
[INFO] snapshot org.apache.james:apache-james-mailbox-maildir:0.2-M2-SNAPSHOT: checking for
updates from apache.snapshots
[INFO] snapshot org.apache.james:apache-james-mailbox-memory:0.2-M2-SNAPSHOT: checking for
updates from maven2-repository.dev.java.net
[INFO] snapshot org.apache.james:apache-james-mailbox-memory:0.2-M2-SNAPSHOT: checking for
updates from apache.snapshots
[INFO] snapshot org.apache.james:apache-james-mailbox-torque:0.2-M2-SNAPSHOT: checking for
updates from maven2-repository.dev.java.net
[INFO] snapshot org.apache.james:apache-james-mailbox-torque:0.2-M2-SNAPSHOT: checking for
updates from apache.snapshots
Downloading: http://repository.apache.org/snapshots/org/apache/james/apache-james-mailbox-torque/0.2-M2-SNAPSHOT/apache-james-mailbox-torque-0.2-M2-20110217.040413-121.pom
3K downloaded  (apache-james-mailbox-torque-0.2-M2-20110217.040413-121.pom)
Downloading: http://repository.apache.org/snapshots/org/apache/james/apache-james-mailbox-torque/0.2-M2-SNAPSHOT/apache-james-mailbox-torque-0.2-M2-20110217.040413-121.jar
131K downloaded  (apache-james-mailbox-torque-0.2-M2-20110217.040413-121.jar)
[INFO] [resources:resources {execution: default-resources}]
[INFO] Using 'UTF-8' encoding to copy filtered resources.
[INFO] Copying 113 resources
[INFO] Copying 3 resources
[INFO] [compiler:compile {execution: default-compile}]
[INFO] Compiling 39 source files to <https://hudson.apache.org/hudson/job/mailbox-integration-tests/org.apache.james$apache-james-mailbox-integration-tester/ws/target/classes>
[INFO] [bundle:manifest {execution: bundle-manifest}]
[WARNING] Embed-Dependency: clause "*;scope=runtime" did not match any dependencies
[INFO] [resources:testResources {execution: default-testResources}]
[INFO] Using 'UTF-8' encoding to copy filtered resources.
[INFO] Copying 4 resources
[INFO] Copying 3 resources
[INFO] [compiler:testCompile {execution: default-testCompile}]
[INFO] Compiling 105 source files to <https://hudson.apache.org/hudson/job/mailbox-integration-tests/org.apache.james$apache-james-mailbox-integration-tester/ws/target/test-classes>
[INFO] [surefire:test {execution: default-test}]
[INFO] Surefire report directory: <https://hudson.apache.org/hudson/job/mailbox-integration-tests/org.apache.james$apache-james-mailbox-integration-tester/ws/target/surefire-reports>

-------------------------------------------------------
 T E S T S
-------------------------------------------------------
Running org.apache.james.mailbox.torque.PartContentBuilderMultipartAlternativeTest
Tests run: 3, Failures: 0, Errors: 0, Skipped: 0, Time elapsed: 0.327 sec
Running org.apache.james.mailbox.inmemory.imap.FetchBodySectionTest
Tests run: 9, Failures: 0, Errors: 0, Skipped: 0, Time elapsed: 0.817 sec
Running org.apache.james.mailbox.inmemory.imap.FetchTest
Tests run: 24, Failures: 0, Errors: 0, Skipped: 0, Time elapsed: 1.082 sec
Running org.apache.james.mailbox.torque.MessageUtilsCountUnnormalLinesTest
Tests run: 5, Failures: 0, Errors: 0, Skipped: 0, Time elapsed: 0.025 sec
Running org.apache.james.mailbox.torque.imap.ConcurrentSessionsTest
Tests run: 21, Failures: 0, Errors: 0, Skipped: 0, Time elapsed: 5.757 sec
Running org.apache.james.mailbox.inmemory.imap.SelectedStateTest
Tests run: 30, Failures: 0, Errors: 0, Skipped: 0, Time elapsed: 0.94 sec
Running org.apache.james.mailbox.torque.imap.FetchBodyStructureTest
Tests run: 12, Failures: 0, Errors: 0, Skipped: 0, Time elapsed: 8.134 sec
Running org.apache.james.mailbox.inmemory.imap.SelectTest
Tests run: 3, Failures: 0, Errors: 0, Skipped: 0, Time elapsed: 0.547 sec
Running org.apache.james.mailbox.jpa.imap.FetchBodyStructureTest
Tests run: 12, Failures: 0, Errors: 0, Skipped: 0, Time elapsed: 7.455 sec
Running org.apache.james.mailbox.jcr.imap.SelectedInboxTest
Tests run: 42, Failures: 0, Errors: 42, Skipped: 0, Time elapsed: 2.698 sec <<< FAILURE!
Running org.apache.james.mailbox.torque.MessageRowUtilsTest
Tests run: 3, Failures: 0, Errors: 0, Skipped: 0, Time elapsed: 0.118 sec
Running org.apache.james.mailbox.jpa.imap.SecurityTest
Tests run: 21, Failures: 0, Errors: 0, Skipped: 0, Time elapsed: 1.837 sec
Running org.apache.james.mailbox.inmemory.imap.ConcurrentSessionsTest
Tests run: 21, Failures: 0, Errors: 0, Skipped: 0, Time elapsed: 0.77 sec
Running org.apache.james.mailbox.torque.imap.EventTest
Tests run: 3, Failures: 0, Errors: 0, Skipped: 0, Time elapsed: 3.145 sec
Running org.apache.james.mailbox.jpa.imap.ConcurrentSessionsTest
Tests run: 21, Failures: 0, Errors: 0, Skipped: 0, Time elapsed: 4.319 sec
Running org.apache.james.mailbox.maildir.imap.PartialFetchTest
Tests run: 12, Failures: 0, Errors: 0, Skipped: 0, Time elapsed: 1.286 sec
Running org.apache.james.mailbox.inmemory.imap.SecurityTest
Tests run: 21, Failures: 0, Errors: 0, Skipped: 0, Time elapsed: 0.274 sec
Running org.apache.james.mailbox.jcr.imap.SearchTest
Tests run: 6, Failures: 0, Errors: 6, Skipped: 0, Time elapsed: 0.944 sec <<< FAILURE!
Running org.apache.james.mailbox.inmemory.imap.EventTest
Tests run: 3, Failures: 0, Errors: 0, Skipped: 0, Time elapsed: 0.533 sec
Running org.apache.james.mailbox.torque.imap.FetchTest
Tests run: 24, Failures: 0, Errors: 0, Skipped: 0, Time elapsed: 6.895 sec
Running org.apache.james.mailbox.jcr.imap.FetchBodySectionTest
Tests run: 9, Failures: 0, Errors: 9, Skipped: 0, Time elapsed: 1.236 sec <<< FAILURE!
Running org.apache.james.mailbox.torque.SearchUtilsRFC822Test
Tests run: 6, Failures: 0, Errors: 0, Skipped: 0, Time elapsed: 0.373 sec
Running org.apache.james.mailbox.torque.imap.AuthenticatedStateTest
Tests run: 57, Failures: 0, Errors: 0, Skipped: 0, Time elapsed: 7.161 sec
Running org.apache.james.mailbox.maildir.imap.ConcurrentSessionsTest
Tests run: 21, Failures: 0, Errors: 0, Skipped: 0, Time elapsed: 1.057 sec
Running org.apache.james.mailbox.maildir.imap.FetchHeadersTest
Tests run: 6, Failures: 0, Errors: 0, Skipped: 0, Time elapsed: 1.019 sec
Running org.apache.james.mailbox.maildir.imap.SelectedInboxTest
Tests run: 42, Failures: 0, Errors: 0, Skipped: 0, Time elapsed: 1.203 sec
Running org.apache.james.mailbox.inmemory.imap.SelectedInboxTest
Tests run: 42, Failures: 0, Errors: 0, Skipped: 0, Time elapsed: 0.842 sec
Running org.apache.james.mailbox.maildir.imap.NonAuthenticatedStateTest
Tests run: 21, Failures: 0, Errors: 0, Skipped: 0, Time elapsed: 0.34 sec
Running org.apache.james.mailbox.maildir.imap.SelectedStateTest
Tests run: 30, Failures: 0, Errors: 0, Skipped: 0, Time elapsed: 1.503 sec
Running org.apache.james.mailbox.jpa.imap.SearchTest
Tests run: 6, Failures: 0, Errors: 0, Skipped: 0, Time elapsed: 11.411 sec
Running org.apache.james.mailbox.jpa.imap.ExpungeTest
Tests run: 3, Failures: 0, Errors: 0, Skipped: 0, Time elapsed: 3.643 sec
Running org.apache.james.mailbox.torque.imap.NonAuthenticatedStateTest
Tests run: 21, Failures: 0, Errors: 0, Skipped: 0, Time elapsed: 1.926 sec
Running org.apache.james.mailbox.jpa.imap.SelectedStateTest
Tests run: 30, Failures: 0, Errors: 0, Skipped: 0, Time elapsed: 6.117 sec
Running org.apache.james.mailbox.torque.imap.FetchHeadersTest
Tests run: 6, Failures: 0, Errors: 0, Skipped: 0, Time elapsed: 4.674 sec
Running org.apache.james.mailbox.jcr.imap.EventTest
Tests run: 3, Failures: 0, Errors: 3, Skipped: 0, Time elapsed: 0.818 sec <<< FAILURE!
Running org.apache.james.mailbox.jcr.imap.FetchTest
Tests run: 24, Failures: 0, Errors: 24, Skipped: 0, Time elapsed: 1.862 sec <<< FAILURE!
Running org.apache.james.mailbox.maildir.imap.AuthenticatedStateTest
Tests run: 57, Failures: 0, Errors: 0, Skipped: 0, Time elapsed: 1.257 sec
Running org.apache.james.mailbox.torque.SearchUtilsMultipartMixedTest
Tests run: 7, Failures: 0, Errors: 0, Skipped: 0, Time elapsed: 0.459 sec
Running org.apache.james.mailbox.torque.imap.PartialFetchTest
Tests run: 12, Failures: 0, Errors: 0, Skipped: 0, Time elapsed: 5.807 sec
Running org.apache.james.mailbox.jcr.imap.FetchHeadersTest
Tests run: 6, Failures: 0, Errors: 6, Skipped: 0, Time elapsed: 1.038 sec <<< FAILURE!
Running org.apache.james.mailbox.torque.imap.SecurityTest
Tests run: 21, Failures: 0, Errors: 0, Skipped: 0, Time elapsed: 1.804 sec
Running org.apache.james.mailbox.torque.imap.ListingTest
Tests run: 6, Failures: 0, Errors: 0, Skipped: 0, Time elapsed: 2.579 sec
Running org.apache.james.mailbox.maildir.imap.EventTest
Tests run: 3, Failures: 0, Errors: 0, Skipped: 0, Time elapsed: 0.686 sec
Running org.apache.james.mailbox.inmemory.imap.ExpungeTest
Tests run: 3, Failures: 0, Errors: 0, Skipped: 0, Time elapsed: 0.67 sec
Running org.apache.james.mailbox.torque.imap.SelectedStateTest
Tests run: 30, Failures: 0, Errors: 0, Skipped: 0, Time elapsed: 7.47 sec
Running org.apache.james.mailbox.torque.imap.SelectedInboxTest
Tests run: 42, Failures: 0, Errors: 0, Skipped: 0, Time elapsed: 7.07 sec
Running org.apache.james.mailbox.jpa.imap.RenameTest
Tests run: 9, Failures: 0, Errors: 0, Skipped: 0, Time elapsed: 6.692 sec
Running org.apache.james.mailbox.torque.imap.FetchBodySectionTest
Tests run: 9, Failures: 0, Errors: 0, Skipped: 0, Time elapsed: 5.012 sec
Running org.apache.james.mailbox.jpa.imap.FetchHeadersTest
Tests run: 6, Failures: 0, Errors: 0, Skipped: 0, Time elapsed: 4.375 sec
Running org.apache.james.mailbox.torque.SearchUtilsTest
Tests run: 40, Failures: 0, Errors: 0, Skipped: 0, Time elapsed: 0.218 sec
Running org.apache.james.mailbox.jpa.imap.UidSearchTest
Tests run: 6, Failures: 0, Errors: 0, Skipped: 0, Time elapsed: 12.304 sec
Running org.apache.james.mailbox.jpa.imap.AuthenticatedStateTest
Tests run: 57, Failures: 0, Errors: 0, Skipped: 0, Time elapsed: 4.874 sec
Running org.apache.james.mailbox.jpa.imap.SelectedInboxTest
Tests run: 42, Failures: 0, Errors: 0, Skipped: 0, Time elapsed: 4.342 sec
Running org.apache.james.mailbox.torque.imap.ExpungeTest
Tests run: 3, Failures: 0, Errors: 0, Skipped: 0, Time elapsed: 3.754 sec
Running org.apache.james.mailbox.maildir.imap.FetchTest
Tests run: 24, Failures: 0, Errors: 0, Skipped: 0, Time elapsed: 1.403 sec
Running org.apache.james.mailbox.torque.MessageUtilsNormalisedWriteToTest
Tests run: 8, Failures: 0, Errors: 0, Skipped: 0, Time elapsed: 0.029 sec
Running org.apache.james.mailbox.torque.imap.SelectTest
Tests run: 3, Failures: 0, Errors: 0, Skipped: 0, Time elapsed: 2.966 sec
Running org.apache.james.mailbox.maildir.imap.ListingTest
Tests run: 6, Failures: 0, Errors: 0, Skipped: 0, Time elapsed: 0.492 sec
Running org.apache.james.mailbox.jcr.imap.SelectedStateTest
Tests run: 30, Failures: 0, Errors: 30, Skipped: 0, Time elapsed: 2.109 sec <<< FAILURE!
Running org.apache.james.mailbox.maildir.imap.RenameTest
Tests run: 9, Failures: 0, Errors: 0, Skipped: 0, Time elapsed: 1.679 sec
Running org.apache.james.mailbox.inmemory.imap.RenameTest
Tests run: 9, Failures: 0, Errors: 0, Skipped: 0, Time elapsed: 1.036 sec
Running org.apache.james.mailbox.jcr.imap.NonAuthenticatedStateTest
Tests run: 21, Failures: 0, Errors: 21, Skipped: 0, Time elapsed: 1.812 sec <<< FAILURE!
Running org.apache.james.mailbox.maildir.imap.ExpungeTest
Tests run: 3, Failures: 0, Errors: 0, Skipped: 0, Time elapsed: 0.794 sec
Running org.apache.james.mailbox.jcr.imap.AuthenticatedStateTest
Tests run: 57, Failures: 0, Errors: 57, Skipped: 0, Time elapsed: 2.932 sec <<< FAILURE!
Running org.apache.james.mailbox.jcr.imap.ListingTest
Tests run: 6, Failures: 0, Errors: 6, Skipped: 0, Time elapsed: 0.924 sec <<< FAILURE!
Running org.apache.james.mailbox.inmemory.imap.ListingTest
Tests run: 6, Failures: 0, Errors: 0, Skipped: 0, Time elapsed: 0.319 sec
Running org.apache.james.mailbox.jpa.imap.SelectTest
Tests run: 3, Failures: 0, Errors: 0, Skipped: 0, Time elapsed: 2.527 sec
Running org.apache.james.mailbox.inmemory.imap.UidSearchTest
Tests run: 6, Failures: 0, Errors: 0, Skipped: 0, Time elapsed: 1.864 sec
Running org.apache.james.mailbox.jcr.imap.UidSearchTest
Tests run: 6, Failures: 0, Errors: 6, Skipped: 0, Time elapsed: 1.063 sec <<< FAILURE!
Running org.apache.james.mailbox.torque.imap.RenameTest
Tests run: 9, Failures: 0, Errors: 0, Skipped: 0, Time elapsed: 8.582 sec
Running org.apache.james.mailbox.inmemory.imap.PartialFetchTest
Tests run: 12, Failures: 0, Errors: 0, Skipped: 0, Time elapsed: 0.86 sec
Running org.apache.james.mailbox.jpa.imap.PartialFetchTest
Tests run: 12, Failures: 0, Errors: 0, Skipped: 0, Time elapsed: 5.217 sec
Running org.apache.james.mailbox.jcr.imap.SecurityTest
Tests run: 21, Failures: 0, Errors: 21, Skipped: 0, Time elapsed: 1.676 sec <<< FAILURE!
Running org.apache.james.mailbox.jcr.imap.FetchBodyStructureTest
Tests run: 12, Failures: 0, Errors: 12, Skipped: 0, Time elapsed: 1.228 sec <<< FAILURE!
Running org.apache.james.mailbox.jpa.imap.ListingTest
Tests run: 6, Failures: 0, Errors: 0, Skipped: 0, Time elapsed: 2.5 sec
Running org.apache.james.mailbox.inmemory.imap.SearchTest
Tests run: 6, Failures: 0, Errors: 0, Skipped: 0, Time elapsed: 1.833 sec
Running org.apache.james.mailbox.maildir.imap.SelectTest
Tests run: 3, Failures: 0, Errors: 0, Skipped: 0, Time elapsed: 0.617 sec
Running org.apache.james.mailbox.maildir.imap.FetchBodyStructureTest
Tests run: 12, Failures: 0, Errors: 0, Skipped: 0, Time elapsed: 2.061 sec
Running org.apache.james.mailbox.inmemory.imap.FetchBodyStructureTest
Tests run: 12, Failures: 0, Errors: 0, Skipped: 0, Time elapsed: 1.359 sec
Running org.apache.james.mailbox.inmemory.imap.NonAuthenticatedStateTest
Tests run: 21, Failures: 0, Errors: 0, Skipped: 0, Time elapsed: 0.331 sec
Running org.apache.james.mailbox.torque.PartContentBuilderComplexMultipartTest
Tests run: 8, Failures: 0, Errors: 0, Skipped: 0, Time elapsed: 0.349 sec
Running org.apache.james.mailbox.inmemory.imap.FetchHeadersTest
Tests run: 6, Failures: 0, Errors: 0, Skipped: 0, Time elapsed: 0.753 sec
Running org.apache.james.mailbox.maildir.imap.SecurityTest
Tests run: 21, Failures: 0, Errors: 0, Skipped: 0, Time elapsed: 0.276 sec
Running org.apache.james.mailbox.jpa.imap.NonAuthenticatedStateTest
Tests run: 21, Failures: 0, Errors: 0, Skipped: 0, Time elapsed: 1.998 sec
Running org.apache.james.mailbox.maildir.imap.FetchBodySectionTest
Tests run: 9, Failures: 0, Errors: 0, Skipped: 0, Time elapsed: 1.041 sec
Running org.apache.james.mailbox.torque.imap.SearchTest
Tests run: 6, Failures: 0, Errors: 0, Skipped: 0, Time elapsed: 11.506 sec
Running org.apache.james.mailbox.jpa.imap.FetchBodySectionTest
Tests run: 9, Failures: 0, Errors: 0, Skipped: 0, Time elapsed: 4.153 sec
Running org.apache.james.mailbox.jpa.imap.FetchTest
Tests run: 24, Failures: 0, Errors: 0, Skipped: 0, Time elapsed: 6.287 sec
Running org.apache.james.mailbox.maildir.imap.UidSearchTest
Tests run: 6, Failures: 0, Errors: 0, Skipped: 0, Time elapsed: 3.268 sec
Running org.apache.james.mailbox.torque.imap.UidSearchTest
Tests run: 6, Failures: 0, Errors: 0, Skipped: 0, Time elapsed: 13.754 sec
Running org.apache.james.mailbox.jcr.imap.ExpungeTest
Tests run: 3, Failures: 0, Errors: 3, Skipped: 0, Time elapsed: 0.758 sec <<< FAILURE!
Running org.apache.james.mailbox.jcr.imap.PartialFetchTest
Tests run: 12, Failures: 0, Errors: 12, Skipped: 0, Time elapsed: 1.282 sec <<< FAILURE!
Running org.apache.james.mailbox.jcr.imap.SelectTest
Tests run: 3, Failures: 0, Errors: 3, Skipped: 0, Time elapsed: 0.753 sec <<< FAILURE!
Running org.apache.james.mailbox.jpa.imap.EventTest
Tests run: 3, Failures: 0, Errors: 0, Skipped: 0, Time elapsed: 2.844 sec
Running org.apache.james.mailbox.jcr.imap.RenameTest
Tests run: 9, Failures: 0, Errors: 9, Skipped: 0, Time elapsed: 1.119 sec <<< FAILURE!
Running org.apache.james.mailbox.jcr.imap.ConcurrentSessionsTest
Tests run: 21, Failures: 0, Errors: 21, Skipped: 0, Time elapsed: 1.666 sec <<< FAILURE!
Running org.apache.james.mailbox.inmemory.imap.AuthenticatedStateTest
Tests run: 57, Failures: 0, Errors: 0, Skipped: 0, Time elapsed: 0.802 sec

Results :

Tests in error: 

Tests run: 1529, Failures: 0, Errors: 291, Skipped: 0

[HUDSON] Recording test results
[HUDSON] Archiving <https://hudson.apache.org/hudson/job/mailbox-integration-tests/org.apache.james$apache-james-mailbox-integration-tester/ws/pom.xml>
to /home/hudson/hudson/jobs/mailbox-integration-tests/modules/org.apache.james$apache-james-mailbox-integration-tester/builds/2011-02-17_06-42-30/archive/org.apache.james/apache-james-mailbox-integration-tester/0.2-M2-SNAPSHOT/pom.xml
[INFO] ------------------------------------------------------------------------
[ERROR] BUILD FAILURE
[INFO] ------------------------------------------------------------------------
[INFO] There are test failures.

Please refer to <https://hudson.apache.org/hudson/job/mailbox-integration-tests/org.apache.james$apache-james-mailbox-integration-tester/ws/target/surefire-reports>
for the individual test results.
[INFO] ------------------------------------------------------------------------
[INFO] For more information, run Maven with the -e switch
[INFO] ------------------------------------------------------------------------
[INFO] Total time: 6 minutes 3 seconds
[INFO] Finished at: Wed Feb 16 22:49:01 GMT-08:00 2011
[INFO] Final Memory: 36M/203M
[INFO] ------------------------------------------------------------------------
Maven failed with error.


---------------------------------------------------------------------
To unsubscribe, e-mail: server-dev-unsubscribe@james.apache.org
For additional commands, e-mail: server-dev-help@james.apache.org


Mime
View raw message