james-server-dev mailing list archives

Site index · List index
Message view « Date » · « Thread »
Top « Date » · « Thread »
From Apache Hudson Server <hud...@hudson.apache.org>
Subject Build failed in Hudson: hupa-trunk #179
Date Mon, 28 Feb 2011 07:21:11 GMT
See <https://hudson.apache.org/hudson/job/hupa-trunk/179/>

------------------------------------------
[...truncated 765 lines...]
Tests run: 11, Failures: 0, Errors: 0, Skipped: 0, Time elapsed: 1.538 sec
Running org.apache.hupa.server.handler.IdleHandlerTest
Tests run: 1, Failures: 0, Errors: 0, Skipped: 0, Time elapsed: 0.025 sec
Running org.apache.hupa.server.handler.AbtractSendMessageHandlerTest
Tests run: 5, Failures: 0, Errors: 0, Skipped: 0, Time elapsed: 0.14 sec
Running org.apache.hupa.server.handler.CreateFolderHandlerTest
Tests run: 3, Failures: 0, Errors: 0, Skipped: 0, Time elapsed: 0.08 sec
Running org.apache.hupa.server.handler.DeleteMessageByUidHandlerTest
Tests run: 3, Failures: 0, Errors: 0, Skipped: 0, Time elapsed: 0.068 sec
Running org.apache.hupa.server.handler.ContactsHandlerTest
Tests run: 1, Failures: 0, Errors: 0, Skipped: 0, Time elapsed: 0.023 sec
Running org.apache.hupa.server.handler.LoginUserHandlerTest
Tests run: 2, Failures: 0, Errors: 0, Skipped: 0, Time elapsed: 0.048 sec
Running org.apache.hupa.server.handler.DeleteFolderHandlerTest
Tests run: 3, Failures: 0, Errors: 0, Skipped: 0, Time elapsed: 0.068 sec
Running org.apache.hupa.server.handler.FetchFoldersHandlerTest
Tests run: 3, Failures: 0, Errors: 0, Skipped: 0, Time elapsed: 0.073 sec
Running org.apache.hupa.server.handler.FowardMessageHandlerTest
Tests run: 1, Failures: 0, Errors: 0, Skipped: 0, Time elapsed: 0.031 sec
Running org.apache.hupa.server.handler.ReplyMessageHandlerTest
Tests run: 1, Failures: 0, Errors: 0, Skipped: 0, Time elapsed: 0.029 sec
Running org.apache.hupa.server.handler.LogoutUserHandlerTest
Tests run: 1, Failures: 0, Errors: 0, Skipped: 0, Time elapsed: 0.025 sec
Running org.apache.hupa.server.handler.HandlersTest
Tests run: 2, Failures: 0, Errors: 0, Skipped: 0, Time elapsed: 0.069 sec
Running org.apache.hupa.server.handler.FetchMessagesHandlerTest
Tests run: 2, Failures: 0, Errors: 0, Skipped: 0, Time elapsed: 0.055 sec
Running org.apache.hupa.server.preferences.InSessionUserPreferencesStorageTest
Tests run: 2, Failures: 0, Errors: 0, Skipped: 0, Time elapsed: 0.076 sec
Running org.apache.hupa.server.preferences.InImapUserPreferencesStorageTest
Tests run: 3, Failures: 0, Errors: 0, Skipped: 0, Time elapsed: 1.887 sec
Running org.apache.hupa.server.guice.ServerModulTest
Tests run: 3, Failures: 0, Errors: 0, Skipped: 0, Time elapsed: 0.013 sec

Results :

Tests run: 65, Failures: 0, Errors: 0, Skipped: 2

[HUDSON] Recording test results
[INFO] 
[INFO] --- maven-jar-plugin:2.3.1:jar (default-jar) @ hupa-server ---
[INFO] Building jar: <https://hudson.apache.org/hudson/job/hupa-trunk/ws/trunk/server/target/hupa-server-0.0.1-SNAPSHOT.jar>
mojo forkStarted org.codehaus.mojo:emma-maven-plugin:1.0-alpha-3(default-cli)
forkedProjectStarted org.apache.hupa:hupa-server0.0.1-SNAPSHOT
[INFO] 
[INFO] --- maven-remote-resources-plugin:1.1:process (default) @ hupa-server ---
[INFO] [INFO] Using 'UTF-8' encoding to copy filtered resources.
[INFO] Copying 8 resources
[INFO] Copying 3 resources
[INFO] Copying 3 resources

[INFO] --- maven-resources-plugin:2.4:resources (default-resources) @ hupa-server ---
[INFO] 
[INFO] --- maven-compiler-plugin:2.3.2:compile (default-compile) @ hupa-server ---
[INFO] Nothing to compile - all classes are up to date
[INFO] [INFO] Instrumenting classes with EMMA
processing instrumentation path ...

[INFO] --- emma-maven-plugin:1.0-alpha-3:instrument (default-cli) @ hupa-server ---
instrumentation path processed in 109 ms
[69 class(es) instrumented, 12 resource(s) copied]
metadata merged into [<https://hudson.apache.org/hudson/job/hupa-trunk/ws/trunk/server/target/coverage.em]>
{in 7 ms}
[INFO] [INFO] Using 'UTF-8' encoding to copy filtered resources.
[INFO] skip non existing resourceDirectory <https://hudson.apache.org/hudson/job/hupa-trunk/ws/trunk/server/src/test/resources>
[INFO] Copying 3 resources
[INFO] Copying 3 resources

[INFO] --- maven-resources-plugin:2.4:testResources (default-testResources) @ hupa-server
---
[INFO] [INFO] Nothing to compile - all classes are up to date

[INFO] --- maven-compiler-plugin:2.3.2:testCompile (default-testCompile) @ hupa-server ---
[INFO] [INFO] Surefire report directory: <https://hudson.apache.org/hudson/job/hupa-trunk/ws/trunk/server/target/surefire-reports>

[INFO] --- maven-surefire-plugin:2.7.2:test (default-test) @ hupa-server ---

-------------------------------------------------------
 T E S T S
-------------------------------------------------------
Running org.apache.hupa.server.mock.MockImapFolderTest
EMMA: collecting runtime coverage data ...
EMMA: runtime controller started on port [47653]
Tests run: 2, Failures: 0, Errors: 0, Skipped: 0, Time elapsed: 0.636 sec
Running org.apache.hupa.server.integration.StoreBugTest
Tests run: 3, Failures: 0, Errors: 0, Skipped: 2, Time elapsed: 0.131 sec
Running org.apache.hupa.server.servlet.DownloadAttachmentServletTest
Tests run: 2, Failures: 0, Errors: 0, Skipped: 0, Time elapsed: 0.123 sec
Running org.apache.hupa.server.utils.RegexPatternsTest
Tests run: 8, Failures: 0, Errors: 0, Skipped: 0, Time elapsed: 0.011 sec
Running org.apache.hupa.server.utils.TestUtils
Tests run: 1, Failures: 0, Errors: 0, Skipped: 0, Time elapsed: 0.015 sec
Running org.apache.hupa.server.utils.MessageUtilsTest
Tests run: 2, Failures: 0, Errors: 0, Skipped: 0, Time elapsed: 0.084 sec
Running org.apache.hupa.server.handler.GetMessageDetailsHandlerTest
Tests run: 11, Failures: 0, Errors: 0, Skipped: 0, Time elapsed: 1.503 sec
Running org.apache.hupa.server.handler.IdleHandlerTest
Tests run: 1, Failures: 0, Errors: 0, Skipped: 0, Time elapsed: 0.028 sec
Running org.apache.hupa.server.handler.AbtractSendMessageHandlerTest
Tests run: 5, Failures: 0, Errors: 0, Skipped: 0, Time elapsed: 0.155 sec
Running org.apache.hupa.server.handler.CreateFolderHandlerTest
Tests run: 3, Failures: 0, Errors: 0, Skipped: 0, Time elapsed: 0.071 sec
Running org.apache.hupa.server.handler.DeleteMessageByUidHandlerTest
Tests run: 3, Failures: 0, Errors: 0, Skipped: 0, Time elapsed: 0.082 sec
Running org.apache.hupa.server.handler.ContactsHandlerTest
Tests run: 1, Failures: 0, Errors: 0, Skipped: 0, Time elapsed: 0.024 sec
Running org.apache.hupa.server.handler.LoginUserHandlerTest
Tests run: 2, Failures: 0, Errors: 0, Skipped: 0, Time elapsed: 0.05 sec
Running org.apache.hupa.server.handler.DeleteFolderHandlerTest
Tests run: 3, Failures: 0, Errors: 0, Skipped: 0, Time elapsed: 0.067 sec
Running org.apache.hupa.server.handler.FetchFoldersHandlerTest
Tests run: 3, Failures: 0, Errors: 0, Skipped: 0, Time elapsed: 0.069 sec
Running org.apache.hupa.server.handler.FowardMessageHandlerTest
Tests run: 1, Failures: 0, Errors: 0, Skipped: 0, Time elapsed: 0.03 sec
Running org.apache.hupa.server.handler.ReplyMessageHandlerTest
Tests run: 1, Failures: 0, Errors: 0, Skipped: 0, Time elapsed: 0.03 sec
Running org.apache.hupa.server.handler.LogoutUserHandlerTest
Tests run: 1, Failures: 0, Errors: 0, Skipped: 0, Time elapsed: 0.025 sec
Running org.apache.hupa.server.handler.HandlersTest
Tests run: 2, Failures: 0, Errors: 0, Skipped: 0, Time elapsed: 0.049 sec
Running org.apache.hupa.server.handler.FetchMessagesHandlerTest
Tests run: 2, Failures: 0, Errors: 0, Skipped: 0, Time elapsed: 0.062 sec
Running org.apache.hupa.server.preferences.InSessionUserPreferencesStorageTest
Tests run: 2, Failures: 0, Errors: 0, Skipped: 0, Time elapsed: 0.086 sec
Running org.apache.hupa.server.preferences.InImapUserPreferencesStorageTest
Tests run: 3, Failures: 0, Errors: 0, Skipped: 0, Time elapsed: 1.887 sec
Running org.apache.hupa.server.guice.ServerModulTest
Tests run: 3, Failures: 0, Errors: 0, Skipped: 0, Time elapsed: 0.012 sec

Results :

Tests run: 65, Failures: 0, Errors: 0, Skipped: 2

EMMA: locking coverage output file [<https://hudson.apache.org/hudson/job/hupa-trunk/ws/trunk/server/coverage.ec]>
...
EMMA: runtime coverage data merged into [<https://hudson.apache.org/hudson/job/hupa-trunk/ws/trunk/server/coverage.ec]>
{in 31 ms}
[HUDSON] Recording test results
forkedProjectSucceeded org.apache.hupa:hupa-server0.0.1-SNAPSHOT
[HUDSON] Archiving <https://hudson.apache.org/hudson/job/hupa-trunk/ws/trunk/server/pom.xml>
to /home/hudson/hudson/jobs/hupa-trunk/modules/org.apache.hupa$hupa-server/builds/2011-02-28_07-19-26/archive/org.apache.hupa/hupa-server/0.0.1-SNAPSHOT/pom.xml
mojo forkSucceeded org.codehaus.mojo:emma-maven-plugin:1.0-alpha-3(default-cli)
[INFO] processing input files ...
2 file(s) read and merged in 7 ms
writing [xml] report to [<https://hudson.apache.org/hudson/job/hupa-trunk/ws/trunk/server/target/site/emma/coverage.xml]>
...

[INFO] --- emma-maven-plugin:1.0-alpha-3:emma (default-cli) @ hupa-server ---
writing [html] report to [<https://hudson.apache.org/hudson/job/hupa-trunk/ws/trunk/server/target/site/emma/index.html]>
...
projectSucceeded org.apache.hupa:hupa-server:0.0.1-SNAPSHOT
[HUDSON] Archiving <https://hudson.apache.org/hudson/job/hupa-trunk/ws/trunk/server/target/hupa-server-0.0.1-SNAPSHOT.jar>
to /home/hudson/hudson/jobs/hupa-trunk/modules/org.apache.hupa$hupa-server/builds/2011-02-28_07-19-26/archive/org.apache.hupa/hupa-server/0.0.1-SNAPSHOT/hupa-server-0.0.1-SNAPSHOT.jar
[INFO] Downloading: http://download.java.net/maven/2/com/google/gwt/gwt-incubator/20100204-r1747/gwt-incubator-20100204-r1747.pom
                                                                        
[INFO] ------------------------------------------------------------------------
[INFO] Building hupa-widgets 0.0.1-SNAPSHOT
[INFO] ------------------------------------------------------------------------
Downloading: http://gwtupload.googlecode.com/svn/mavenrepo/com/google/gwt/gwt-incubator/20100204-r1747/gwt-incubator-20100204-r1747.pom
Downloading: http://gwt-dispatch.googlecode.com/svn/maven2/com/google/gwt/gwt-incubator/20100204-r1747/gwt-incubator-20100204-r1747.pom
Downloading: http://gwt-presenter.googlecode.com/svn/maven2/com/google/gwt/gwt-incubator/20100204-r1747/gwt-incubator-20100204-r1747.pom
Downloading: http://cobogw.googlecode.com/svn/maven2/com/google/gwt/gwt-incubator/20100204-r1747/gwt-incubator-20100204-r1747.pom
Downloading: http://guice-maven.googlecode.com/svn/trunk/com/google/gwt/gwt-incubator/20100204-r1747/gwt-incubator-20100204-r1747.pom
Downloading: http://repo1.maven.org/maven2/com/google/gwt/gwt-incubator/20100204-r1747/gwt-incubator-20100204-r1747.pom
Downloading: http://download.java.net/maven/2/org/cobogw/gwt/cobogw/1.3/cobogw-1.3.pom
Downloading: http://gwtupload.googlecode.com/svn/mavenrepo/org/cobogw/gwt/cobogw/1.3/cobogw-1.3.pom
Downloading: http://gwt-dispatch.googlecode.com/svn/maven2/org/cobogw/gwt/cobogw/1.3/cobogw-1.3.pom
Downloading: http://gwt-presenter.googlecode.com/svn/maven2/org/cobogw/gwt/cobogw/1.3/cobogw-1.3.pom
Downloading: http://cobogw.googlecode.com/svn/maven2/org/cobogw/gwt/cobogw/1.3/cobogw-1.3.pom
[WARNING] Checksum validation failed, no checksums available from the repository for http://cobogw.googlecode.com/svn/maven2/org/cobogw/gwt/cobogw/1.3/cobogw-1.3.pom
Downloaded: http://cobogw.googlecode.com/svn/maven2/org/cobogw/gwt/cobogw/1.3/cobogw-1.3.pom
(3 KB at 5.6 KB/sec)
projectFailed org.apache.hupa:hupa-widgets:0.0.1-SNAPSHOT
[HUDSON] Archiving <https://hudson.apache.org/hudson/job/hupa-trunk/ws/trunk/widgets/pom.xml>
to /home/hudson/hudson/jobs/hupa-trunk/modules/org.apache.hupa$hupa-widgets/builds/2011-02-28_07-19-26/archive/org.apache.hupa/hupa-widgets/0.0.1-SNAPSHOT/pom.xml
sessionEnded
[INFO] ------------------------------------------------------------------------
[INFO] Reactor Summary:
[INFO] 
[INFO] hupa-parent ....................................... SUCCESS [16.870s]
[INFO] hupa-shared ....................................... SUCCESS [22.605s]
[INFO] hupa-server ....................................... SUCCESS [39.792s]
[INFO] hupa-widgets ...................................... FAILURE [2.373s]
[INFO] hupa .............................................. SKIPPED
[INFO] ------------------------------------------------------------------------
[INFO] BUILD FAILURE
[INFO] ------------------------------------------------------------------------
[INFO] Total time: 1:31.974s
[INFO] Finished at: Sun Feb 27 23:21:09 GMT-08:00 2011
[INFO] Final Memory: 23M/151M
[INFO] ------------------------------------------------------------------------
maven builder waiting
mavenExecutionResult exceptions not empty
org.apache.maven.lifecycle.LifecycleExecutionException: Failed to execute goal on project
hupa-widgets: Could not resolve dependencies for project org.apache.hupa:hupa-widgets:jar:0.0.1-SNAPSHOT:
Failed to collect dependencies for [com.google.gwt:gwt-user:jar:2.1.1 (provided), com.google.gwt:gwt-incubator:jar:20100204-r1747
(compile), org.cobogw.gwt:cobogw:jar:1.3 (compile)]
	at org.apache.maven.lifecycle.internal.LifecycleDependencyResolver.getDependencies(LifecycleDependencyResolver.java:190)
	at org.apache.maven.lifecycle.internal.LifecycleDependencyResolver.resolveProjectDependencies(LifecycleDependencyResolver.java:104)
	at org.apache.maven.lifecycle.internal.MojoExecutor.ensureDependenciesAreResolved(MojoExecutor.java:258)
	at org.apache.maven.lifecycle.internal.MojoExecutor.execute(MojoExecutor.java:201)
	at org.apache.maven.lifecycle.internal.MojoExecutor.execute(MojoExecutor.java:153)
	at org.apache.maven.lifecycle.internal.MojoExecutor.execute(MojoExecutor.java:145)
	at org.apache.maven.lifecycle.internal.LifecycleModuleBuilder.buildProject(LifecycleModuleBuilder.java:84)
	at org.apache.maven.lifecycle.internal.LifecycleModuleBuilder.buildProject(LifecycleModuleBuilder.java:59)
	at org.apache.maven.lifecycle.internal.LifecycleStarter.singleThreadedBuild(LifecycleStarter.java:183)
	at org.apache.maven.lifecycle.internal.LifecycleStarter.execute(LifecycleStarter.java:161)
	at org.apache.maven.DefaultMaven.doExecute(DefaultMaven.java:319)
	at org.apache.maven.DefaultMaven.execute(DefaultMaven.java:156)
	at org.jvnet.hudson.maven3.launcher.Maven3Launcher.main(Maven3Launcher.java:79)
	at sun.reflect.NativeMethodAccessorImpl.invoke0(Native Method)
	at sun.reflect.NativeMethodAccessorImpl.invoke(NativeMethodAccessorImpl.java:39)
	at sun.reflect.DelegatingMethodAccessorImpl.invoke(DelegatingMethodAccessorImpl.java:25)
	at java.lang.reflect.Method.invoke(Method.java:592)
	at org.codehaus.plexus.classworlds.launcher.Launcher.launchStandard(Launcher.java:329)
	at org.codehaus.plexus.classworlds.launcher.Launcher.launch(Launcher.java:239)
	at org.jvnet.hudson.maven3.agent.Maven3Main.launch(Maven3Main.java:145)
	at hudson.maven.Maven3Builder.call(Maven3Builder.java:124)
	at hudson.maven.Maven3Builder.call(Maven3Builder.java:71)
	at hudson.remoting.UserRequest.perform(UserRequest.java:114)
	at hudson.remoting.UserRequest.perform(UserRequest.java:48)
	at hudson.remoting.Request$2.run(Request.java:270)
	at java.util.concurrent.Executors$RunnableAdapter.call(Executors.java:417)
	at java.util.concurrent.FutureTask$Sync.innerRun(FutureTask.java:269)
	at java.util.concurrent.FutureTask.run(FutureTask.java:123)
	at java.util.concurrent.ThreadPoolExecutor$Worker.runTask(ThreadPoolExecutor.java:651)
	at java.util.concurrent.ThreadPoolExecutor$Worker.run(ThreadPoolExecutor.java:676)
	at java.lang.Thread.run(Thread.java:595)
Caused by: org.apache.maven.project.DependencyResolutionException: Could not resolve dependencies
for project org.apache.hupa:hupa-widgets:jar:0.0.1-SNAPSHOT: Failed to collect dependencies
for [com.google.gwt:gwt-user:jar:2.1.1 (provided), com.google.gwt:gwt-incubator:jar:20100204-r1747
(compile), org.cobogw.gwt:cobogw:jar:1.3 (compile)]
	at org.apache.maven.project.DefaultProjectDependenciesResolver.resolve(DefaultProjectDependenciesResolver.java:127)
	at org.apache.maven.lifecycle.internal.LifecycleDependencyResolver.getDependencies(LifecycleDependencyResolver.java:165)
	... 30 more
Caused by: org.sonatype.aether.collection.DependencyCollectionException: Failed to collect
dependencies for [com.google.gwt:gwt-user:jar:2.1.1 (provided), com.google.gwt:gwt-incubator:jar:20100204-r1747
(compile), org.cobogw.gwt:cobogw:jar:1.3 (compile)]
	at org.sonatype.aether.impl.internal.DefaultDependencyCollector.collectDependencies(DefaultDependencyCollector.java:251)
	at org.sonatype.aether.impl.internal.DefaultRepositorySystem.collectDependencies(DefaultRepositorySystem.java:318)
	at org.apache.maven.project.DefaultProjectDependenciesResolver.resolve(DefaultProjectDependenciesResolver.java:119)
	... 31 more
Caused by: org.sonatype.aether.resolution.ArtifactDescriptorException: Failed to read artifact
descriptor for com.google.gwt:gwt-incubator:jar:20100204-r1747
	at org.apache.maven.repository.internal.DefaultArtifactDescriptorReader.loadPom(DefaultArtifactDescriptorReader.java:283)
	at org.apache.maven.repository.internal.DefaultArtifactDescriptorReader.readArtifactDescriptor(DefaultArtifactDescriptorReader.java:173)
	at org.sonatype.aether.impl.internal.DefaultDependencyCollector.process(DefaultDependencyCollector.java:419)
	at org.sonatype.aether.impl.internal.DefaultDependencyCollector.collectDependencies(DefaultDependencyCollector.java:233)
	... 33 more
Caused by: org.sonatype.aether.resolution.ArtifactResolutionException: Could not transfer
artifact com.google.gwt:gwt-incubator:pom:20100204-r1747 from/to lib-repo (http://svn.apache.org/repos/asf/james/hupa/lib):
No connector available to access repository lib-repo (http://svn.apache.org/repos/asf/james/hupa/lib)
of type legacy using the available factories WagonRepositoryConnectorFactory
	at org.sonatype.aether.impl.internal.DefaultArtifactResolver.resolveArtifacts(DefaultArtifactResolver.java:526)
	at org.sonatype.aether.impl.internal.DefaultArtifactResolver.resolveArtifact(DefaultArtifactResolver.java:214)
	at org.apache.maven.repository.internal.DefaultArtifactDescriptorReader.loadPom(DefaultArtifactDescriptorReader.java:268)
	... 36 more
Caused by: org.sonatype.aether.transfer.ArtifactTransferException: Could not transfer artifact
com.google.gwt:gwt-incubator:pom:20100204-r1747 from/to lib-repo (http://svn.apache.org/repos/asf/james/hupa/lib):
No connector available to access repository lib-repo (http://svn.apache.org/repos/asf/james/hupa/lib)
of type legacy using the available factories WagonRepositoryConnectorFactory
	at org.sonatype.aether.impl.internal.DefaultArtifactResolver.resolveArtifacts(DefaultArtifactResolver.java:449)
	... 38 more
Caused by: org.sonatype.aether.transfer.NoRepositoryConnectorException: No connector available
to access repository lib-repo (http://svn.apache.org/repos/asf/james/hupa/lib) of type legacy
using the available factories WagonRepositoryConnectorFactory
	at org.sonatype.aether.impl.internal.DefaultRemoteRepositoryManager.getRepositoryConnector(DefaultRemoteRepositoryManager.java:365)
	at org.sonatype.aether.impl.internal.DefaultArtifactResolver.resolveArtifacts(DefaultArtifactResolver.java:434)
	... 38 more
Sending e-mails to: server-dev@james.apache.org
channel stopped
Emma: looking for coverage reports in the entire workspace: <https://hudson.apache.org/hudson/job/hupa-trunk/ws/>
Emma: found 1 report files: 
          <https://hudson.apache.org/hudson/job/hupa-trunk/ws/trunk/server/target/site/emma/coverage.xml>
Emma: stored 1 report files in the build folder: /home/hudson/hudson/jobs/hupa-trunk/builds/2011-02-28_07-16-43/emma
Emma: Coverage: All coverage targets have been met.    


---------------------------------------------------------------------
To unsubscribe, e-mail: server-dev-unsubscribe@james.apache.org
For additional commands, e-mail: server-dev-help@james.apache.org


Mime
View raw message