james-server-dev mailing list archives

Site index · List index
Message view « Date » · « Thread »
Top « Date » · « Thread »
From Apache Hudson Server <hud...@hudson.apache.org>
Subject Build failed in Jenkins: james-server-trunk #1217
Date Wed, 09 Mar 2011 10:13:55 GMT
See <https://hudson.apache.org/hudson/job/james-server-trunk/1217/>

------------------------------------------
[...truncated 3475 lines...]
Generating <https://hudson.apache.org/hudson/job/james-server-trunk/ws/trunk/target/site/testapidocs/org/apache/james/transport/mailets//package-use.html...>
Generating <https://hudson.apache.org/hudson/job/james-server-trunk/ws/trunk/target/site/testapidocs/org/apache/james/transport/matchers//package-use.html...>
Generating <https://hudson.apache.org/hudson/job/james-server-trunk/ws/trunk/target/site/testapidocs/org/apache/james/user/file//package-use.html...>
Generating <https://hudson.apache.org/hudson/job/james-server-trunk/ws/trunk/target/site/testapidocs/org/apache/james/user/jcr//package-use.html...>
Generating <https://hudson.apache.org/hudson/job/james-server-trunk/ws/trunk/target/site/testapidocs/org/apache/james/user/jdbc//package-use.html...>
Generating <https://hudson.apache.org/hudson/job/james-server-trunk/ws/trunk/target/site/testapidocs/org/apache/james/user/jpa//package-use.html...>
Generating <https://hudson.apache.org/hudson/job/james-server-trunk/ws/trunk/target/site/testapidocs/org/apache/james/user/lib//package-use.html...>
Generating <https://hudson.apache.org/hudson/job/james-server-trunk/ws/trunk/target/site/testapidocs/org/apache/james/user/lib/mock//package-use.html...>
Generating <https://hudson.apache.org/hudson/job/james-server-trunk/ws/trunk/target/site/testapidocs/org/apache/james/util//package-use.html...>
Generating <https://hudson.apache.org/hudson/job/james-server-trunk/ws/trunk/target/site/testapidocs/org/apache/james/vut/file//package-use.html...>
Generating <https://hudson.apache.org/hudson/job/james-server-trunk/ws/trunk/target/site/testapidocs/org/apache/james/vut/jdbc//package-use.html...>
Generating <https://hudson.apache.org/hudson/job/james-server-trunk/ws/trunk/target/site/testapidocs/org/apache/james/vut/jpa//package-use.html...>
Generating <https://hudson.apache.org/hudson/job/james-server-trunk/ws/trunk/target/site/testapidocs/org/apache/james/vut/lib//package-use.html...>
Generating <https://hudson.apache.org/hudson/job/james-server-trunk/ws/trunk/target/site/testapidocs/org/apache/james/vut/lib/mock//package-use.html...>
Building index for all the packages and classes...
Generating <https://hudson.apache.org/hudson/job/james-server-trunk/ws/trunk/target/site/testapidocs/overview-tree.html...>
Generating <https://hudson.apache.org/hudson/job/james-server-trunk/ws/trunk/target/site/testapidocs/index-all.html...>
Generating <https://hudson.apache.org/hudson/job/james-server-trunk/ws/trunk/target/site/testapidocs/deprecated-list.html...>
Building index for all classes...
Generating <https://hudson.apache.org/hudson/job/james-server-trunk/ws/trunk/target/site/testapidocs/allclasses-frame.html...>
Generating <https://hudson.apache.org/hudson/job/james-server-trunk/ws/trunk/target/site/testapidocs/allclasses-noframe.html...>
Generating <https://hudson.apache.org/hudson/job/james-server-trunk/ws/trunk/target/site/testapidocs/index.html...>
Generating <https://hudson.apache.org/hudson/job/james-server-trunk/ws/trunk/target/site/testapidocs/overview-summary.html...>
Generating <https://hudson.apache.org/hudson/job/james-server-trunk/ws/trunk/target/site/testapidocs/help-doc.html...>
Generating <https://hudson.apache.org/hudson/job/james-server-trunk/ws/trunk/target/site/testapidocs/stylesheet.css...>
Note: Custom tags that could override future standard tags:  @warning, @todo, @note. To avoid
potential overrides, use at least one period character (.) in custom tag names.
Note: Custom tags that were not seen:  @warning, @todo, @note
9 warnings
[WARNING] Javadoc Warnings
[WARNING] <https://hudson.apache.org/hudson/job/james-server-trunk/ws/trunk/jdbc/src/test/java/org/apache/james/mailrepository/jdbc/JDBCMailRepositoryTest.java>:27:
package org.apache.derby.jdbc does not exist
[WARNING] import org.apache.derby.jdbc.EmbeddedDriver;
[WARNING] ^
[WARNING] <https://hudson.apache.org/hudson/job/james-server-trunk/ws/trunk/jdbc/src/test/java/org/apache/james/vut/jdbc/JDBCVirtualUserTableTest.java>:25:
package org.apache.derby.jdbc does not exist
[WARNING] import org.apache.derby.jdbc.EmbeddedDriver;
[WARNING] ^
[WARNING] <https://hudson.apache.org/hudson/job/james-server-trunk/ws/trunk/jdbc/src/test/java/org/apache/james/user/jdbc/JamesUsersJdbcRepositoryTest.java>:26:
package org.apache.derby.jdbc does not exist
[WARNING] import org.apache.derby.jdbc.EmbeddedDriver;
[WARNING] ^
[WARNING] <https://hudson.apache.org/hudson/job/james-server-trunk/ws/trunk/jdbc/src/test/java/org/apache/james/user/jdbc/DefaultUsersJdbcRepositoryTest.java>:25:
package org.apache.derby.jdbc does not exist
[WARNING] import org.apache.derby.jdbc.EmbeddedDriver;
[WARNING] ^
[WARNING] <https://hudson.apache.org/hudson/job/james-server-trunk/ws/trunk/file/src/test/java/org/apache/james/mailrepository/FileMailRepositoryTest.java>:37:
warning - @return tag has no arguments.
[WARNING] <https://hudson.apache.org/hudson/job/james-server-trunk/ws/trunk/data-library/src/test/java/org/apache/james/user/lib/AbstractUsersRepositoryTest.java>:175:
warning - @return tag has no arguments.
[WARNING] <https://hudson.apache.org/hudson/job/james-server-trunk/ws/trunk/jdbc/src/test/java/org/apache/james/mailrepository/jdbc/JDBCMailRepositoryTest.java>:42:
warning - @return tag has no arguments.
[WARNING] <https://hudson.apache.org/hudson/job/james-server-trunk/ws/trunk/jdbc/src/test/java/org/apache/james/user/jdbc/DefaultUsersJdbcRepositoryTest.java>:90:
warning - @return tag has no arguments.
[WARNING] <https://hudson.apache.org/hudson/job/james-server-trunk/ws/trunk/jdbc/src/test/java/org/apache/james/user/jdbc/JamesUsersJdbcRepositoryTest.java>:93:
warning - @return tag has no arguments.
[INFO] Generating "CPD Report" report    --- maven-pmd-plugin:2.5
[INFO] Generating "PMD Report" report    --- maven-pmd-plugin:2.5
[WARNING] Error while processing <https://hudson.apache.org/hudson/job/james-server-trunk/ws/trunk/mailets/src/main/java/org/apache/james/transport/mailets/AbstractVirtualUserTable.java>:
net.sourceforge.pmd.ast.ASTReferenceType
[INFO] Generating "JIRA Report" report    --- maven-changes-plugin:2.4
Mar 9, 2011 10:13:12 AM org.apache.commons.httpclient.HttpMethodBase getResponseBody
WARNING: Going to buffer response body of large or unknown size. Using getResponseBodyAsStream
instead is recommended.
[INFO] Downloading from JIRA at: http://issues.apache.org/jira/secure/IssueNavigator.jspa?view=rss&pid=10411&statusIds=6&sorter/field=created&sorter/order=DESC&sorter/field=priority&sorter/order=DESC&tempMax=1000&reset=true&decorator=none
[INFO] The JIRA version is '4.2.4-b591'
[INFO] The JIRA Report will contain issues only for the current version.
[INFO] Generating "Surefire Report" report    --- maven-surefire-report-plugin:2.7.2
[INFO] Generating "Dependency Analysis" report    --- maven-dependency-plugin:2.1
[INFO] Skipping pom project
[JENKINS] Archiving site from <https://hudson.apache.org/hudson/job/james-server-trunk/ws/trunk/target/site>
to /home/hudson/hudson/jobs/james-server-trunk/site
projectSucceeded org.apache.james:james-server:3.0-M3-SNAPSHOT
[INFO] [INFO] Deleting <https://hudson.apache.org/hudson/job/james-server-trunk/ws/trunk/data-api/target>
                                                                        
[INFO] ------------------------------------------------------------------------
[INFO] Building Apache James Server Data API 3.0-M3-SNAPSHOT
[INFO] ------------------------------------------------------------------------
[INFO] 
[INFO] --- maven-clean-plugin:2.4.1:clean (default-clean) @ james-server-data-api ---
[INFO] 
[INFO] --- maven-remote-resources-plugin:1.1:process (default) @ james-server-data-api ---
[INFO] Using 'UTF-8' encoding to copy filtered resources.
[INFO] [INFO] Copying 0 resource
[INFO] Copying 3 resources

[INFO] --- maven-resources-plugin:2.4:resources (default-resources) @ james-server-data-api
---
[INFO] [INFO] Compiling 14 source files to <https://hudson.apache.org/hudson/job/james-server-trunk/ws/trunk/data-api/target/classes>

[INFO] --- maven-compiler-plugin:2.3.2:compile (default-compile) @ james-server-data-api ---
[INFO] 
[INFO] --- maven-bundle-plugin:2.1.0:manifest (bundle-manifest) @ james-server-data-api ---
[INFO] [INFO] Using 'UTF-8' encoding to copy filtered resources.

[INFO] --- maven-resources-plugin:2.4:testResources (default-testResources) @ james-server-data-api
---
[INFO] Copying 0 resource
[INFO] Copying 3 resources
[INFO] [INFO] Compiling 1 source file to <https://hudson.apache.org/hudson/job/james-server-trunk/ws/trunk/data-api/target/test-classes>

[INFO] --- maven-compiler-plugin:2.3.2:testCompile (default-testCompile) @ james-server-data-api
---
[INFO] 
[INFO] --- maven-surefire-plugin:2.4.3:test (default-test) @ james-server-data-api ---
[INFO] Surefire report directory: <https://hudson.apache.org/hudson/job/james-server-trunk/ws/trunk/data-api/target/surefire-reports>

-------------------------------------------------------
 T E S T S
-------------------------------------------------------
There are no tests to run.

Results :

Tests run: 0, Failures: 0, Errors: 0, Skipped: 0

[JENKINS] Recording test results
[INFO] 
[INFO] --- maven-jar-plugin:2.3.1:jar (default-jar) @ james-server-data-api ---
[INFO] Building jar: <https://hudson.apache.org/hudson/job/james-server-trunk/ws/trunk/data-api/target/james-server-data-api-3.0-M3-SNAPSHOT.jar>
[INFO] 
[INFO] --- maven-jar-plugin:2.3.1:jar (default) @ james-server-data-api ---
[INFO] 
[INFO] --- maven-jar-plugin:2.3.1:test-jar (default) @ james-server-data-api ---
[INFO] Building jar: <https://hudson.apache.org/hudson/job/james-server-trunk/ws/trunk/data-api/target/james-server-data-api-3.0-M3-SNAPSHOT-tests.jar>
[INFO] [INFO] Installing <https://hudson.apache.org/hudson/job/james-server-trunk/ws/trunk/data-api/target/james-server-data-api-3.0-M3-SNAPSHOT.jar>
to /home/hudson/.m2/repository/org/apache/james/james-server-data-api/3.0-M3-SNAPSHOT/james-server-data-api-3.0-M3-SNAPSHOT.jar
[INFO] Installing <https://hudson.apache.org/hudson/job/james-server-trunk/ws/trunk/data-api/pom.xml>
to /home/hudson/.m2/repository/org/apache/james/james-server-data-api/3.0-M3-SNAPSHOT/james-server-data-api-3.0-M3-SNAPSHOT.pom
[INFO] Installing <https://hudson.apache.org/hudson/job/james-server-trunk/ws/trunk/data-api/target/james-server-data-api-3.0-M3-SNAPSHOT-tests.jar>
to /home/hudson/.m2/repository/org/apache/james/james-server-data-api/3.0-M3-SNAPSHOT/james-server-data-api-3.0-M3-SNAPSHOT-tests.jar

[INFO] --- maven-install-plugin:2.3:install (default-install) @ james-server-data-api ---
[INFO] Downloading: https://repository.apache.org/content/repositories/snapshots/org/apache/james/james-server-data-api/3.0-M3-SNAPSHOT/maven-metadata.xml

[INFO] --- maven-deploy-plugin:2.4:deploy (default-deploy) @ james-server-data-api ---
Downloaded: https://repository.apache.org/content/repositories/snapshots/org/apache/james/james-server-data-api/3.0-M3-SNAPSHOT/maven-metadata.xml
(1011 B at 5.0 KB/sec)
Uploading: https://repository.apache.org/content/repositories/snapshots/org/apache/james/james-server-data-api/3.0-M3-SNAPSHOT/james-server-data-api-3.0-M3-20110309.101351-210.jar
Uploaded: https://repository.apache.org/content/repositories/snapshots/org/apache/james/james-server-data-api/3.0-M3-SNAPSHOT/james-server-data-api-3.0-M3-20110309.101351-210.jar
(18 KB at 18.0 KB/sec)
Uploading: https://repository.apache.org/content/repositories/snapshots/org/apache/james/james-server-data-api/3.0-M3-SNAPSHOT/james-server-data-api-3.0-M3-20110309.101351-210.pom
Uploaded: https://repository.apache.org/content/repositories/snapshots/org/apache/james/james-server-data-api/3.0-M3-SNAPSHOT/james-server-data-api-3.0-M3-20110309.101351-210.pom
(3 KB at 14.8 KB/sec)
Downloading: https://repository.apache.org/content/repositories/snapshots/org/apache/james/james-server-data-api/maven-metadata.xml
[WARNING] Could not transfer metadata org.apache.james:james-server-data-api/maven-metadata.xml
from/to apache.snapshots.https (https://repository.apache.org/content/repositories/snapshots):
Error transferring file: Server returned HTTP response code: 500 for URL: https://repository.apache.org/content/repositories/snapshots/org/apache/james/james-server-data-api/maven-metadata.xml
mojoFailed org.apache.maven.plugins:maven-deploy-plugin:2.4(default-deploy)
projectFailed org.apache.james:james-server-data-api:3.0-M3-SNAPSHOT
[JENKINS] Archiving <https://hudson.apache.org/hudson/job/james-server-trunk/ws/trunk/data-api/target/james-server-data-api-3.0-M3-SNAPSHOT.jar>
to /home/hudson/hudson/jobs/james-server-trunk/modules/org.apache.james$james-server-data-api/builds/2011-03-09_10-09-43/archive/org.apache.james/james-server-data-api/3.0-M3-SNAPSHOT/james-server-data-api-3.0-M3-SNAPSHOT.jar
[JENKINS] Archiving <https://hudson.apache.org/hudson/job/james-server-trunk/ws/trunk/data-api/target/james-server-data-api-3.0-M3-SNAPSHOT-tests.jar>
to /home/hudson/hudson/jobs/james-server-trunk/modules/org.apache.james$james-server-data-api/builds/2011-03-09_10-09-43/archive/org.apache.james/james-server-data-api/3.0-M3-SNAPSHOT/james-server-data-api-3.0-M3-SNAPSHOT-tests.jar
sessionEnded
[INFO] ------------------------------------------------------------------------
[INFO] Reactor Summary:
[INFO] 
[INFO] Apache James Server ............................... SUCCESS [3:50.505s]
[INFO] Apache James Server Data API ...................... FAILURE [5.857s]
[INFO] Apache James Server Client ........................ SKIPPED
[INFO] Apache James Server Lifecycle API ................. SKIPPED
[INFO] Apache James Server Filesystem API ................ SKIPPED
[INFO] Apache James Server Core .......................... SKIPPED
[INFO] Apache James Server Queue API ..................... SKIPPED
[INFO] Apache James Server Mailetcontainer library ....... SKIPPED
[INFO] Apache James Server DNS Server API ................ SKIPPED
[INFO] Apache James Server DNSService Library ............ SKIPPED
[INFO] Apache James Server Mailetcontainer Camel implementation  SKIPPED
[INFO] Apache James Server Mailbox Adapter ............... SKIPPED
[INFO] Apache James Server DNSService Implementation ..... SKIPPED
[INFO] Apache James Server Common Utilities .............. SKIPPED
[INFO] Apache James Server Protocols Library ............. SKIPPED
[INFO] Apache James Server Data Library .................. SKIPPED
[INFO] Apache James Server LDAP Data Implementation ...... SKIPPED
[INFO] Apache James Server SMTP .......................... SKIPPED
[INFO] Apache James Server IMAP .......................... SKIPPED
[INFO] Apache James Server LMTP .......................... SKIPPED
[INFO] Apache James Server POP3 .......................... SKIPPED
[INFO] Apache James Server FetchMail ..................... SKIPPED
[INFO] Apache James Server JMS Mail Queue ................ SKIPPED
[INFO] Apache James Server ActiveMQ Queue ................ SKIPPED
[INFO] Apache James Server Mailets ....................... SKIPPED
[INFO] Apache James Server File Data Persistence ......... SKIPPED
[INFO] Apache James Server JPA Data Persistence .......... SKIPPED
[INFO] Apache James Server JDBC Data Persistence ......... SKIPPED
[INFO] Apache James Server JCR Data Persistence .......... SKIPPED
[INFO] Apache James Server Container Spring .............. SKIPPED
[INFO] Apache James Server OSGI Bindings ................. SKIPPED
[INFO] ------------------------------------------------------------------------
[INFO] BUILD FAILURE
[INFO] ------------------------------------------------------------------------
[INFO] Total time: 3:59.702s
[INFO] Finished at: Wed Mar 09 10:13:54 UTC 2011
[INFO] Final Memory: 64M/256M
[INFO] ------------------------------------------------------------------------
mavenExecutionResult exceptions not empty
org.apache.maven.lifecycle.LifecycleExecutionException: Failed to execute goal org.apache.maven.plugins:maven-deploy-plugin:2.4:deploy
(default-deploy) on project james-server-data-api: Failed to retrieve remote metadata org.apache.james:james-server-data-api/maven-metadata.xml:
Could not transfer metadata org.apache.james:james-server-data-api/maven-metadata.xml from/to
apache.snapshots.https (https://repository.apache.org/content/repositories/snapshots): Error
transferring file: Server returned HTTP response code: 500 for URL: https://repository.apache.org/content/repositories/snapshots/org/apache/james/james-server-data-api/maven-metadata.xml
	at org.apache.maven.lifecycle.internal.MojoExecutor.execute(MojoExecutor.java:217)
	at org.apache.maven.lifecycle.internal.MojoExecutor.execute(MojoExecutor.java:153)
	at org.apache.maven.lifecycle.internal.MojoExecutor.execute(MojoExecutor.java:145)
	at org.apache.maven.lifecycle.internal.LifecycleModuleBuilder.buildProject(LifecycleModuleBuilder.java:84)
	at org.apache.maven.lifecycle.internal.LifecycleModuleBuilder.buildProject(LifecycleModuleBuilder.java:59)
	at org.apache.maven.lifecycle.internal.LifecycleStarter.singleThreadedBuild(LifecycleStarter.java:183)
	at org.apache.maven.lifecycle.internal.LifecycleStarter.execute(LifecycleStarter.java:161)
	at org.apache.maven.DefaultMaven.doExecute(DefaultMaven.java:319)
	at org.apache.maven.DefaultMaven.execute(DefaultMaven.java:156)
	at org.jvnet.hudson.maven3.launcher.Maven3Launcher.main(Maven3Launcher.java:79)
	at sun.reflect.NativeMethodAccessorImpl.invoke0(Native Method)
	at sun.reflect.NativeMethodAccessorImpl.invoke(NativeMethodAccessorImpl.java:39)
	at sun.reflect.DelegatingMethodAccessorImpl.invoke(DelegatingMethodAccessorImpl.java:25)
	at java.lang.reflect.Method.invoke(Method.java:592)
	at org.codehaus.plexus.classworlds.launcher.Launcher.launchStandard(Launcher.java:329)
	at org.codehaus.plexus.classworlds.launcher.Launcher.launch(Launcher.java:239)
	at org.jvnet.hudson.maven3.agent.Maven3Main.launch(Maven3Main.java:145)
	at hudson.maven.Maven3Builder.call(Maven3Builder.java:124)
	at hudson.maven.Maven3Builder.call(Maven3Builder.java:71)
	at hudson.remoting.UserRequest.perform(UserRequest.java:114)
	at hudson.remoting.UserRequest.perform(UserRequest.java:48)
	at hudson.remoting.Request$2.run(Request.java:270)
	at java.util.concurrent.Executors$RunnableAdapter.call(Executors.java:417)
	at java.util.concurrent.FutureTask$Sync.innerRun(FutureTask.java:269)
	at java.util.concurrent.FutureTask.run(FutureTask.java:123)
	at java.util.concurrent.ThreadPoolExecutor$Worker.runTask(ThreadPoolExecutor.java:651)
	at java.util.concurrent.ThreadPoolExecutor$Worker.run(ThreadPoolExecutor.java:676)
	at java.lang.Thread.run(Thread.java:595)
Caused by: org.apache.maven.plugin.MojoExecutionException: Failed to retrieve remote metadata
org.apache.james:james-server-data-api/maven-metadata.xml: Could not transfer metadata org.apache.james:james-server-data-api/maven-metadata.xml
from/to apache.snapshots.https (https://repository.apache.org/content/repositories/snapshots):
Error transferring file: Server returned HTTP response code: 500 for URL: https://repository.apache.org/content/repositories/snapshots/org/apache/james/james-server-data-api/maven-metadata.xml
	at org.apache.maven.plugin.deploy.DeployMojo.execute(DeployMojo.java:195)
	at org.apache.maven.plugin.DefaultBuildPluginManager.executeMojo(DefaultBuildPluginManager.java:107)
	at org.apache.maven.lifecycle.internal.MojoExecutor.execute(MojoExecutor.java:209)
	... 27 more
Caused by: org.apache.maven.artifact.deployer.ArtifactDeploymentException: Failed to retrieve
remote metadata org.apache.james:james-server-data-api/maven-metadata.xml: Could not transfer
metadata org.apache.james:james-server-data-api/maven-metadata.xml from/to apache.snapshots.https
(https://repository.apache.org/content/repositories/snapshots): Error transferring file: Server
returned HTTP response code: 500 for URL: https://repository.apache.org/content/repositories/snapshots/org/apache/james/james-server-data-api/maven-metadata.xml
	at org.apache.maven.artifact.deployer.DefaultArtifactDeployer.deploy(DefaultArtifactDeployer.java:140)
	at org.apache.maven.plugin.deploy.DeployMojo.execute(DeployMojo.java:173)
	... 29 more
Caused by: org.sonatype.aether.deployment.DeploymentException: Failed to retrieve remote metadata
org.apache.james:james-server-data-api/maven-metadata.xml: Could not transfer metadata org.apache.james:james-server-data-api/maven-metadata.xml
from/to apache.snapshots.https (https://repository.apache.org/content/repositories/snapshots):
Error transferring file: Server returned HTTP response code: 500 for URL: https://repository.apache.org/content/repositories/snapshots/org/apache/james/james-server-data-api/maven-metadata.xml
	at org.sonatype.aether.impl.internal.DefaultDeployer.upload(DefaultDeployer.java:380)
	at org.sonatype.aether.impl.internal.DefaultDeployer.deploy(DefaultDeployer.java:269)
	at org.sonatype.aether.impl.internal.DefaultRepositorySystem.deploy(DefaultRepositorySystem.java:380)
	at org.apache.maven.artifact.deployer.DefaultArtifactDeployer.deploy(DefaultArtifactDeployer.java:136)
	... 30 more
Caused by: org.sonatype.aether.transfer.MetadataTransferException: Could not transfer metadata
org.apache.james:james-server-data-api/maven-metadata.xml from/to apache.snapshots.https (https://repository.apache.org/content/repositories/snapshots):
Error transferring file: Server returned HTTP response code: 500 for URL: https://repository.apache.org/content/repositories/snapshots/org/apache/james/james-server-data-api/maven-metadata.xml
	at org.sonatype.aether.connector.wagon.WagonRepositoryConnector$3.wrap(WagonRepositoryConnector.java:932)
	at org.sonatype.aether.connector.wagon.WagonRepositoryConnector$3.wrap(WagonRepositoryConnector.java:923)
	at org.sonatype.aether.connector.wagon.WagonRepositoryConnector$GetTask.flush(WagonRepositoryConnector.java:696)
	at org.sonatype.aether.connector.wagon.WagonRepositoryConnector$GetTask.flush(WagonRepositoryConnector.java:690)
	at org.sonatype.aether.connector.wagon.WagonRepositoryConnector.get(WagonRepositoryConnector.java:435)
	at org.sonatype.aether.impl.internal.DefaultDeployer.upload(DefaultDeployer.java:353)
	... 33 more
Caused by: org.apache.maven.wagon.TransferFailedException: Error transferring file: Server
returned HTTP response code: 500 for URL: https://repository.apache.org/content/repositories/snapshots/org/apache/james/james-server-data-api/maven-metadata.xml
	at org.apache.maven.wagon.providers.http.LightweightHttpWagon.fillInputData(LightweightHttpWagon.java:143)
	at org.apache.maven.wagon.StreamWagon.getInputStream(StreamWagon.java:116)
	at org.apache.maven.wagon.StreamWagon.getIfNewer(StreamWagon.java:88)
	at org.apache.maven.wagon.StreamWagon.get(StreamWagon.java:61)
	at org.sonatype.aether.connector.wagon.WagonRepositoryConnector$GetTask.run(WagonRepositoryConnector.java:605)
	... 3 more
Caused by: java.io.IOException: Server returned HTTP response code: 500 for URL: https://repository.apache.org/content/repositories/snapshots/org/apache/james/james-server-data-api/maven-metadata.xml
	at sun.reflect.GeneratedConstructorAccessor35.newInstance(Unknown Source)
	at sun.reflect.DelegatingConstructorAccessorImpl.newInstance(DelegatingConstructorAccessorImpl.java:27)
	at java.lang.reflect.Constructor.newInstance(Constructor.java:501)
	at sun.net.www.protocol.http.HttpURLConnection$6.run(HttpURLConnection.java:1250)
	at java.security.AccessController.doPrivileged(Native Method)
	at sun.net.www.protocol.http.HttpURLConnection.getChainedException(HttpURLConnection.java:1244)
	at sun.net.www.protocol.http.HttpURLConnection.getInputStream(HttpURLConnection.java:932)
	at sun.net.www.protocol.https.HttpsURLConnectionImpl.getInputStream(HttpsURLConnectionImpl.java:234)
	at org.apache.maven.wagon.providers.http.LightweightHttpWagon.fillInputData(LightweightHttpWagon.java:122)
	... 7 more
Caused by: java.io.IOException: Server returned HTTP response code: 500 for URL: https://repository.apache.org/content/repositories/snapshots/org/apache/james/james-server-data-api/maven-metadata.xml
	at sun.net.www.protocol.http.HttpURLConnection.getInputStream(HttpURLConnection.java:1196)
	at java.net.HttpURLConnection.getResponseCode(HttpURLConnection.java:367)
	at sun.net.www.protocol.https.HttpsURLConnectionImpl.getResponseCode(HttpsURLConnectionImpl.java:318)
	at org.apache.maven.wagon.providers.http.LightweightHttpWagon.fillInputData(LightweightHttpWagon.java:115)
	... 7 more
Sending e-mails to: server-dev@james.apache.org
channel stopped


---------------------------------------------------------------------
To unsubscribe, e-mail: server-dev-unsubscribe@james.apache.org
For additional commands, e-mail: server-dev-help@james.apache.org


Mime
View raw message