james-server-dev mailing list archives

Site index · List index
Message view « Date » · « Thread »
Top « Date » · « Thread »
From Apache Hudson Server <hud...@hudson.apache.org>
Subject Build failed in Jenkins: james-server-trunk » Apache James Server OSGI Bindings #1197
Date Sun, 06 Mar 2011 16:47:14 GMT
See <https://hudson.apache.org/hudson/job/james-server-trunk/org.apache.james$james-server-osgi/1197/>

------------------------------------------
[...truncated 807 lines...]
	at org.apache.maven.lifecycle.internal.MojoExecutor.execute(MojoExecutor.java:145)
	at org.apache.maven.lifecycle.internal.LifecycleModuleBuilder.buildProject(LifecycleModuleBuilder.java:84)
	at org.apache.maven.lifecycle.internal.LifecycleModuleBuilder.buildProject(LifecycleModuleBuilder.java:59)
	at org.apache.maven.lifecycle.internal.LifecycleStarter.singleThreadedBuild(LifecycleStarter.java:183)
	at org.apache.maven.lifecycle.internal.LifecycleStarter.execute(LifecycleStarter.java:161)
	at org.apache.maven.DefaultMaven.doExecute(DefaultMaven.java:319)
	at org.apache.maven.DefaultMaven.execute(DefaultMaven.java:156)
	at org.jvnet.hudson.maven3.launcher.Maven3Launcher.main(Maven3Launcher.java:79)
	at sun.reflect.NativeMethodAccessorImpl.invoke0(Native Method)
	at sun.reflect.NativeMethodAccessorImpl.invoke(NativeMethodAccessorImpl.java:39)
	at sun.reflect.DelegatingMethodAccessorImpl.invoke(DelegatingMethodAccessorImpl.java:25)
	at java.lang.reflect.Method.invoke(Method.java:592)
	at org.codehaus.plexus.classworlds.launcher.Launcher.launchStandard(Launcher.java:329)
	at org.codehaus.plexus.classworlds.launcher.Launcher.launch(Launcher.java:239)
	at org.jvnet.hudson.maven3.agent.Maven3Main.launch(Maven3Main.java:145)
	at hudson.maven.Maven3Builder.call(Maven3Builder.java:124)
	at hudson.maven.Maven3Builder.call(Maven3Builder.java:71)
	at hudson.remoting.UserRequest.perform(UserRequest.java:114)
	at hudson.remoting.UserRequest.perform(UserRequest.java:48)
	at hudson.remoting.Request$2.run(Request.java:270)
	at java.util.concurrent.Executors$RunnableAdapter.call(Executors.java:417)
	at java.util.concurrent.FutureTask$Sync.innerRun(FutureTask.java:269)
	at java.util.concurrent.FutureTask.run(FutureTask.java:123)
	at java.util.concurrent.ThreadPoolExecutor$Worker.runTask(ThreadPoolExecutor.java:651)
	at java.util.concurrent.ThreadPoolExecutor$Worker.run(ThreadPoolExecutor.java:676)
	at java.lang.Thread.run(Thread.java:595)
Caused by: org.sonatype.aether.resolution.ArtifactResolutionException: Could not find artifact
org.bouncycastle:bcjdk15:pom:1.45 in maven2-repository.dev.java.net (http://download.java.net/maven/2/)
	at org.sonatype.aether.impl.internal.DefaultArtifactResolver.resolveArtifacts(DefaultArtifactResolver.java:526)
	at org.sonatype.aether.impl.internal.DefaultArtifactResolver.resolveArtifact(DefaultArtifactResolver.java:214)
	at org.apache.maven.project.DefaultProjectBuilder.build(DefaultProjectBuilder.java:251)
	... 45 more
Caused by: org.sonatype.aether.transfer.ArtifactNotFoundException: Could not find artifact
org.bouncycastle:bcjdk15:pom:1.45 in maven2-repository.dev.java.net (http://download.java.net/maven/2/)
	at org.sonatype.aether.connector.wagon.WagonRepositoryConnector$4.wrap(WagonRepositoryConnector.java:945)
	at org.sonatype.aether.connector.wagon.WagonRepositoryConnector$4.wrap(WagonRepositoryConnector.java:940)
	at org.sonatype.aether.connector.wagon.WagonRepositoryConnector$GetTask.flush(WagonRepositoryConnector.java:696)
	at org.sonatype.aether.connector.wagon.WagonRepositoryConnector$GetTask.flush(WagonRepositoryConnector.java:690)
	at org.sonatype.aether.connector.wagon.WagonRepositoryConnector.get(WagonRepositoryConnector.java:435)
	at org.sonatype.aether.impl.internal.DefaultArtifactResolver.resolveArtifacts(DefaultArtifactResolver.java:438)
	... 47 more
[ERROR] Right side ($banner.alt) of addition operation has null value. Operation not possible.
META-INF/maven/site.vm [line 27, column 44]
[INFO] Generating "Distribution Management" report    --- maven-project-info-reports-plugin:2.3.1
[ERROR] Right side ($banner.alt) of addition operation has null value. Operation not possible.
META-INF/maven/site.vm [line 27, column 44]
[INFO] Generating "About" report    --- maven-project-info-reports-plugin:2.3.1
[ERROR] Right side ($banner.alt) of addition operation has null value. Operation not possible.
META-INF/maven/site.vm [line 27, column 44]
[INFO] Generating "Issue Tracking" report    --- maven-project-info-reports-plugin:2.3.1
[ERROR] Right side ($banner.alt) of addition operation has null value. Operation not possible.
META-INF/maven/site.vm [line 27, column 44]
[INFO] Generating "Project License" report    --- maven-project-info-reports-plugin:2.3.1
[ERROR] Right side ($banner.alt) of addition operation has null value. Operation not possible.
META-INF/maven/site.vm [line 27, column 44]
[INFO] Generating "Mailing Lists" report    --- maven-project-info-reports-plugin:2.3.1
[ERROR] Right side ($banner.alt) of addition operation has null value. Operation not possible.
META-INF/maven/site.vm [line 27, column 44]
[INFO] Generating "Plugin Management" report    --- maven-project-info-reports-plugin:2.3.1
[ERROR] Right side ($banner.alt) of addition operation has null value. Operation not possible.
META-INF/maven/site.vm [line 27, column 44]
[INFO] Generating "Project Plugins" report    --- maven-project-info-reports-plugin:2.3.1
[ERROR] Right side ($banner.alt) of addition operation has null value. Operation not possible.
META-INF/maven/site.vm [line 27, column 44]
[INFO] Generating "Project Team" report    --- maven-project-info-reports-plugin:2.3.1
[ERROR] Right side ($banner.alt) of addition operation has null value. Operation not possible.
META-INF/maven/site.vm [line 27, column 44]
[INFO] Generating "Source Repository" report    --- maven-project-info-reports-plugin:2.3.1
[ERROR] Right side ($banner.alt) of addition operation has null value. Operation not possible.
META-INF/maven/site.vm [line 27, column 44]
[INFO] Generating "Project Summary" report    --- maven-project-info-reports-plugin:2.3.1
[ERROR] Right side ($banner.alt) of addition operation has null value. Operation not possible.
META-INF/maven/site.vm [line 27, column 44]
[INFO] Generating "JIRA Report" report    --- maven-changes-plugin:2.4
Mar 6, 2011 4:44:37 PM org.apache.commons.httpclient.HttpMethodBase getResponseBody
WARNING: Going to buffer response body of large or unknown size. Using getResponseBodyAsStream
instead is recommended.
[INFO] Downloading from JIRA at: http://issues.apache.org/jira/secure/IssueNavigator.jspa?view=rss&pid=10411&statusIds=6&sorter/field=created&sorter/order=DESC&sorter/field=priority&sorter/order=DESC&tempMax=1000&reset=true&decorator=none
[INFO] The JIRA version is '4.2.2-b589'
[INFO] The JIRA Report will contain issues only for the current version.
[ERROR] Right side ($banner.alt) of addition operation has null value. Operation not possible.
META-INF/maven/site.vm [line 27, column 44]
[INFO] Generating "Surefire Report" report    --- maven-surefire-report-plugin:2.7.2
[ERROR] Right side ($banner.alt) of addition operation has null value. Operation not possible.
META-INF/maven/site.vm [line 27, column 44]
[INFO] Generating "Dependency Analysis" report    --- maven-dependency-plugin:2.1
[ERROR] Right side ($banner.alt) of addition operation has null value. Operation not possible.
META-INF/maven/site.vm [line 27, column 44]
[ERROR] Right side ($banner.alt) of addition operation has null value. Operation not possible.
META-INF/maven/site.vm [line 27, column 44]
[ERROR] Right side ($banner.alt) of addition operation has null value. Operation not possible.
META-INF/maven/site.vm [line 27, column 44]
[JENKINS] Archiving site from /home/hudson/hudson-slave/workspace/james-server-trunk/trunk/container-spring/target/site
to /home/hudson/hudson/jobs/james-server-trunk/site/james-server-container-spring
projectSucceeded org.apache.james:james-server-container-spring:3.0-M3-SNAPSHOT
[JENKINS] Archiving /home/hudson/hudson-slave/workspace/james-server-trunk/trunk/container-spring/target/james-server-container-spring-3.0-M3-SNAPSHOT.jar
to /home/hudson/hudson/jobs/james-server-trunk/modules/org.apache.james$james-server-container-spring/builds/2011-03-06_15-31-37/archive/org.apache.james/james-server-container-spring/3.0-M3-20110306.163531-459/james-server-container-spring-3.0-M3-SNAPSHOT.jar
[INFO]                                                                         
[INFO] ------------------------------------------------------------------------
[INFO] Building Apache James Server OSGI Bindings 3.0-M3-SNAPSHOT[INFO] Deleting <https://hudson.apache.org/hudson/job/james-server-trunk/org.apache.james$james-server-osgi/ws/target>

[INFO] ------------------------------------------------------------------------
[INFO] 
[INFO] --- maven-clean-plugin:2.4.1:clean (default-clean) @ james-server-osgi ---
[INFO] 
[INFO] --- maven-remote-resources-plugin:1.1:process (default) @ james-server-osgi ---
[INFO] [INFO] Using 'UTF-8' encoding to copy filtered resources.
[INFO] Copying 1 resource
[INFO] Copying 3 resources

[INFO] --- maven-resources-plugin:2.4:resources (default-resources) @ james-server-osgi ---
[INFO] [INFO] Compiling 3 source files to <https://hudson.apache.org/hudson/job/james-server-trunk/org.apache.james$james-server-osgi/ws/target/classes>

[INFO] --- maven-compiler-plugin:2.3.2:compile (default-compile) @ james-server-osgi ---
[INFO] 
[INFO] --- maven-bundle-plugin:2.1.0:manifest (bundle-manifest) @ james-server-osgi ---
[INFO] [INFO] Using 'UTF-8' encoding to copy filtered resources.
[INFO] skip non existing resourceDirectory <https://hudson.apache.org/hudson/job/james-server-trunk/org.apache.james$james-server-osgi/ws/src/test/resources>
[INFO] Copying 3 resources

[INFO] --- maven-resources-plugin:2.4:testResources (default-testResources) @ james-server-osgi
---
[INFO] [INFO] No sources to compile

[INFO] --- maven-compiler-plugin:2.3.2:testCompile (default-testCompile) @ james-server-osgi
---
[INFO] [INFO] Surefire report directory: <https://hudson.apache.org/hudson/job/james-server-trunk/org.apache.james$james-server-osgi/ws/target/surefire-reports>

[INFO] --- maven-surefire-plugin:2.4.3:test (default-test) @ james-server-osgi ---

-------------------------------------------------------
 T E S T S
-------------------------------------------------------
There are no tests to run.

Results :

Tests run: 0, Failures: 0, Errors: 0, Skipped: 0

[JENKINS] Recording test results
[INFO] 
[INFO] --- maven-jar-plugin:2.3.1:jar (default-jar) @ james-server-osgi ---
[INFO] Building jar: <https://hudson.apache.org/hudson/job/james-server-trunk/org.apache.james$james-server-osgi/ws/target/james-server-osgi-3.0-M3-SNAPSHOT.jar>
[INFO] 
[INFO] --- maven-jar-plugin:2.3.1:jar (default) @ james-server-osgi ---
[INFO] 
[INFO] --- maven-jar-plugin:2.3.1:test-jar (default) @ james-server-osgi ---
[INFO] Building jar: <https://hudson.apache.org/hudson/job/james-server-trunk/org.apache.james$james-server-osgi/ws/target/james-server-osgi-3.0-M3-SNAPSHOT-tests.jar>
[INFO] [INFO] Installing <https://hudson.apache.org/hudson/job/james-server-trunk/org.apache.james$james-server-osgi/ws/target/james-server-osgi-3.0-M3-SNAPSHOT.jar>
to /home/hudson/.m2/repository/org/apache/james/james-server-osgi/3.0-M3-SNAPSHOT/james-server-osgi-3.0-M3-SNAPSHOT.jar
[INFO] Installing <https://hudson.apache.org/hudson/job/james-server-trunk/org.apache.james$james-server-osgi/ws/pom.xml>
to /home/hudson/.m2/repository/org/apache/james/james-server-osgi/3.0-M3-SNAPSHOT/james-server-osgi-3.0-M3-SNAPSHOT.pom
[INFO] Installing <https://hudson.apache.org/hudson/job/james-server-trunk/org.apache.james$james-server-osgi/ws/target/james-server-osgi-3.0-M3-SNAPSHOT-tests.jar>
to /home/hudson/.m2/repository/org/apache/james/james-server-osgi/3.0-M3-SNAPSHOT/james-server-osgi-3.0-M3-SNAPSHOT-tests.jar

[INFO] --- maven-install-plugin:2.3:install (default-install) @ james-server-osgi ---
[INFO] Downloading: https://repository.apache.org/content/repositories/snapshots/org/apache/james/james-server-osgi/3.0-M3-SNAPSHOT/maven-metadata.xml

[INFO] --- maven-deploy-plugin:2.4:deploy (default-deploy) @ james-server-osgi ---
Downloaded: https://repository.apache.org/content/repositories/snapshots/org/apache/james/james-server-osgi/3.0-M3-SNAPSHOT/maven-metadata.xml
(1007 B at 4.1 KB/sec)
Uploading: https://repository.apache.org/content/repositories/snapshots/org/apache/james/james-server-osgi/3.0-M3-SNAPSHOT/james-server-osgi-3.0-M3-20110306.164459-193.jar
Uploaded: https://repository.apache.org/content/repositories/snapshots/org/apache/james/james-server-osgi/3.0-M3-SNAPSHOT/james-server-osgi-3.0-M3-20110306.164459-193.jar
(16 KB at 56.9 KB/sec)
Uploading: https://repository.apache.org/content/repositories/snapshots/org/apache/james/james-server-osgi/3.0-M3-SNAPSHOT/james-server-osgi-3.0-M3-20110306.164459-193.pom
Uploaded: https://repository.apache.org/content/repositories/snapshots/org/apache/james/james-server-osgi/3.0-M3-SNAPSHOT/james-server-osgi-3.0-M3-20110306.164459-193.pom
(4 KB at 15.8 KB/sec)
Downloading: https://repository.apache.org/content/repositories/snapshots/org/apache/james/james-server-osgi/maven-metadata.xml
Downloaded: https://repository.apache.org/content/repositories/snapshots/org/apache/james/james-server-osgi/maven-metadata.xml
(294 B at 3.3 KB/sec)
Uploading: https://repository.apache.org/content/repositories/snapshots/org/apache/james/james-server-osgi/3.0-M3-SNAPSHOT/maven-metadata.xml
Uploaded: https://repository.apache.org/content/repositories/snapshots/org/apache/james/james-server-osgi/3.0-M3-SNAPSHOT/maven-metadata.xml
(1007 B at 6.2 KB/sec)
Uploading: https://repository.apache.org/content/repositories/snapshots/org/apache/james/james-server-osgi/maven-metadata.xml
Uploaded: https://repository.apache.org/content/repositories/snapshots/org/apache/james/james-server-osgi/maven-metadata.xml
(294 B at 1.8 KB/sec)
Uploading: https://repository.apache.org/content/repositories/snapshots/org/apache/james/james-server-osgi/3.0-M3-SNAPSHOT/james-server-osgi-3.0-M3-20110306.164459-193-tests.jar
Uploaded: https://repository.apache.org/content/repositories/snapshots/org/apache/james/james-server-osgi/3.0-M3-SNAPSHOT/james-server-osgi-3.0-M3-20110306.164459-193-tests.jar
(12 KB at 40.1 KB/sec)
Uploading: https://repository.apache.org/content/repositories/snapshots/org/apache/james/james-server-osgi/3.0-M3-SNAPSHOT/maven-metadata.xml
Uploaded: https://repository.apache.org/content/repositories/snapshots/org/apache/james/james-server-osgi/3.0-M3-SNAPSHOT/maven-metadata.xml
(1007 B at 6.3 KB/sec)
[INFO] [INFO] configuring report plugin org.apache.maven.plugins:maven-jxr-plugin:2.2
[INFO] configuring report plugin org.apache.maven.plugins:maven-project-info-reports-plugin:2.3.1

[INFO] --- maven-site-plugin:3.0-beta-3:site (default-site) @ james-server-osgi ---
[INFO] configuring report plugin org.apache.maven.plugins:maven-javadoc-plugin:2.7
mojo forkStarted org.apache.maven.plugins:maven-javadoc-plugin:2.7(report:aggregate)
mojo forkSucceeded org.apache.maven.plugins:maven-javadoc-plugin:2.7(report:aggregate)
mojo forkStarted org.apache.maven.plugins:maven-javadoc-plugin:2.7(report:test-aggregate)
forkedProjectStarted org.apache.james:james-server3.0-M3-SNAPSHOT
forkedProjectStarted org.apache.james:james-server-osgi3.0-M3-SNAPSHOT
[INFO]                                                                         
[INFO] >>>>>>>>>>>>>>>>>>>>>>>>>>>>>>>>>>>>>>>>>>>>>>>>>>>>>>>>>>>>>>>>>>>>>>>>
[INFO] Forking Apache James Server OSGI Bindings 3.0-M3-SNAPSHOT
[INFO] >>>>>>>>>>>>>>>>>>>>>>>>>>>>>>>>>>>>>>>>>>>>>>>>>>>>>>>>>>>>>>>>>>>>>>>>
[INFO] 
[INFO] --- maven-remote-resources-plugin:1.1:process (default) @ james-server-osgi ---
[INFO] [INFO] Using 'UTF-8' encoding to copy filtered resources.
[INFO] Copying 1 resource
[INFO] Copying 3 resources
[INFO] Copying 3 resources

[INFO] --- maven-resources-plugin:2.4:resources (default-resources) @ james-server-osgi ---
[INFO] [INFO] Nothing to compile - all classes are up to date

[INFO] --- maven-compiler-plugin:2.3.2:compile (default-compile) @ james-server-osgi ---
[INFO] 
[INFO] --- maven-bundle-plugin:2.1.0:manifest (bundle-manifest) @ james-server-osgi ---
forkedProjectSucceeded org.apache.james:james-server-osgi3.0-M3-SNAPSHOT
[JENKINS] Archiving <https://hudson.apache.org/hudson/job/james-server-trunk/org.apache.james$james-server-osgi/ws/target/james-server-osgi-3.0-M3-SNAPSHOT-tests.jar>
to /home/hudson/hudson/jobs/james-server-trunk/modules/org.apache.james$james-server-osgi/builds/2011-03-06_15-31-37/archive/org.apache.james/james-server-osgi/3.0-M3-20110306.164459-193/james-server-osgi-3.0-M3-SNAPSHOT-tests.jar
mojo forkSucceeded org.apache.maven.plugins:maven-javadoc-plugin:2.7(report:test-aggregate)
[INFO] configuring report plugin org.apache.maven.plugins:maven-pmd-plugin:2.5
[INFO] configuring report plugin org.apache.maven.plugins:maven-changes-plugin:2.4
[INFO] configuring report plugin org.apache.maven.plugins:maven-surefire-report-plugin:2.7.2
mojo forkStarted org.apache.maven.plugins:maven-surefire-report-plugin:2.7.2(report:report)
forkedProjectStarted org.apache.james:james-server-osgi3.0-M3-SNAPSHOT
[INFO] 
[INFO] --- maven-remote-resources-plugin:1.1:process (default) @ james-server-osgi ---
[INFO] [INFO] Using 'UTF-8' encoding to copy filtered resources.
[INFO] Copying 1 resource
[INFO] Copying 3 resources
[INFO] Copying 3 resources

[INFO] --- maven-resources-plugin:2.4:resources (default-resources) @ james-server-osgi ---
[INFO] [INFO] Nothing to compile - all classes are up to date

[INFO] --- maven-compiler-plugin:2.3.2:compile (default-compile) @ james-server-osgi ---
[INFO] 
[INFO] --- maven-bundle-plugin:2.1.0:manifest (bundle-manifest) @ james-server-osgi ---
[INFO] [INFO] Using 'UTF-8' encoding to copy filtered resources.
[INFO] skip non existing resourceDirectory <https://hudson.apache.org/hudson/job/james-server-trunk/org.apache.james$james-server-osgi/ws/src/test/resources>
[INFO] Copying 3 resources
[INFO] Copying 3 resources

[INFO] --- maven-resources-plugin:2.4:testResources (default-testResources) @ james-server-osgi
---
[INFO] [INFO] No sources to compile

[INFO] --- maven-compiler-plugin:2.3.2:testCompile (default-testCompile) @ james-server-osgi
---
[INFO] [INFO] Surefire report directory: <https://hudson.apache.org/hudson/job/james-server-trunk/org.apache.james$james-server-osgi/ws/target/surefire-reports>

[INFO] --- maven-surefire-plugin:2.4.3:test (default-test) @ james-server-osgi ---

-------------------------------------------------------
 T E S T S
-------------------------------------------------------
There are no tests to run.

Results :

Tests run: 0, Failures: 0, Errors: 0, Skipped: 0

[JENKINS] Recording test results
forkedProjectSucceeded org.apache.james:james-server-osgi3.0-M3-SNAPSHOT
mojo forkSucceeded org.apache.maven.plugins:maven-surefire-report-plugin:2.7.2(report:report)
mojo forkStarted org.apache.maven.plugins:maven-surefire-report-plugin:2.7.2(report:report-only)
mojo forkSucceeded org.apache.maven.plugins:maven-surefire-report-plugin:2.7.2(report:report-only)
[INFO] configuring report plugin org.apache.maven.plugins:maven-dependency-plugin:2.1
mojo forkStarted org.apache.maven.plugins:maven-dependency-plugin:2.1(report:analyze-report)
forkedProjectStarted org.apache.james:james-server-osgi3.0-M3-SNAPSHOT
[INFO] 
[INFO] --- maven-remote-resources-plugin:1.1:process (default) @ james-server-osgi ---
[INFO] [INFO] Using 'UTF-8' encoding to copy filtered resources.
[INFO] Copying 1 resource
[INFO] Copying 3 resources
[INFO] Copying 3 resources

[INFO] --- maven-resources-plugin:2.4:resources (default-resources) @ james-server-osgi ---
[INFO] [INFO] Nothing to compile - all classes are up to date

[INFO] --- maven-compiler-plugin:2.3.2:compile (default-compile) @ james-server-osgi ---
[INFO] 
[INFO] --- maven-bundle-plugin:2.1.0:manifest (bundle-manifest) @ james-server-osgi ---
[INFO] Using 'UTF-8' encoding to copy filtered resources.
[INFO] [INFO] skip non existing resourceDirectory <https://hudson.apache.org/hudson/job/james-server-trunk/org.apache.james$james-server-osgi/ws/src/test/resources>
[INFO] Copying 3 resources
[INFO] Copying 3 resources

[INFO] --- maven-resources-plugin:2.4:testResources (default-testResources) @ james-server-osgi
---
[INFO] [INFO] No sources to compile

[INFO] --- maven-compiler-plugin:2.3.2:testCompile (default-testCompile) @ james-server-osgi
---
forkedProjectSucceeded org.apache.james:james-server-osgi3.0-M3-SNAPSHOT


---------------------------------------------------------------------
To unsubscribe, e-mail: server-dev-unsubscribe@james.apache.org
For additional commands, e-mail: server-dev-help@james.apache.org


Mime
View raw message