james-server-dev mailing list archives

Site index · List index
Message view « Date » · « Thread »
Top « Date » · « Thread »
From Apache Hudson Server <hud...@hudson.apache.org>
Subject Build failed in Jenkins: mailbox-integration-tests #235
Date Thu, 07 Apr 2011 06:33:07 GMT
See <https://hudson.apache.org/hudson/job/mailbox-integration-tests/235/>

------------------------------------------
[...truncated 1697 lines...]
Expected: '\* 5 EXPUNGE'
Actual   : '* 6 EXPUNGE'
Running org.apache.james.mailbox.inmemory.imap.SelectedInboxTest
ID=2743768526927467764
ID=-6996079225785160084
ID=-2510944082770383889
ID=-1017350842875919658
ID=-3707021691305162891
ID=-7408935163358285853
ID=-7408935163358285853
ID=-7408935163358285853
ID=-7408935163358285853
ID=-3602085529397014145
ID=-3602085529397014145
ID=-3602085529397014145
ID=-3602085529397014145
ID=-5926038046159322959
ID=-4218213772869555453
ID=1188599433014289718
ID=1471995228205015013
ID=-6886256510039743175
ID=2467044073554857174
ID=-2133509060780438545
ID=573428191238358279
ID=-112602874572834825
ID=-2098698660279898828
ID=-6281126882029808769
ID=-7017194688401773231
ID=-5657316034104600753
ID=-5657316034104600753
ID=-5657316034104600753
ID=-5657316034104600753
ID=-1483388943471139621
ID=-1483388943471139621
ID=-1483388943471139621
ID=-1483388943471139621
ID=4528602067154865781
ID=-1429780906839482150
ID=-4991408627354451200
ID=6619503705852848926
ID=-6629780920736036573
ID=-1148458805976538603
ID=1256068448749461951
ID=3522606650932493783
ID=811549815914643090
ID=8993243578650163819
ID=-174907001354663216
ID=-6407164314303812690
ID=3867242204267731551
ID=3867242204267731551
ID=3867242204267731551
ID=3867242204267731551
ID=-6982832102610860160
ID=-6982832102610860160
ID=-6982832102610860160
ID=-6982832102610860160
ID=-3026684989031315098
ID=6696721749322299905
ID=7781331602514246486
ID=6224193872989421886
ID=5574957210821183495
ID=-6853585948689080817
ID=-3517589117103237664
Tests run: 42, Failures: 0, Errors: 0, Skipped: 0, Time elapsed: 0.985 sec
Running org.apache.james.mailbox.inmemory.imap.SelectTest
ID=-4837912400022666279
ID=-4837912400022666279
ID=-4837912400022666279
ID=-4837912400022666279
ID=-4837912400022666279
ID=-9128251714277619709
ID=-9128251714277619709
ID=-9128251714277619709
ID=-9128251714277619709
ID=-9128251714277619709
ID=-3552098140202162226
ID=-3552098140202162226
ID=-3552098140202162226
ID=-3552098140202162226
ID=-3552098140202162226
Tests run: 3, Failures: 0, Errors: 0, Skipped: 0, Time elapsed: 0.625 sec
Running org.apache.james.mailbox.inmemory.imap.NonAuthenticatedStateTest
Tests run: 21, Failures: 0, Errors: 0, Skipped: 0, Time elapsed: 0.367 sec
Running org.apache.james.mailbox.inmemory.imap.FetchTest
ID=5095896085381239786
ID=5146427691814985618
ID=216529341969610183
ID=8426753146680579244
ID=-6690105595469463305
ID=-7059362826990893969
ID=-4848714709642789772
ID=763366037457156215
ID=-5090069099599583107
ID=-3386875247288149088
ID=5014435034062294670
ID=1217236297638447624
ID=-1445551947076202140
ID=-3806096670701362932
ID=5615495201788132605
ID=-1720571137042837687
ID=-6080469647083170155
ID=4366304100063863964
ID=-6141046994816865110
ID=-6955417089737629151
ID=-8160435258149460233
ID=6929952465246980662
ID=6929952465246980662
ID=-1781298735119935061
ID=-1781298735119935061
ID=-2729764084168064282
ID=-2729764084168064282
Tests run: 24, Failures: 0, Errors: 0, Skipped: 0, Time elapsed: 1.074 sec
Running org.apache.james.mailbox.inmemory.imap.FetchBodyStructureTest
ID=8588965439066096090
ID=8588965439066096090
ID=-7745549478017361986
ID=-7745549478017361986
ID=3187702843442181076
ID=3187702843442181076
ID=3508768516581910677
ID=3508768516581910677
ID=852732153681724072
ID=852732153681724072
ID=1714364242320450293
ID=1714364242320450293
ID=3273567235596128287
ID=3273567235596128287
ID=1695352531261052493
ID=1695352531261052493
ID=8106191542294876762
ID=8106191542294876762
ID=3345787789453297174
ID=3345787789453297174
ID=-5837226891468640637
ID=-5837226891468640637
ID=-8021738255520478723
ID=-8021738255520478723
Tests run: 12, Failures: 0, Errors: 0, Skipped: 0, Time elapsed: 1.772 sec
Running org.apache.james.mailbox.inmemory.imap.FetchHeadersTest
ID=6505090435273258511
ID=6505090435273258511
ID=-601376461911200429
ID=-601376461911200429
ID=5513891140747007356
ID=5513891140747007356
ID=6714501507497801695
ID=6714501507497801695
ID=5929943963996540534
ID=5929943963996540534
ID=-3907922492162912352
ID=-3907922492162912352
Tests run: 6, Failures: 0, Errors: 0, Skipped: 0, Time elapsed: 0.788 sec
Running org.apache.james.mailbox.inmemory.imap.EventTest
ID=1134004189498602547
ID=1134004189498602547
ID=-1520165479177049385
ID=-1520165479177049385
ID=-7532638749029194374
ID=-7532638749029194374
Tests run: 3, Failures: 0, Errors: 0, Skipped: 0, Time elapsed: 0.596 sec
Running org.apache.james.mailbox.inmemory.imap.PartialFetchTest
ID=2813536465670582869
ID=2813536465670582869
ID=-8114555833248860254
ID=-8114555833248860254
ID=2742813460732721302
ID=2742813460732721302
ID=-2847167579536353737
ID=-2847167579536353737
ID=-7011854880303317476
ID=-7011854880303317476
ID=-3610399748962762342
ID=-3610399748962762342
ID=1700988435354392076
ID=1700988435354392076
ID=-1993896644211385127
ID=-1993896644211385127
ID=5647303069887485371
ID=5647303069887485371
ID=2570517426827793524
ID=2570517426827793524
ID=-5499178267242387693
ID=-5499178267242387693
ID=-5487596156516197396
ID=-5487596156516197396
Tests run: 12, Failures: 0, Errors: 0, Skipped: 0, Time elapsed: 1.013 sec

Results :

Tests in error: 

Tests run: 1158, Failures: 0, Errors: 48, Skipped: 0

mojoFailed org.apache.maven.plugins:maven-surefire-plugin:2.7.2(default-test)
[JENKINS] Recording test results
projectFailed org.apache.james:apache-james-mailbox-integration-tester:0.2-M2-SNAPSHOT
[JENKINS] Archiving <https://hudson.apache.org/hudson/job/mailbox-integration-tests/ws/pom.xml>
to /home/hudson/hudson/jobs/mailbox-integration-tests/modules/org.apache.james$apache-james-mailbox-integration-tester/builds/2011-04-07_06-25-12/archive/org.apache.james/apache-james-mailbox-integration-tester/0.2-M2-SNAPSHOT/pom.xml
sessionEnded
[INFO] ------------------------------------------------------------------------
[INFO] BUILD FAILURE
[INFO] ------------------------------------------------------------------------
[INFO] Total time: 7:39.587s
[INFO] Finished at: Wed Apr 06 22:33:02 GMT-08:00 2011
[INFO] Final Memory: 20M/169M
[INFO] ------------------------------------------------------------------------
maven builder waiting
mavenExecutionResult exceptions not empty
org.apache.maven.lifecycle.LifecycleExecutionException: Failed to execute goal org.apache.maven.plugins:maven-surefire-plugin:2.7.2:test
(default-test) on project apache-james-mailbox-integration-tester: There are test failures.

Please refer to <https://hudson.apache.org/hudson/job/mailbox-integration-tests/ws/target/surefire-reports>
for the individual test results.
	at org.apache.maven.lifecycle.internal.MojoExecutor.execute(MojoExecutor.java:213)
	at org.apache.maven.lifecycle.internal.MojoExecutor.execute(MojoExecutor.java:153)
	at org.apache.maven.lifecycle.internal.MojoExecutor.execute(MojoExecutor.java:145)
	at org.apache.maven.lifecycle.internal.LifecycleModuleBuilder.buildProject(LifecycleModuleBuilder.java:84)
	at org.apache.maven.lifecycle.internal.LifecycleModuleBuilder.buildProject(LifecycleModuleBuilder.java:59)
	at org.apache.maven.lifecycle.internal.LifecycleStarter.singleThreadedBuild(LifecycleStarter.java:183)
	at org.apache.maven.lifecycle.internal.LifecycleStarter.execute(LifecycleStarter.java:161)
	at org.apache.maven.DefaultMaven.doExecute(DefaultMaven.java:319)
	at org.apache.maven.DefaultMaven.execute(DefaultMaven.java:156)
	at org.jvnet.hudson.maven3.launcher.Maven3Launcher.main(Maven3Launcher.java:79)
	at sun.reflect.NativeMethodAccessorImpl.invoke0(Native Method)
	at sun.reflect.NativeMethodAccessorImpl.invoke(NativeMethodAccessorImpl.java:39)
	at sun.reflect.DelegatingMethodAccessorImpl.invoke(DelegatingMethodAccessorImpl.java:25)
	at java.lang.reflect.Method.invoke(Method.java:592)
	at org.codehaus.plexus.classworlds.launcher.Launcher.launchStandard(Launcher.java:329)
	at org.codehaus.plexus.classworlds.launcher.Launcher.launch(Launcher.java:239)
	at org.jvnet.hudson.maven3.agent.Maven3Main.launch(Maven3Main.java:146)
	at hudson.maven.Maven3Builder.call(Maven3Builder.java:124)
	at hudson.maven.Maven3Builder.call(Maven3Builder.java:71)
	at hudson.remoting.UserRequest.perform(UserRequest.java:114)
	at hudson.remoting.UserRequest.perform(UserRequest.java:48)
	at hudson.remoting.Request$2.run(Request.java:270)
	at java.util.concurrent.Executors$RunnableAdapter.call(Executors.java:417)
	at java.util.concurrent.FutureTask$Sync.innerRun(FutureTask.java:269)
	at java.util.concurrent.FutureTask.run(FutureTask.java:123)
	at java.util.concurrent.ThreadPoolExecutor$Worker.runTask(ThreadPoolExecutor.java:651)
	at java.util.concurrent.ThreadPoolExecutor$Worker.run(ThreadPoolExecutor.java:676)
	at java.lang.Thread.run(Thread.java:595)
Caused by: org.apache.maven.plugin.MojoFailureException: There are test failures.

Please refer to <https://hudson.apache.org/hudson/job/mailbox-integration-tests/ws/target/surefire-reports>
for the individual test results.
	at org.apache.maven.plugin.surefire.SurefireHelper.reportExecution(SurefireHelper.java:74)
	at org.apache.maven.plugin.surefire.SurefirePlugin.execute(SurefirePlugin.java:642)
	at org.apache.maven.plugin.DefaultBuildPluginManager.executeMojo(DefaultBuildPluginManager.java:101)
	at org.apache.maven.lifecycle.internal.MojoExecutor.execute(MojoExecutor.java:209)
	... 27 more
Maven failed with error.
Sending e-mails to: server-dev@james.apache.org
channel stopped


---------------------------------------------------------------------
To unsubscribe, e-mail: server-dev-unsubscribe@james.apache.org
For additional commands, e-mail: server-dev-help@james.apache.org


Mime
View raw message