james-server-dev mailing list archives

Site index · List index
Message view « Date » · « Thread »
Top « Date » · « Thread »
From Apache Hudson Server <hud...@hudson.apache.org>
Subject Build failed in Jenkins: mailbox-integration-tests #236
Date Thu, 07 Apr 2011 06:54:33 GMT
See <https://hudson.apache.org/hudson/job/mailbox-integration-tests/236/>

------------------------------------------
[...truncated 1680 lines...]
Expected: '\* 5 EXPUNGE'
Actual   : '* 6 EXPUNGE'
Running org.apache.james.mailbox.inmemory.imap.SelectedInboxTest
ID=6495836635851200354
ID=-2008530499126266115
ID=8233208573635064039
ID=-6563107466596508587
ID=-447711975829950684
ID=-4930017252992311119
ID=-4930017252992311119
ID=-4930017252992311119
ID=-4930017252992311119
ID=5801792635348050691
ID=5801792635348050691
ID=5801792635348050691
ID=5801792635348050691
ID=-8125126827692079856
ID=4162493100570534883
ID=-1050024938302085363
ID=1304851586583260666
ID=-3355483542326448405
ID=-8151874494193033970
ID=3379677535851826232
ID=-352213317696160208
ID=1963978973719582873
ID=300070486821019595
ID=-280279643243648910
ID=-8116265292786150413
ID=-5671061607300481419
ID=-5671061607300481419
ID=-5671061607300481419
ID=-5671061607300481419
ID=-8515438108603476994
ID=-8515438108603476994
ID=-8515438108603476994
ID=-8515438108603476994
ID=6998677579608700261
ID=-1635657568029866349
ID=-5172757475860661023
ID=9018269207565273005
ID=3339878970159304402
ID=-4173316641605854665
ID=2522899768959252884
ID=5482261956171207942
ID=2595708246537543924
ID=-8041718776743830807
ID=-7498650321525747646
ID=146644913011212493
ID=-7556019665765395542
ID=-7556019665765395542
ID=-7556019665765395542
ID=-7556019665765395542
ID=7070167640780662521
ID=7070167640780662521
ID=7070167640780662521
ID=7070167640780662521
ID=6911586020879388687
ID=-662067950986666347
ID=3598646780994231708
ID=-154910288513368773
ID=-335124958926100374
ID=1570019515754466367
ID=2120999203124589041
Tests run: 42, Failures: 0, Errors: 0, Skipped: 0, Time elapsed: 0.925 sec
Running org.apache.james.mailbox.inmemory.imap.SelectTest
ID=4155238162398857217
ID=4155238162398857217
ID=4155238162398857217
ID=4155238162398857217
ID=4155238162398857217
ID=4922172524427400899
ID=4922172524427400899
ID=4922172524427400899
ID=4922172524427400899
ID=4922172524427400899
ID=5702834645101110882
ID=5702834645101110882
ID=5702834645101110882
ID=5702834645101110882
ID=5702834645101110882
Tests run: 3, Failures: 0, Errors: 0, Skipped: 0, Time elapsed: 0.622 sec
Running org.apache.james.mailbox.inmemory.imap.NonAuthenticatedStateTest
Tests run: 21, Failures: 0, Errors: 0, Skipped: 0, Time elapsed: 0.377 sec
Running org.apache.james.mailbox.inmemory.imap.FetchTest
ID=-6355197847204314459
ID=-5342621035744825929
ID=-7524110882728436572
ID=1386252351998400073
ID=5344736059910177688
ID=2807446262890618391
ID=3408052574620118622
ID=-2781117037465298275
ID=-361689460155235053
ID=-1879906931268158824
ID=5568939087650861332
ID=1978281735262033413
ID=-565247462825775874
ID=6624987817401712162
ID=-5445375267452545875
ID=5415495653196664171
ID=6267204065582839103
ID=-2424690121610643554
ID=-2956689407076999919
ID=4429457203509467575
ID=-5309192812150248512
ID=-6411655039776945677
ID=-6411655039776945677
ID=-5934334475227427946
ID=-5934334475227427946
ID=-232708341439252897
ID=-232708341439252897
Tests run: 24, Failures: 0, Errors: 0, Skipped: 0, Time elapsed: 1.102 sec
Running org.apache.james.mailbox.inmemory.imap.FetchBodyStructureTest
ID=-101339889166831781
ID=-101339889166831781
ID=-5944693394062828705
ID=-5944693394062828705
ID=-5545895678526651902
ID=-5545895678526651902
ID=4711180087121677755
ID=4711180087121677755
ID=144849355963992306
ID=144849355963992306
ID=-3872556109817634801
ID=-3872556109817634801
ID=4175321369719344657
ID=4175321369719344657
ID=-6957210673702449936
ID=-6957210673702449936
ID=-8935687161381473606
ID=-8935687161381473606
ID=1093222856422361548
ID=1093222856422361548
ID=8426438654115918902
ID=8426438654115918902
ID=-2818954348503969848
ID=-2818954348503969848
Tests run: 12, Failures: 0, Errors: 0, Skipped: 0, Time elapsed: 1.669 sec
Running org.apache.james.mailbox.inmemory.imap.FetchHeadersTest
ID=-5736501552275230086
ID=-5736501552275230086
ID=7272670796355822103
ID=7272670796355822103
ID=-5376044904857371977
ID=-5376044904857371977
ID=-2020928881424877795
ID=-2020928881424877795
ID=4114273115036344690
ID=4114273115036344690
ID=-2044217321582533226
ID=-2044217321582533226
Tests run: 6, Failures: 0, Errors: 0, Skipped: 0, Time elapsed: 0.885 sec
Running org.apache.james.mailbox.inmemory.imap.EventTest
ID=2032533462235877622
ID=2032533462235877622
ID=7318910202820966125
ID=7318910202820966125
ID=57169276538259703
ID=57169276538259703
Tests run: 3, Failures: 0, Errors: 0, Skipped: 0, Time elapsed: 0.607 sec
Running org.apache.james.mailbox.inmemory.imap.PartialFetchTest
ID=-2190139357993823829
ID=-2190139357993823829
ID=1900365542158573762
ID=1900365542158573762
ID=-1516798131820367671
ID=-1516798131820367671
ID=5277652337853641699
ID=5277652337853641699
ID=2007497956008593568
ID=2007497956008593568
ID=8542689616124028814
ID=8542689616124028814
ID=-950674749483336987
ID=-950674749483336987
ID=3477926104688019000
ID=3477926104688019000
ID=-4279480648003960565
ID=-4279480648003960565
ID=-8091787027172007958
ID=-8091787027172007958
ID=-3084142871865457224
ID=-3084142871865457224
ID=3643932565639102502
ID=3643932565639102502
Tests run: 12, Failures: 0, Errors: 0, Skipped: 0, Time elapsed: 1.035 sec

Results :

Tests in error: 

Tests run: 1158, Failures: 0, Errors: 48, Skipped: 0

mojoFailed org.apache.maven.plugins:maven-surefire-plugin:2.7.2(default-test)
[JENKINS] Recording test results
projectFailed org.apache.james:apache-james-mailbox-integration-tester:0.2-M2-SNAPSHOT
[JENKINS] Archiving <https://hudson.apache.org/hudson/job/mailbox-integration-tests/ws/pom.xml>
to /home/hudson/hudson/jobs/mailbox-integration-tests/modules/org.apache.james$apache-james-mailbox-integration-tester/builds/2011-04-07_06-46-32/archive/org.apache.james/apache-james-mailbox-integration-tester/0.2-M2-SNAPSHOT/pom.xml
sessionEnded
[INFO] ------------------------------------------------------------------------
[INFO] BUILD FAILURE
[INFO] ------------------------------------------------------------------------
[INFO] Total time: 7:45.280s
[INFO] Finished at: Wed Apr 06 22:54:28 GMT-08:00 2011
[INFO] Final Memory: 20M/190M
[INFO] ------------------------------------------------------------------------
maven builder waiting
mavenExecutionResult exceptions not empty
org.apache.maven.lifecycle.LifecycleExecutionException: Failed to execute goal org.apache.maven.plugins:maven-surefire-plugin:2.7.2:test
(default-test) on project apache-james-mailbox-integration-tester: There are test failures.

Please refer to <https://hudson.apache.org/hudson/job/mailbox-integration-tests/ws/target/surefire-reports>
for the individual test results.
	at org.apache.maven.lifecycle.internal.MojoExecutor.execute(MojoExecutor.java:213)
	at org.apache.maven.lifecycle.internal.MojoExecutor.execute(MojoExecutor.java:153)
	at org.apache.maven.lifecycle.internal.MojoExecutor.execute(MojoExecutor.java:145)
	at org.apache.maven.lifecycle.internal.LifecycleModuleBuilder.buildProject(LifecycleModuleBuilder.java:84)
	at org.apache.maven.lifecycle.internal.LifecycleModuleBuilder.buildProject(LifecycleModuleBuilder.java:59)
	at org.apache.maven.lifecycle.internal.LifecycleStarter.singleThreadedBuild(LifecycleStarter.java:183)
	at org.apache.maven.lifecycle.internal.LifecycleStarter.execute(LifecycleStarter.java:161)
	at org.apache.maven.DefaultMaven.doExecute(DefaultMaven.java:319)
	at org.apache.maven.DefaultMaven.execute(DefaultMaven.java:156)
	at org.jvnet.hudson.maven3.launcher.Maven3Launcher.main(Maven3Launcher.java:79)
	at sun.reflect.NativeMethodAccessorImpl.invoke0(Native Method)
	at sun.reflect.NativeMethodAccessorImpl.invoke(NativeMethodAccessorImpl.java:39)
	at sun.reflect.DelegatingMethodAccessorImpl.invoke(DelegatingMethodAccessorImpl.java:25)
	at java.lang.reflect.Method.invoke(Method.java:592)
	at org.codehaus.plexus.classworlds.launcher.Launcher.launchStandard(Launcher.java:329)
	at org.codehaus.plexus.classworlds.launcher.Launcher.launch(Launcher.java:239)
	at org.jvnet.hudson.maven3.agent.Maven3Main.launch(Maven3Main.java:146)
	at hudson.maven.Maven3Builder.call(Maven3Builder.java:124)
	at hudson.maven.Maven3Builder.call(Maven3Builder.java:71)
	at hudson.remoting.UserRequest.perform(UserRequest.java:114)
	at hudson.remoting.UserRequest.perform(UserRequest.java:48)
	at hudson.remoting.Request$2.run(Request.java:270)
	at java.util.concurrent.Executors$RunnableAdapter.call(Executors.java:417)
	at java.util.concurrent.FutureTask$Sync.innerRun(FutureTask.java:269)
	at java.util.concurrent.FutureTask.run(FutureTask.java:123)
	at java.util.concurrent.ThreadPoolExecutor$Worker.runTask(ThreadPoolExecutor.java:651)
	at java.util.concurrent.ThreadPoolExecutor$Worker.run(ThreadPoolExecutor.java:676)
	at java.lang.Thread.run(Thread.java:595)
Caused by: org.apache.maven.plugin.MojoFailureException: There are test failures.

Please refer to <https://hudson.apache.org/hudson/job/mailbox-integration-tests/ws/target/surefire-reports>
for the individual test results.
	at org.apache.maven.plugin.surefire.SurefireHelper.reportExecution(SurefireHelper.java:74)
	at org.apache.maven.plugin.surefire.SurefirePlugin.execute(SurefirePlugin.java:642)
	at org.apache.maven.plugin.DefaultBuildPluginManager.executeMojo(DefaultBuildPluginManager.java:101)
	at org.apache.maven.lifecycle.internal.MojoExecutor.execute(MojoExecutor.java:209)
	... 27 more
Maven failed with error.
Sending e-mails to: server-dev@james.apache.org
channel stopped


---------------------------------------------------------------------
To unsubscribe, e-mail: server-dev-unsubscribe@james.apache.org
For additional commands, e-mail: server-dev-help@james.apache.org


Mime
View raw message