james-server-dev mailing list archives

Site index · List index
Message view « Date » · « Thread »
Top « Date » · « Thread »
From Apache Hudson Server <hud...@hudson.apache.org>
Subject Build failed in Jenkins: mailbox-integration-tests #240
Date Fri, 08 Apr 2011 01:45:50 GMT
See <https://hudson.apache.org/hudson/job/mailbox-integration-tests/240/>

------------------------------------------
[...truncated 4121 lines...]
Actual   : '* OK [UIDVALIDITY 969270630] UIDs valid'
Running org.apache.james.mailbox.inmemory.imap.FetchBodyStructureTest
ID=3181546159952336814
ID=5779854061839203102
ID=-5293115647819162776
ID=-5111453707461888094
ID=4058886384823664630
ID=-1057392390867229663
ID=-2452468157780725259
ID=3566493092436837335
ID=-6314254279006945471
ID=-7974201151563455679
ID=3148551656221452024
ID=-5398068860261455843
Tests run: 12, Failures: 0, Errors: 12, Skipped: 0, Time elapsed: 0.754 sec <<< FAILURE!
Location: /org/apache/james/imap/scripts/SelectedStateSetup.test:76
LastClientMsg: a1 SELECT selected
Expected: '\* OK \[UIDVALIDITY \d+\]'
Actual   : '* OK [UIDVALIDITY 406133297] UIDs valid'
Location: /org/apache/james/imap/scripts/SelectedStateSetup.test:76
LastClientMsg: a1 SELECT selected
Expected: '\* OK \[UIDVALIDITY \d+\]'
Actual   : '* OK [UIDVALIDITY 1822295114] UIDs valid'
Location: /org/apache/james/imap/scripts/SelectedStateSetup.test:76
LastClientMsg: a1 SELECT selected
Expected: '\* OK \[UIDVALIDITY \d+\]'
Actual   : '* OK [UIDVALIDITY 909113037] UIDs valid'
Location: /org/apache/james/imap/scripts/SelectedStateSetup.test:76
LastClientMsg: a1 SELECT selected
Expected: '\* OK \[UIDVALIDITY \d+\]'
Actual   : '* OK [UIDVALIDITY 1257471916] UIDs valid'
Location: /org/apache/james/imap/scripts/SelectedStateSetup.test:76
LastClientMsg: a1 SELECT selected
Expected: '\* OK \[UIDVALIDITY \d+\]'
Actual   : '* OK [UIDVALIDITY 1903638133] UIDs valid'
Location: /org/apache/james/imap/scripts/SelectedStateSetup.test:76
LastClientMsg: a1 SELECT selected
Expected: '\* OK \[UIDVALIDITY \d+\]'
Actual   : '* OK [UIDVALIDITY 973903962] UIDs valid'
Location: /org/apache/james/imap/scripts/SelectedStateSetup.test:76
LastClientMsg: a1 SELECT selected
Expected: '\* OK \[UIDVALIDITY \d+\]'
Actual   : '* OK [UIDVALIDITY 1617827092] UIDs valid'
Location: /org/apache/james/imap/scripts/SelectedStateSetup.test:76
LastClientMsg: a1 SELECT selected
Expected: '\* OK \[UIDVALIDITY \d+\]'
Actual   : '* OK [UIDVALIDITY 1774081131] UIDs valid'
Location: /org/apache/james/imap/scripts/SelectedStateSetup.test:76
LastClientMsg: a1 SELECT selected
Expected: '\* OK \[UIDVALIDITY \d+\]'
Actual   : '* OK [UIDVALIDITY 437955507] UIDs valid'
Location: /org/apache/james/imap/scripts/SelectedStateSetup.test:76
LastClientMsg: a1 SELECT selected
Expected: '\* OK \[UIDVALIDITY \d+\]'
Actual   : '* OK [UIDVALIDITY 251052875] UIDs valid'
Location: /org/apache/james/imap/scripts/SelectedStateSetup.test:76
LastClientMsg: a1 SELECT selected
Expected: '\* OK \[UIDVALIDITY \d+\]'
Actual   : '* OK [UIDVALIDITY 63476706] UIDs valid'
Location: /org/apache/james/imap/scripts/SelectedStateSetup.test:76
LastClientMsg: a1 SELECT selected
Expected: '\* OK \[UIDVALIDITY \d+\]'
Actual   : '* OK [UIDVALIDITY 1832737500] UIDs valid'
Running org.apache.james.mailbox.inmemory.imap.FetchHeadersTest
ID=2864662223422352517
ID=4549227355148749718
ID=-4445878141316175531
ID=-5495303803004152611
ID=-1845899273884235935
ID=-7945619144774528346
Tests run: 6, Failures: 0, Errors: 6, Skipped: 0, Time elapsed: 0.623 sec <<< FAILURE!
Location: /org/apache/james/imap/scripts/SelectedStateSetup.test:76
LastClientMsg: a1 SELECT selected
Expected: '\* OK \[UIDVALIDITY \d+\]'
Actual   : '* OK [UIDVALIDITY 210136922] UIDs valid'
Location: /org/apache/james/imap/scripts/SelectedStateSetup.test:76
LastClientMsg: a1 SELECT selected
Expected: '\* OK \[UIDVALIDITY \d+\]'
Actual   : '* OK [UIDVALIDITY 1570579036] UIDs valid'
Location: /org/apache/james/imap/scripts/SelectedStateSetup.test:76
LastClientMsg: a1 SELECT selected
Expected: '\* OK \[UIDVALIDITY \d+\]'
Actual   : '* OK [UIDVALIDITY 1186680142] UIDs valid'
Location: /org/apache/james/imap/scripts/SelectedStateSetup.test:76
LastClientMsg: a1 SELECT selected
Expected: '\* OK \[UIDVALIDITY \d+\]'
Actual   : '* OK [UIDVALIDITY 902678784] UIDs valid'
Location: /org/apache/james/imap/scripts/SelectedStateSetup.test:76
LastClientMsg: a1 SELECT selected
Expected: '\* OK \[UIDVALIDITY \d+\]'
Actual   : '* OK [UIDVALIDITY 1818348340] UIDs valid'
Location: /org/apache/james/imap/scripts/SelectedStateSetup.test:76
LastClientMsg: a1 SELECT selected
Expected: '\* OK \[UIDVALIDITY \d+\]'
Actual   : '* OK [UIDVALIDITY 453460965] UIDs valid'
Running org.apache.james.mailbox.inmemory.imap.EventTest
ID=8649683188339636898
ID=8572902905770283898
ID=-836700254709558769
Tests run: 3, Failures: 0, Errors: 3, Skipped: 0, Time elapsed: 0.573 sec <<< FAILURE!
Location: /org/apache/james/imap/scripts/SelectedStateSetup.test:76
LastClientMsg: a1 SELECT selected
Expected: '\* OK \[UIDVALIDITY \d+\]'
Actual   : '* OK [UIDVALIDITY 1685719533] UIDs valid'
Location: /org/apache/james/imap/scripts/SelectedStateSetup.test:76
LastClientMsg: a1 SELECT selected
Expected: '\* OK \[UIDVALIDITY \d+\]'
Actual   : '* OK [UIDVALIDITY 1611305584] UIDs valid'
Location: /org/apache/james/imap/scripts/SelectedStateSetup.test:76
LastClientMsg: a1 SELECT selected
Expected: '\* OK \[UIDVALIDITY \d+\]'
Actual   : '* OK [UIDVALIDITY 1502171861] UIDs valid'
Running org.apache.james.mailbox.inmemory.imap.PartialFetchTest
ID=-4145215298451261600
ID=6381374730759767727
ID=5797913769426477758
ID=7720758602400616915
ID=-3691806770993692345
ID=-6773163972581846009
ID=-3903832065294417642
ID=1720237294822113801
ID=-4175436181905731191
ID=4180641422531328469
ID=6455816294327874365
ID=5144776385307792040
Tests run: 12, Failures: 0, Errors: 12, Skipped: 0, Time elapsed: 0.692 sec <<< FAILURE!

Results :

Tests in error: 
  testBodyPartialFetchUS(org.apache.james.mailbox.inmemory.imap.PartialFetchTest): 
Location: /org/apache/james/imap/scripts/SelectedStateSetup.test:76
LastClientMsg: a1 SELECT selected
Expected: '\* OK \[UIDVALIDITY \d+\]'
Actual   : '* OK [UIDVALIDITY 254968821] UIDs valid'
  testBodyPartialFetchIT(org.apache.james.mailbox.inmemory.imap.PartialFetchTest): 
Location: /org/apache/james/imap/scripts/SelectedStateSetup.test:76
LastClientMsg: a1 SELECT selected
Expected: '\* OK \[UIDVALIDITY \d+\]'
Actual   : '* OK [UIDVALIDITY 1949225704] UIDs valid'
  testBodyPartialFetchKO(org.apache.james.mailbox.inmemory.imap.PartialFetchTest): 
Location: /org/apache/james/imap/scripts/SelectedStateSetup.test:76
LastClientMsg: a1 SELECT selected
Expected: '\* OK \[UIDVALIDITY \d+\]'
Actual   : '* OK [UIDVALIDITY 2071818573] UIDs valid'
  testTextPartialFetchUS(org.apache.james.mailbox.inmemory.imap.PartialFetchTest): 
Location: /org/apache/james/imap/scripts/SelectedStateSetup.test:76
LastClientMsg: a1 SELECT selected
Expected: '\* OK \[UIDVALIDITY \d+\]'
Actual   : '* OK [UIDVALIDITY 362216533] UIDs valid'
  testTextPartialFetchKO(org.apache.james.mailbox.inmemory.imap.PartialFetchTest): 
Location: /org/apache/james/imap/scripts/SelectedStateSetup.test:76
LastClientMsg: a1 SELECT selected
Expected: '\* OK \[UIDVALIDITY \d+\]'
Actual   : '* OK [UIDVALIDITY 24696950] UIDs valid'
  testTextPartialFetchIT(org.apache.james.mailbox.inmemory.imap.PartialFetchTest): 
Location: /org/apache/james/imap/scripts/SelectedStateSetup.test:76
LastClientMsg: a1 SELECT selected
Expected: '\* OK \[UIDVALIDITY \d+\]'
Actual   : '* OK [UIDVALIDITY 50827119] UIDs valid'
  testMimePartialFetchUS(org.apache.james.mailbox.inmemory.imap.PartialFetchTest): 
Location: /org/apache/james/imap/scripts/SelectedStateSetup.test:76
LastClientMsg: a1 SELECT selected
Expected: '\* OK \[UIDVALIDITY \d+\]'
Actual   : '* OK [UIDVALIDITY 1362125816] UIDs valid'
  testMimePartialFetchIT(org.apache.james.mailbox.inmemory.imap.PartialFetchTest): 
Location: /org/apache/james/imap/scripts/SelectedStateSetup.test:76
LastClientMsg: a1 SELECT selected
Expected: '\* OK \[UIDVALIDITY \d+\]'
Actual   : '* OK [UIDVALIDITY 1113332979] UIDs valid'
  testMimePartialFetchKO(org.apache.james.mailbox.inmemory.imap.PartialFetchTest): 
Location: /org/apache/james/imap/scripts/SelectedStateSetup.test:76
LastClientMsg: a1 SELECT selected
Expected: '\* OK \[UIDVALIDITY \d+\]'
Actual   : '* OK [UIDVALIDITY 474045685] UIDs valid'
  testHeaderPartialFetchUS(org.apache.james.mailbox.inmemory.imap.PartialFetchTest): 
Location: /org/apache/james/imap/scripts/SelectedStateSetup.test:76
LastClientMsg: a1 SELECT selected
Expected: '\* OK \[UIDVALIDITY \d+\]'
Actual   : '* OK [UIDVALIDITY 1902727870] UIDs valid'
  testHeaderPartialFetchIT(org.apache.james.mailbox.inmemory.imap.PartialFetchTest): 
Location: /org/apache/james/imap/scripts/SelectedStateSetup.test:76
LastClientMsg: a1 SELECT selected
Expected: '\* OK \[UIDVALIDITY \d+\]'
Actual   : '* OK [UIDVALIDITY 131295352] UIDs valid'
  testHeaderPartialFetchKO(org.apache.james.mailbox.inmemory.imap.PartialFetchTest): 
Location: /org/apache/james/imap/scripts/SelectedStateSetup.test:76
LastClientMsg: a1 SELECT selected
Expected: '\* OK \[UIDVALIDITY \d+\]'
Actual   : '* OK [UIDVALIDITY 1062710428] UIDs valid'

Tests run: 1158, Failures: 0, Errors: 807, Skipped: 0

mojoFailed org.apache.maven.plugins:maven-surefire-plugin:2.7.2(default-test)
[JENKINS] Recording test results
projectFailed org.apache.james:apache-james-mailbox-integration-tester:0.2-M2-SNAPSHOT
[JENKINS] Archiving <https://hudson.apache.org/hudson/job/mailbox-integration-tests/ws/pom.xml>
to /home/hudson/hudson/jobs/mailbox-integration-tests/modules/org.apache.james$apache-james-mailbox-integration-tester/builds/2011-04-08_01-39-14/archive/org.apache.james/apache-james-mailbox-integration-tester/0.2-M2-SNAPSHOT/pom.xml
sessionEnded
[INFO] ------------------------------------------------------------------------
[INFO] BUILD FAILURE
[INFO] ------------------------------------------------------------------------
[INFO] Total time: 6:19.478s
[INFO] Finished at: Thu Apr 07 17:45:45 GMT-08:00 2011
[INFO] Final Memory: 29M/172M
[INFO] ------------------------------------------------------------------------
maven builder waiting
mavenExecutionResult exceptions not empty
org.apache.maven.lifecycle.LifecycleExecutionException: Failed to execute goal org.apache.maven.plugins:maven-surefire-plugin:2.7.2:test
(default-test) on project apache-james-mailbox-integration-tester: There are test failures.

Please refer to <https://hudson.apache.org/hudson/job/mailbox-integration-tests/ws/target/surefire-reports>
for the individual test results.
	at org.apache.maven.lifecycle.internal.MojoExecutor.execute(MojoExecutor.java:213)
	at org.apache.maven.lifecycle.internal.MojoExecutor.execute(MojoExecutor.java:153)
	at org.apache.maven.lifecycle.internal.MojoExecutor.execute(MojoExecutor.java:145)
	at org.apache.maven.lifecycle.internal.LifecycleModuleBuilder.buildProject(LifecycleModuleBuilder.java:84)
	at org.apache.maven.lifecycle.internal.LifecycleModuleBuilder.buildProject(LifecycleModuleBuilder.java:59)
	at org.apache.maven.lifecycle.internal.LifecycleStarter.singleThreadedBuild(LifecycleStarter.java:183)
	at org.apache.maven.lifecycle.internal.LifecycleStarter.execute(LifecycleStarter.java:161)
	at org.apache.maven.DefaultMaven.doExecute(DefaultMaven.java:319)
	at org.apache.maven.DefaultMaven.execute(DefaultMaven.java:156)
	at org.jvnet.hudson.maven3.launcher.Maven3Launcher.main(Maven3Launcher.java:79)
	at sun.reflect.NativeMethodAccessorImpl.invoke0(Native Method)
	at sun.reflect.NativeMethodAccessorImpl.invoke(NativeMethodAccessorImpl.java:39)
	at sun.reflect.DelegatingMethodAccessorImpl.invoke(DelegatingMethodAccessorImpl.java:25)
	at java.lang.reflect.Method.invoke(Method.java:592)
	at org.codehaus.plexus.classworlds.launcher.Launcher.launchStandard(Launcher.java:329)
	at org.codehaus.plexus.classworlds.launcher.Launcher.launch(Launcher.java:239)
	at org.jvnet.hudson.maven3.agent.Maven3Main.launch(Maven3Main.java:146)
	at hudson.maven.Maven3Builder.call(Maven3Builder.java:124)
	at hudson.maven.Maven3Builder.call(Maven3Builder.java:71)
	at hudson.remoting.UserRequest.perform(UserRequest.java:114)
	at hudson.remoting.UserRequest.perform(UserRequest.java:48)
	at hudson.remoting.Request$2.run(Request.java:270)
	at java.util.concurrent.Executors$RunnableAdapter.call(Executors.java:417)
	at java.util.concurrent.FutureTask$Sync.innerRun(FutureTask.java:269)
	at java.util.concurrent.FutureTask.run(FutureTask.java:123)
	at java.util.concurrent.ThreadPoolExecutor$Worker.runTask(ThreadPoolExecutor.java:651)
	at java.util.concurrent.ThreadPoolExecutor$Worker.run(ThreadPoolExecutor.java:676)
	at java.lang.Thread.run(Thread.java:595)
Caused by: org.apache.maven.plugin.MojoFailureException: There are test failures.

Please refer to <https://hudson.apache.org/hudson/job/mailbox-integration-tests/ws/target/surefire-reports>
for the individual test results.
	at org.apache.maven.plugin.surefire.SurefireHelper.reportExecution(SurefireHelper.java:74)
	at org.apache.maven.plugin.surefire.SurefirePlugin.execute(SurefirePlugin.java:642)
	at org.apache.maven.plugin.DefaultBuildPluginManager.executeMojo(DefaultBuildPluginManager.java:101)
	at org.apache.maven.lifecycle.internal.MojoExecutor.execute(MojoExecutor.java:209)
	... 27 more
Maven failed with error.
Sending e-mails to: server-dev@james.apache.org
channel stopped


---------------------------------------------------------------------
To unsubscribe, e-mail: server-dev-unsubscribe@james.apache.org
For additional commands, e-mail: server-dev-help@james.apache.org


Mime
View raw message