james-server-dev mailing list archives

Site index · List index
Message view « Date » · « Thread »
Top « Date » · « Thread »
From Apache Hudson Server <hud...@hudson.apache.org>
Subject Build failed in Jenkins: mailbox-integration-tests #243
Date Fri, 08 Apr 2011 09:26:05 GMT
See <https://hudson.apache.org/hudson/job/mailbox-integration-tests/243/>

------------------------------------------
[...truncated 4104 lines...]
Actual   : '* OK [UIDVALIDITY 1163020583] UIDs valid'
Running org.apache.james.mailbox.inmemory.imap.FetchBodyStructureTest
ID=-1865219246501916229
ID=5247620301826267017
ID=4242400778178547531
ID=-6770173378511909517
ID=8499153868264105734
ID=-4056508834851606497
ID=-9841244486317462
ID=-9178213026972957783
ID=-2839947626130291661
ID=4072572806970396016
ID=-1372492931270457250
ID=3644736109428089871
Tests run: 12, Failures: 0, Errors: 12, Skipped: 0, Time elapsed: 0.747 sec <<< FAILURE!
Location: /org/apache/james/imap/scripts/SelectedStateSetup.test:76
LastClientMsg: a1 SELECT selected
Expected: '\* OK \[UIDVALIDITY \d+\]'
Actual   : '* OK [UIDVALIDITY 780433736] UIDs valid'
Location: /org/apache/james/imap/scripts/SelectedStateSetup.test:76
LastClientMsg: a1 SELECT selected
Expected: '\* OK \[UIDVALIDITY \d+\]'
Actual   : '* OK [UIDVALIDITY 386524775] UIDs valid'
Location: /org/apache/james/imap/scripts/SelectedStateSetup.test:76
LastClientMsg: a1 SELECT selected
Expected: '\* OK \[UIDVALIDITY \d+\]'
Actual   : '* OK [UIDVALIDITY 78730657] UIDs valid'
Location: /org/apache/james/imap/scripts/SelectedStateSetup.test:76
LastClientMsg: a1 SELECT selected
Expected: '\* OK \[UIDVALIDITY \d+\]'
Actual   : '* OK [UIDVALIDITY 779282650] UIDs valid'
Location: /org/apache/james/imap/scripts/SelectedStateSetup.test:76
LastClientMsg: a1 SELECT selected
Expected: '\* OK \[UIDVALIDITY \d+\]'
Actual   : '* OK [UIDVALIDITY 1396498966] UIDs valid'
Location: /org/apache/james/imap/scripts/SelectedStateSetup.test:76
LastClientMsg: a1 SELECT selected
Expected: '\* OK \[UIDVALIDITY \d+\]'
Actual   : '* OK [UIDVALIDITY 1132537569] UIDs valid'
Location: /org/apache/james/imap/scripts/SelectedStateSetup.test:76
LastClientMsg: a1 SELECT selected
Expected: '\* OK \[UIDVALIDITY \d+\]'
Actual   : '* OK [UIDVALIDITY 27377735] UIDs valid'
Location: /org/apache/james/imap/scripts/SelectedStateSetup.test:76
LastClientMsg: a1 SELECT selected
Expected: '\* OK \[UIDVALIDITY \d+\]'
Actual   : '* OK [UIDVALIDITY 251159149] UIDs valid'
Location: /org/apache/james/imap/scripts/SelectedStateSetup.test:76
LastClientMsg: a1 SELECT selected
Expected: '\* OK \[UIDVALIDITY \d+\]'
Actual   : '* OK [UIDVALIDITY 1969113117] UIDs valid'
Location: /org/apache/james/imap/scripts/SelectedStateSetup.test:76
LastClientMsg: a1 SELECT selected
Expected: '\* OK \[UIDVALIDITY \d+\]'
Actual   : '* OK [UIDVALIDITY 273717448] UIDs valid'
Location: /org/apache/james/imap/scripts/SelectedStateSetup.test:76
LastClientMsg: a1 SELECT selected
Expected: '\* OK \[UIDVALIDITY \d+\]'
Actual   : '* OK [UIDVALIDITY 655793539] UIDs valid'
Location: /org/apache/james/imap/scripts/SelectedStateSetup.test:76
LastClientMsg: a1 SELECT selected
Expected: '\* OK \[UIDVALIDITY \d+\]'
Actual   : '* OK [UIDVALIDITY 1187688138] UIDs valid'
Running org.apache.james.mailbox.inmemory.imap.FetchHeadersTest
ID=-7124425737820258689
ID=5377406459859264229
ID=-5179669348314097186
ID=4232764176803779053
ID=6543134814687258798
ID=5950692819514816846
Tests run: 6, Failures: 0, Errors: 6, Skipped: 0, Time elapsed: 0.631 sec <<< FAILURE!
Location: /org/apache/james/imap/scripts/SelectedStateSetup.test:76
LastClientMsg: a1 SELECT selected
Expected: '\* OK \[UIDVALIDITY \d+\]'
Actual   : '* OK [UIDVALIDITY 537580901] UIDs valid'
Location: /org/apache/james/imap/scripts/SelectedStateSetup.test:76
LastClientMsg: a1 SELECT selected
Expected: '\* OK \[UIDVALIDITY \d+\]'
Actual   : '* OK [UIDVALIDITY 55047392] UIDs valid'
Location: /org/apache/james/imap/scripts/SelectedStateSetup.test:76
LastClientMsg: a1 SELECT selected
Expected: '\* OK \[UIDVALIDITY \d+\]'
Actual   : '* OK [UIDVALIDITY 1747619929] UIDs valid'
Location: /org/apache/james/imap/scripts/SelectedStateSetup.test:76
LastClientMsg: a1 SELECT selected
Expected: '\* OK \[UIDVALIDITY \d+\]'
Actual   : '* OK [UIDVALIDITY 147426897] UIDs valid'
Location: /org/apache/james/imap/scripts/SelectedStateSetup.test:76
LastClientMsg: a1 SELECT selected
Expected: '\* OK \[UIDVALIDITY \d+\]'
Actual   : '* OK [UIDVALIDITY 864520427] UIDs valid'
Location: /org/apache/james/imap/scripts/SelectedStateSetup.test:76
LastClientMsg: a1 SELECT selected
Expected: '\* OK \[UIDVALIDITY \d+\]'
Actual   : '* OK [UIDVALIDITY 1985475126] UIDs valid'
Running org.apache.james.mailbox.inmemory.imap.EventTest
ID=5677401638256246014
ID=1142928595336956100
ID=-7274408082131765946
Tests run: 3, Failures: 0, Errors: 3, Skipped: 0, Time elapsed: 0.587 sec <<< FAILURE!
Location: /org/apache/james/imap/scripts/SelectedStateSetup.test:76
LastClientMsg: a1 SELECT selected
Expected: '\* OK \[UIDVALIDITY \d+\]'
Actual   : '* OK [UIDVALIDITY 237896566] UIDs valid'
Location: /org/apache/james/imap/scripts/SelectedStateSetup.test:76
LastClientMsg: a1 SELECT selected
Expected: '\* OK \[UIDVALIDITY \d+\]'
Actual   : '* OK [UIDVALIDITY 1999796761] UIDs valid'
Location: /org/apache/james/imap/scripts/SelectedStateSetup.test:76
LastClientMsg: a1 SELECT selected
Expected: '\* OK \[UIDVALIDITY \d+\]'
Actual   : '* OK [UIDVALIDITY 1111312133] UIDs valid'
Running org.apache.james.mailbox.inmemory.imap.PartialFetchTest
ID=358824651035315939
ID=2685453872615584446
ID=5630830235112492665
ID=-757912267947905073
ID=-3421587606724033012
ID=1915216028214427794
ID=4968015178461871448
ID=4919601870014416742
ID=-114376759379958438
ID=3572491132927358950
ID=-8347725781565953969
ID=-7881608539515918608
Tests run: 12, Failures: 0, Errors: 12, Skipped: 0, Time elapsed: 0.723 sec <<< FAILURE!

Results :

Tests in error: 
  testBodyPartialFetchUS(org.apache.james.mailbox.inmemory.imap.PartialFetchTest): 
Location: /org/apache/james/imap/scripts/SelectedStateSetup.test:76
LastClientMsg: a1 SELECT selected
Expected: '\* OK \[UIDVALIDITY \d+\]'
Actual   : '* OK [UIDVALIDITY 697265272] UIDs valid'
  testBodyPartialFetchIT(org.apache.james.mailbox.inmemory.imap.PartialFetchTest): 
Location: /org/apache/james/imap/scripts/SelectedStateSetup.test:76
LastClientMsg: a1 SELECT selected
Expected: '\* OK \[UIDVALIDITY \d+\]'
Actual   : '* OK [UIDVALIDITY 1798106909] UIDs valid'
  testBodyPartialFetchKO(org.apache.james.mailbox.inmemory.imap.PartialFetchTest): 
Location: /org/apache/james/imap/scripts/SelectedStateSetup.test:76
LastClientMsg: a1 SELECT selected
Expected: '\* OK \[UIDVALIDITY \d+\]'
Actual   : '* OK [UIDVALIDITY 1730597546] UIDs valid'
  testTextPartialFetchUS(org.apache.james.mailbox.inmemory.imap.PartialFetchTest): 
Location: /org/apache/james/imap/scripts/SelectedStateSetup.test:76
LastClientMsg: a1 SELECT selected
Expected: '\* OK \[UIDVALIDITY \d+\]'
Actual   : '* OK [UIDVALIDITY 1079680801] UIDs valid'
  testTextPartialFetchKO(org.apache.james.mailbox.inmemory.imap.PartialFetchTest): 
Location: /org/apache/james/imap/scripts/SelectedStateSetup.test:76
LastClientMsg: a1 SELECT selected
Expected: '\* OK \[UIDVALIDITY \d+\]'
Actual   : '* OK [UIDVALIDITY 1981205085] UIDs valid'
  testTextPartialFetchIT(org.apache.james.mailbox.inmemory.imap.PartialFetchTest): 
Location: /org/apache/james/imap/scripts/SelectedStateSetup.test:76
LastClientMsg: a1 SELECT selected
Expected: '\* OK \[UIDVALIDITY \d+\]'
Actual   : '* OK [UIDVALIDITY 970877855] UIDs valid'
  testMimePartialFetchUS(org.apache.james.mailbox.inmemory.imap.PartialFetchTest): 
Location: /org/apache/james/imap/scripts/SelectedStateSetup.test:76
LastClientMsg: a1 SELECT selected
Expected: '\* OK \[UIDVALIDITY \d+\]'
Actual   : '* OK [UIDVALIDITY 1326857332] UIDs valid'
  testMimePartialFetchIT(org.apache.james.mailbox.inmemory.imap.PartialFetchTest): 
Location: /org/apache/james/imap/scripts/SelectedStateSetup.test:76
LastClientMsg: a1 SELECT selected
Expected: '\* OK \[UIDVALIDITY \d+\]'
Actual   : '* OK [UIDVALIDITY 1339742638] UIDs valid'
  testMimePartialFetchKO(org.apache.james.mailbox.inmemory.imap.PartialFetchTest): 
Location: /org/apache/james/imap/scripts/SelectedStateSetup.test:76
LastClientMsg: a1 SELECT selected
Expected: '\* OK \[UIDVALIDITY \d+\]'
Actual   : '* OK [UIDVALIDITY 237008045] UIDs valid'
  testHeaderPartialFetchUS(org.apache.james.mailbox.inmemory.imap.PartialFetchTest): 
Location: /org/apache/james/imap/scripts/SelectedStateSetup.test:76
LastClientMsg: a1 SELECT selected
Expected: '\* OK \[UIDVALIDITY \d+\]'
Actual   : '* OK [UIDVALIDITY 1653699498] UIDs valid'
  testHeaderPartialFetchIT(org.apache.james.mailbox.inmemory.imap.PartialFetchTest): 
Location: /org/apache/james/imap/scripts/SelectedStateSetup.test:76
LastClientMsg: a1 SELECT selected
Expected: '\* OK \[UIDVALIDITY \d+\]'
Actual   : '* OK [UIDVALIDITY 551496864] UIDs valid'
  testHeaderPartialFetchKO(org.apache.james.mailbox.inmemory.imap.PartialFetchTest): 
Location: /org/apache/james/imap/scripts/SelectedStateSetup.test:76
LastClientMsg: a1 SELECT selected
Expected: '\* OK \[UIDVALIDITY \d+\]'
Actual   : '* OK [UIDVALIDITY 1859891805] UIDs valid'

Tests run: 1158, Failures: 0, Errors: 807, Skipped: 0

mojoFailed org.apache.maven.plugins:maven-surefire-plugin:2.7.2(default-test)
[JENKINS] Recording test results
projectFailed org.apache.james:apache-james-mailbox-integration-tester:0.2-M2-SNAPSHOT
[JENKINS] Archiving <https://hudson.apache.org/hudson/job/mailbox-integration-tests/ws/pom.xml>
to /home/hudson/hudson/jobs/mailbox-integration-tests/modules/org.apache.james$apache-james-mailbox-integration-tester/builds/2011-04-08_09-19-37/archive/org.apache.james/apache-james-mailbox-integration-tester/0.2-M2-SNAPSHOT/pom.xml
sessionEnded
[INFO] ------------------------------------------------------------------------
[INFO] BUILD FAILURE
[INFO] ------------------------------------------------------------------------
[INFO] Total time: 6:14.215s
[INFO] Finished at: Fri Apr 08 01:26:01 GMT-08:00 2011
[INFO] Final Memory: 28M/150M
[INFO] ------------------------------------------------------------------------
maven builder waiting
mavenExecutionResult exceptions not empty
org.apache.maven.lifecycle.LifecycleExecutionException: Failed to execute goal org.apache.maven.plugins:maven-surefire-plugin:2.7.2:test
(default-test) on project apache-james-mailbox-integration-tester: There are test failures.

Please refer to <https://hudson.apache.org/hudson/job/mailbox-integration-tests/ws/target/surefire-reports>
for the individual test results.
	at org.apache.maven.lifecycle.internal.MojoExecutor.execute(MojoExecutor.java:213)
	at org.apache.maven.lifecycle.internal.MojoExecutor.execute(MojoExecutor.java:153)
	at org.apache.maven.lifecycle.internal.MojoExecutor.execute(MojoExecutor.java:145)
	at org.apache.maven.lifecycle.internal.LifecycleModuleBuilder.buildProject(LifecycleModuleBuilder.java:84)
	at org.apache.maven.lifecycle.internal.LifecycleModuleBuilder.buildProject(LifecycleModuleBuilder.java:59)
	at org.apache.maven.lifecycle.internal.LifecycleStarter.singleThreadedBuild(LifecycleStarter.java:183)
	at org.apache.maven.lifecycle.internal.LifecycleStarter.execute(LifecycleStarter.java:161)
	at org.apache.maven.DefaultMaven.doExecute(DefaultMaven.java:319)
	at org.apache.maven.DefaultMaven.execute(DefaultMaven.java:156)
	at org.jvnet.hudson.maven3.launcher.Maven3Launcher.main(Maven3Launcher.java:79)
	at sun.reflect.NativeMethodAccessorImpl.invoke0(Native Method)
	at sun.reflect.NativeMethodAccessorImpl.invoke(NativeMethodAccessorImpl.java:39)
	at sun.reflect.DelegatingMethodAccessorImpl.invoke(DelegatingMethodAccessorImpl.java:25)
	at java.lang.reflect.Method.invoke(Method.java:592)
	at org.codehaus.plexus.classworlds.launcher.Launcher.launchStandard(Launcher.java:329)
	at org.codehaus.plexus.classworlds.launcher.Launcher.launch(Launcher.java:239)
	at org.jvnet.hudson.maven3.agent.Maven3Main.launch(Maven3Main.java:146)
	at hudson.maven.Maven3Builder.call(Maven3Builder.java:124)
	at hudson.maven.Maven3Builder.call(Maven3Builder.java:71)
	at hudson.remoting.UserRequest.perform(UserRequest.java:114)
	at hudson.remoting.UserRequest.perform(UserRequest.java:48)
	at hudson.remoting.Request$2.run(Request.java:270)
	at java.util.concurrent.Executors$RunnableAdapter.call(Executors.java:417)
	at java.util.concurrent.FutureTask$Sync.innerRun(FutureTask.java:269)
	at java.util.concurrent.FutureTask.run(FutureTask.java:123)
	at java.util.concurrent.ThreadPoolExecutor$Worker.runTask(ThreadPoolExecutor.java:651)
	at java.util.concurrent.ThreadPoolExecutor$Worker.run(ThreadPoolExecutor.java:676)
	at java.lang.Thread.run(Thread.java:595)
Caused by: org.apache.maven.plugin.MojoFailureException: There are test failures.

Please refer to <https://hudson.apache.org/hudson/job/mailbox-integration-tests/ws/target/surefire-reports>
for the individual test results.
	at org.apache.maven.plugin.surefire.SurefireHelper.reportExecution(SurefireHelper.java:74)
	at org.apache.maven.plugin.surefire.SurefirePlugin.execute(SurefirePlugin.java:642)
	at org.apache.maven.plugin.DefaultBuildPluginManager.executeMojo(DefaultBuildPluginManager.java:101)
	at org.apache.maven.lifecycle.internal.MojoExecutor.execute(MojoExecutor.java:209)
	... 27 more
Maven failed with error.
Sending e-mails to: server-dev@james.apache.org
channel stopped


---------------------------------------------------------------------
To unsubscribe, e-mail: server-dev-unsubscribe@james.apache.org
For additional commands, e-mail: server-dev-help@james.apache.org


Mime
View raw message