james-server-dev mailing list archives

Site index · List index
Message view « Date » · « Thread »
Top « Date » · « Thread »
From Apache Hudson Server <hud...@hudson.apache.org>
Subject Build failed in Jenkins: james-server-trunk #1495
Date Fri, 15 Apr 2011 15:23:33 GMT
See <https://hudson.apache.org/hudson/job/james-server-trunk/1495/changes>

Changes:

[felixk] Mark as false positive for findbugs reporting

------------------------------------------
[...truncated 504 lines...]
test body@SLTests run: 9, Failures: 0, Errors: 0, Skipped: 0, Time elapsed: 0.431 sec
Running org.apache.james.core.MimeMessageCopyOnWriteProxyTest
mail: /3/W m2: /3/W
mail: /3/W m2: /3/W
Message-ID: <31564808.39.1302880999009.JavaMail.hudson@vesta.apache.org>
MIME-Version: 1.0
Subject: test
Content-Type: text/plain; charset=us-ascii
Content-Transfer-Encoding: 7bit

test bodyMessage-ID: <4313181.43.1302880999444.JavaMail.hudson@vesta.apache.org>
MIME-Version: 1.0
Subject: test
Content-Type: text/plain; charset=us-ascii
Content-Transfer-Encoding: 7bit

test body@SLTests run: 16, Failures: 0, Errors: 0, Skipped: 0, Time elapsed: 2.915 sec

Results :

Tests run: 82, Failures: 0, Errors: 0, Skipped: 0

[JENKINS] Recording test results
[INFO] 
[INFO] --- maven-jar-plugin:2.3.1:jar (default-jar) @ james-server-core ---
[INFO] Building jar: <https://hudson.apache.org/hudson/job/james-server-trunk/ws/trunk/core/target/james-server-core-3.0-M3-SNAPSHOT.jar>
[INFO] 
[INFO] --- maven-jar-plugin:2.3.1:jar (default) @ james-server-core ---
[INFO] 
[INFO] --- maven-jar-plugin:2.3.1:test-jar (default) @ james-server-core ---
[INFO] Building jar: <https://hudson.apache.org/hudson/job/james-server-trunk/ws/trunk/core/target/james-server-core-3.0-M3-SNAPSHOT-tests.jar>
[INFO] 
[INFO] --- maven-site-plugin:3.0-beta-3:attach-descriptor (attach-descriptor) @ james-server-core
---
[INFO] [INFO] Installing <https://hudson.apache.org/hudson/job/james-server-trunk/ws/trunk/core/target/james-server-core-3.0-M3-SNAPSHOT.jar>
to /home/hudson/.m2/repository/org/apache/james/james-server-core/3.0-M3-SNAPSHOT/james-server-core-3.0-M3-SNAPSHOT.jar
[INFO] Installing <https://hudson.apache.org/hudson/job/james-server-trunk/ws/trunk/core/pom.xml>
to /home/hudson/.m2/repository/org/apache/james/james-server-core/3.0-M3-SNAPSHOT/james-server-core-3.0-M3-SNAPSHOT.pom
[INFO] Installing <https://hudson.apache.org/hudson/job/james-server-trunk/ws/trunk/core/target/james-server-core-3.0-M3-SNAPSHOT-tests.jar>
to /home/hudson/.m2/repository/org/apache/james/james-server-core/3.0-M3-SNAPSHOT/james-server-core-3.0-M3-SNAPSHOT-tests.jar

[INFO] --- maven-install-plugin:2.3.1:install (default-install) @ james-server-core ---
[INFO] Downloading: https://repository.apache.org/content/repositories/snapshots/org/apache/james/james-server-core/3.0-M3-SNAPSHOT/maven-metadata.xml

[INFO] --- maven-deploy-plugin:2.4:deploy (default-deploy) @ james-server-core ---
Downloaded: https://repository.apache.org/content/repositories/snapshots/org/apache/james/james-server-core/3.0-M3-SNAPSHOT/maven-metadata.xml
(1007 B at 9.6 KB/sec)
Uploading: https://repository.apache.org/content/repositories/snapshots/org/apache/james/james-server-core/3.0-M3-SNAPSHOT/james-server-core-3.0-M3-20110415.152321-222.jar
Uploaded: https://repository.apache.org/content/repositories/snapshots/org/apache/james/james-server-core/3.0-M3-SNAPSHOT/james-server-core-3.0-M3-20110415.152321-222.jar
(33 KB at 118.7 KB/sec)
Uploading: https://repository.apache.org/content/repositories/snapshots/org/apache/james/james-server-core/3.0-M3-SNAPSHOT/james-server-core-3.0-M3-20110415.152321-222.pom
Uploaded: https://repository.apache.org/content/repositories/snapshots/org/apache/james/james-server-core/3.0-M3-SNAPSHOT/james-server-core-3.0-M3-20110415.152321-222.pom
(4 KB at 22.7 KB/sec)
Downloading: https://repository.apache.org/content/repositories/snapshots/org/apache/james/james-server-core/maven-metadata.xml
Downloaded: https://repository.apache.org/content/repositories/snapshots/org/apache/james/james-server-core/maven-metadata.xml
(294 B at 3.0 KB/sec)
Uploading: https://repository.apache.org/content/repositories/snapshots/org/apache/james/james-server-core/3.0-M3-SNAPSHOT/maven-metadata.xml
Uploaded: https://repository.apache.org/content/repositories/snapshots/org/apache/james/james-server-core/3.0-M3-SNAPSHOT/maven-metadata.xml
(1007 B at 6.7 KB/sec)
Uploading: https://repository.apache.org/content/repositories/snapshots/org/apache/james/james-server-core/maven-metadata.xml
Uploaded: https://repository.apache.org/content/repositories/snapshots/org/apache/james/james-server-core/maven-metadata.xml
(294 B at 1.4 KB/sec)
Uploading: https://repository.apache.org/content/repositories/snapshots/org/apache/james/james-server-core/3.0-M3-SNAPSHOT/james-server-core-3.0-M3-20110415.152321-222-tests.jar
Uploaded: https://repository.apache.org/content/repositories/snapshots/org/apache/james/james-server-core/3.0-M3-SNAPSHOT/james-server-core-3.0-M3-20110415.152321-222-tests.jar
(29 KB at 56.8 KB/sec)
Uploading: https://repository.apache.org/content/repositories/snapshots/org/apache/james/james-server-core/3.0-M3-SNAPSHOT/maven-metadata.xml
Uploaded: https://repository.apache.org/content/repositories/snapshots/org/apache/james/james-server-core/3.0-M3-SNAPSHOT/maven-metadata.xml
(1007 B at 5.8 KB/sec)
projectSucceeded org.apache.james:james-server-core:3.0-M3-SNAPSHOT
[JENKINS] Archiving <https://hudson.apache.org/hudson/job/james-server-trunk/ws/trunk/core/pom.xml>
to /home/hudson/hudson/jobs/james-server-trunk/modules/org.apache.james$james-server-core/builds/2011-04-15_15-22-11/archive/org.apache.james/james-server-core/3.0-M3-SNAPSHOT/pom.xml
[JENKINS] Archiving <https://hudson.apache.org/hudson/job/james-server-trunk/ws/trunk/core/target/james-server-core-3.0-M3-SNAPSHOT.jar>
to /home/hudson/hudson/jobs/james-server-trunk/modules/org.apache.james$james-server-core/builds/2011-04-15_15-22-11/archive/org.apache.james/james-server-core/3.0-M3-20110415.152321-222/james-server-core-3.0-M3-SNAPSHOT.jar
[JENKINS] Archiving <https://hudson.apache.org/hudson/job/james-server-trunk/ws/trunk/core/target/james-server-core-3.0-M3-SNAPSHOT-tests.jar>
to /home/hudson/hudson/jobs/james-server-trunk/modules/org.apache.james$james-server-core/builds/2011-04-15_15-22-11/archive/org.apache.james/james-server-core/3.0-M3-20110415.152321-222/james-server-core-3.0-M3-SNAPSHOT-tests.jar
[INFO] [INFO] Deleting <https://hudson.apache.org/hudson/job/james-server-trunk/ws/trunk/queue-api/target>
                                                                        
[INFO] ------------------------------------------------------------------------
[INFO] Building Apache James Server Queue API 3.0-M3-SNAPSHOT
[INFO] ------------------------------------------------------------------------
[INFO] 
[INFO] --- maven-clean-plugin:2.4.1:clean (default-clean) @ james-server-queue-api ---
[INFO] 
[INFO] --- maven-remote-resources-plugin:1.1:process (default) @ james-server-queue-api ---
[INFO] [INFO] Using 'UTF-8' encoding to copy filtered resources.
[INFO] skip non existing resourceDirectory <https://hudson.apache.org/hudson/job/james-server-trunk/ws/trunk/queue-api/src/main/resources>
[INFO] Copying 3 resources

[INFO] --- maven-resources-plugin:2.4.3:resources (default-resources) @ james-server-queue-api
---
[INFO] [INFO] Compiling 5 source files to <https://hudson.apache.org/hudson/job/james-server-trunk/ws/trunk/queue-api/target/classes>

[INFO] --- maven-compiler-plugin:2.3.2:compile (default-compile) @ james-server-queue-api
---
[INFO] 
[INFO] --- maven-bundle-plugin:2.1.0:manifest (bundle-manifest) @ james-server-queue-api ---
[INFO] [INFO] Using 'UTF-8' encoding to copy filtered resources.
[INFO] skip non existing resourceDirectory <https://hudson.apache.org/hudson/job/james-server-trunk/ws/trunk/queue-api/src/test/resources>
[INFO] Copying 3 resources

[INFO] --- maven-resources-plugin:2.4.3:testResources (default-testResources) @ james-server-queue-api
---
[INFO] [INFO] Compiling 2 source files to <https://hudson.apache.org/hudson/job/james-server-trunk/ws/trunk/queue-api/target/test-classes>

[INFO] --- maven-compiler-plugin:2.3.2:testCompile (default-testCompile) @ james-server-queue-api
---
[INFO] [INFO] Surefire report directory: <https://hudson.apache.org/hudson/job/james-server-trunk/ws/trunk/queue-api/target/surefire-reports>

[INFO] --- maven-surefire-plugin:2.7.2:test (default-test) @ james-server-queue-api ---

-------------------------------------------------------
 T E S T S
-------------------------------------------------------
There are no tests to run.

Results :

Tests run: 0, Failures: 0, Errors: 0, Skipped: 0

[JENKINS] Recording test results
[INFO] 
[INFO] --- maven-jar-plugin:2.3.1:jar (default-jar) @ james-server-queue-api ---
[INFO] Building jar: <https://hudson.apache.org/hudson/job/james-server-trunk/ws/trunk/queue-api/target/james-server-queue-api-3.0-M3-SNAPSHOT.jar>
[INFO] 
[INFO] --- maven-jar-plugin:2.3.1:jar (default) @ james-server-queue-api ---
[INFO] 
[INFO] --- maven-jar-plugin:2.3.1:test-jar (default) @ james-server-queue-api ---
[INFO] Building jar: <https://hudson.apache.org/hudson/job/james-server-trunk/ws/trunk/queue-api/target/james-server-queue-api-3.0-M3-SNAPSHOT-tests.jar>
[INFO] 
[INFO] --- maven-site-plugin:3.0-beta-3:attach-descriptor (attach-descriptor) @ james-server-queue-api
---
[INFO] Installing <https://hudson.apache.org/hudson/job/james-server-trunk/ws/trunk/queue-api/target/james-server-queue-api-3.0-M3-SNAPSHOT.jar>
to /home/hudson/.m2/repository/org/apache/james/james-server-queue-api/3.0-M3-SNAPSHOT/james-server-queue-api-3.0-M3-SNAPSHOT.jar
[INFO] [INFO] Installing <https://hudson.apache.org/hudson/job/james-server-trunk/ws/trunk/queue-api/pom.xml>
to /home/hudson/.m2/repository/org/apache/james/james-server-queue-api/3.0-M3-SNAPSHOT/james-server-queue-api-3.0-M3-SNAPSHOT.pom
[INFO] Installing <https://hudson.apache.org/hudson/job/james-server-trunk/ws/trunk/queue-api/target/james-server-queue-api-3.0-M3-SNAPSHOT-tests.jar>
to /home/hudson/.m2/repository/org/apache/james/james-server-queue-api/3.0-M3-SNAPSHOT/james-server-queue-api-3.0-M3-SNAPSHOT-tests.jar

[INFO] --- maven-install-plugin:2.3.1:install (default-install) @ james-server-queue-api ---
[INFO] Downloading: https://repository.apache.org/content/repositories/snapshots/org/apache/james/james-server-queue-api/3.0-M3-SNAPSHOT/maven-metadata.xml

[INFO] --- maven-deploy-plugin:2.4:deploy (default-deploy) @ james-server-queue-api ---
Downloaded: https://repository.apache.org/content/repositories/snapshots/org/apache/james/james-server-queue-api/3.0-M3-SNAPSHOT/maven-metadata.xml
(1012 B at 6.0 KB/sec)
Uploading: https://repository.apache.org/content/repositories/snapshots/org/apache/james/james-server-queue-api/3.0-M3-SNAPSHOT/james-server-queue-api-3.0-M3-20110415.152327-222.jar
Uploaded: https://repository.apache.org/content/repositories/snapshots/org/apache/james/james-server-queue-api/3.0-M3-SNAPSHOT/james-server-queue-api-3.0-M3-20110415.152327-222.jar
(13 KB at 60.0 KB/sec)
Uploading: https://repository.apache.org/content/repositories/snapshots/org/apache/james/james-server-queue-api/3.0-M3-SNAPSHOT/james-server-queue-api-3.0-M3-20110415.152327-222.pom
Uploaded: https://repository.apache.org/content/repositories/snapshots/org/apache/james/james-server-queue-api/3.0-M3-SNAPSHOT/james-server-queue-api-3.0-M3-20110415.152327-222.pom
(3 KB at 10.3 KB/sec)
Downloading: https://repository.apache.org/content/repositories/snapshots/org/apache/james/james-server-queue-api/maven-metadata.xml
Downloaded: https://repository.apache.org/content/repositories/snapshots/org/apache/james/james-server-queue-api/maven-metadata.xml
(299 B at 3.2 KB/sec)
Uploading: https://repository.apache.org/content/repositories/snapshots/org/apache/james/james-server-queue-api/3.0-M3-SNAPSHOT/maven-metadata.xml
Uploaded: https://repository.apache.org/content/repositories/snapshots/org/apache/james/james-server-queue-api/3.0-M3-SNAPSHOT/maven-metadata.xml
(1012 B at 6.5 KB/sec)
Uploading: https://repository.apache.org/content/repositories/snapshots/org/apache/james/james-server-queue-api/maven-metadata.xml
Uploaded: https://repository.apache.org/content/repositories/snapshots/org/apache/james/james-server-queue-api/maven-metadata.xml
(299 B at 1.9 KB/sec)
Uploading: https://repository.apache.org/content/repositories/snapshots/org/apache/james/james-server-queue-api/3.0-M3-SNAPSHOT/james-server-queue-api-3.0-M3-20110415.152327-222-tests.jar
Uploaded: https://repository.apache.org/content/repositories/snapshots/org/apache/james/james-server-queue-api/3.0-M3-SNAPSHOT/james-server-queue-api-3.0-M3-20110415.152327-222-tests.jar
(12 KB at 69.1 KB/sec)
Uploading: https://repository.apache.org/content/repositories/snapshots/org/apache/james/james-server-queue-api/3.0-M3-SNAPSHOT/maven-metadata.xml
Uploaded: https://repository.apache.org/content/repositories/snapshots/org/apache/james/james-server-queue-api/3.0-M3-SNAPSHOT/maven-metadata.xml
(1012 B at 5.8 KB/sec)
projectSucceeded org.apache.james:james-server-queue-api:3.0-M3-SNAPSHOT
[JENKINS] Archiving <https://hudson.apache.org/hudson/job/james-server-trunk/ws/trunk/queue-api/pom.xml>
to /home/hudson/hudson/jobs/james-server-trunk/modules/org.apache.james$james-server-queue-api/builds/2011-04-15_15-22-11/archive/org.apache.james/james-server-queue-api/3.0-M3-SNAPSHOT/pom.xml
[JENKINS] Archiving <https://hudson.apache.org/hudson/job/james-server-trunk/ws/trunk/queue-api/target/james-server-queue-api-3.0-M3-SNAPSHOT.jar>
to /home/hudson/hudson/jobs/james-server-trunk/modules/org.apache.james$james-server-queue-api/builds/2011-04-15_15-22-11/archive/org.apache.james/james-server-queue-api/3.0-M3-20110415.152327-222/james-server-queue-api-3.0-M3-SNAPSHOT.jar
[JENKINS] Archiving <https://hudson.apache.org/hudson/job/james-server-trunk/ws/trunk/queue-api/target/james-server-queue-api-3.0-M3-SNAPSHOT-tests.jar>
to /home/hudson/hudson/jobs/james-server-trunk/modules/org.apache.james$james-server-queue-api/builds/2011-04-15_15-22-11/archive/org.apache.james/james-server-queue-api/3.0-M3-20110415.152327-222/james-server-queue-api-3.0-M3-SNAPSHOT-tests.jar
[INFO]                                                                         
[INFO] ------------------------------------------------------------------------
[INFO] Building Apache James Server Mailetcontainer library 3.0-M3-SNAPSHOT
[INFO] ------------------------------------------------------------------------[INFO] Deleting
<https://hudson.apache.org/hudson/job/james-server-trunk/ws/trunk/mailetcontainer-library/target>

[INFO] 
[INFO] --- maven-clean-plugin:2.4.1:clean (default-clean) @ james-server-mailetcontainer-library
---
[INFO] 
[INFO] --- maven-remote-resources-plugin:1.1:process (default) @ james-server-mailetcontainer-library
---
[INFO] [INFO] Using 'UTF-8' encoding to copy filtered resources.
[INFO] skip non existing resourceDirectory <https://hudson.apache.org/hudson/job/james-server-trunk/ws/trunk/mailetcontainer-library/src/main/resources>
[INFO] Copying 3 resources

[INFO] --- maven-resources-plugin:2.4.3:resources (default-resources) @ james-server-mailetcontainer-library
---
[INFO] [INFO] Compiling 25 source files to <https://hudson.apache.org/hudson/job/james-server-trunk/ws/trunk/mailetcontainer-library/target/classes>

[INFO] --- maven-compiler-plugin:2.3.2:compile (default-compile) @ james-server-mailetcontainer-library
---
[INFO] -------------------------------------------------------------
[ERROR] COMPILATION ERROR : 
[INFO] -------------------------------------------------------------
[ERROR] <https://hudson.apache.org/hudson/job/james-server-trunk/ws/trunk/mailetcontainer-library/src/main/java/org/apache/james/mailetcontainer/lib/AbstractStateMailetProcessor.java>:[315,36]
package edu.umd.cs.findbugs.annotations does not exist
[INFO] 1 error
[INFO] -------------------------------------------------------------
mojoFailed org.apache.maven.plugins:maven-compiler-plugin:2.3.2(default-compile)
projectFailed org.apache.james:james-server-mailetcontainer-library:3.0-M3-SNAPSHOT
[JENKINS] Archiving <https://hudson.apache.org/hudson/job/james-server-trunk/ws/trunk/mailetcontainer-library/pom.xml>
to /home/hudson/hudson/jobs/james-server-trunk/modules/org.apache.james$james-server-mailetcontainer-library/builds/2011-04-15_15-22-11/archive/org.apache.james/james-server-mailetcontainer-library/3.0-M3-SNAPSHOT/pom.xml
sessionEnded
[INFO] ------------------------------------------------------------------------
[INFO] Reactor Summary:
[INFO] 
[INFO] Apache James Server ............................... SUCCESS [11.572s]
[INFO] Apache James Server Data API ...................... SUCCESS [6.214s]
[INFO] Apache James Server Client ........................ SUCCESS [14.510s]
[INFO] Apache James Server Lifecycle API ................. SUCCESS [4.111s]
[INFO] Apache James Server Filesystem API ................ SUCCESS [4.490s]
[INFO] Apache James Server Core .......................... SUCCESS [11.298s]
[INFO] Apache James Server Queue API ..................... SUCCESS [4.757s]
[INFO] Apache James Server Mailetcontainer library ....... FAILURE [1.453s]
[INFO] Apache James Server DNS Server API ................ SKIPPED
[INFO] Apache James Server DNSService Library ............ SKIPPED
[INFO] Apache James Server Mailetcontainer Camel implementation  SKIPPED
[INFO] Apache James Server Mailbox Adapter ............... SKIPPED
[INFO] Apache James Server DNSService Implementation ..... SKIPPED
[INFO] Apache James Server Common Utilities .............. SKIPPED
[INFO] Apache James Server Protocols Library ............. SKIPPED
[INFO] Apache James Server Data Library .................. SKIPPED
[INFO] Apache James Server LDAP Data Implementation ...... SKIPPED
[INFO] Apache James Server SMTP .......................... SKIPPED
[INFO] Apache James Server IMAP .......................... SKIPPED
[INFO] Apache James Server LMTP .......................... SKIPPED
[INFO] Apache James Server POP3 .......................... SKIPPED
[INFO] Apache James Server FetchMail ..................... SKIPPED
[INFO] Apache James Server JMS Mail Queue ................ SKIPPED
[INFO] Apache James Server ActiveMQ Queue ................ SKIPPED
[INFO] Apache James Server Mailets ....................... SKIPPED
[INFO] Apache James Server File Data Persistence ......... SKIPPED
[INFO] Apache James Server JPA Data Persistence .......... SKIPPED
[INFO] Apache James Server JDBC Data Persistence ......... SKIPPED
[INFO] Apache James Server JCR Data Persistence .......... SKIPPED
[INFO] Apache James Server Container Spring .............. SKIPPED
[INFO] Apache James Server OSGI Bindings ................. SKIPPED
[INFO] ------------------------------------------------------------------------
[INFO] BUILD FAILURE
[INFO] ------------------------------------------------------------------------
[INFO] Total time: 1:10.968s
[INFO] Finished at: Fri Apr 15 15:23:32 UTC 2011
[INFO] Final Memory: 32M/203M
[INFO] ------------------------------------------------------------------------
maven builder waiting
mavenExecutionResult exceptions not empty
org.apache.maven.lifecycle.LifecycleExecutionException: Failed to execute goal org.apache.maven.plugins:maven-compiler-plugin:2.3.2:compile
(default-compile) on project james-server-mailetcontainer-library: Compilation failure
<https://hudson.apache.org/hudson/job/james-server-trunk/ws/trunk/mailetcontainer-library/src/main/java/org/apache/james/mailetcontainer/lib/AbstractStateMailetProcessor.java>:[315,36]
package edu.umd.cs.findbugs.annotations does not exist

	at org.apache.maven.lifecycle.internal.MojoExecutor.execute(MojoExecutor.java:213)
	at org.apache.maven.lifecycle.internal.MojoExecutor.execute(MojoExecutor.java:153)
	at org.apache.maven.lifecycle.internal.MojoExecutor.execute(MojoExecutor.java:145)
	at org.apache.maven.lifecycle.internal.LifecycleModuleBuilder.buildProject(LifecycleModuleBuilder.java:84)
	at org.apache.maven.lifecycle.internal.LifecycleModuleBuilder.buildProject(LifecycleModuleBuilder.java:59)
	at org.apache.maven.lifecycle.internal.LifecycleStarter.singleThreadedBuild(LifecycleStarter.java:183)
	at org.apache.maven.lifecycle.internal.LifecycleStarter.execute(LifecycleStarter.java:161)
	at org.apache.maven.DefaultMaven.doExecute(DefaultMaven.java:319)
	at org.apache.maven.DefaultMaven.execute(DefaultMaven.java:156)
	at org.jvnet.hudson.maven3.launcher.Maven3Launcher.main(Maven3Launcher.java:79)
	at sun.reflect.NativeMethodAccessorImpl.invoke0(Native Method)
	at sun.reflect.NativeMethodAccessorImpl.invoke(NativeMethodAccessorImpl.java:39)
	at sun.reflect.DelegatingMethodAccessorImpl.invoke(DelegatingMethodAccessorImpl.java:25)
	at java.lang.reflect.Method.invoke(Method.java:592)
	at org.codehaus.plexus.classworlds.launcher.Launcher.launchStandard(Launcher.java:329)
	at org.codehaus.plexus.classworlds.launcher.Launcher.launch(Launcher.java:239)
	at org.jvnet.hudson.maven3.agent.Maven3Main.launch(Maven3Main.java:146)
	at hudson.maven.Maven3Builder.call(Maven3Builder.java:124)
	at hudson.maven.Maven3Builder.call(Maven3Builder.java:71)
	at hudson.remoting.UserRequest.perform(UserRequest.java:114)
	at hudson.remoting.UserRequest.perform(UserRequest.java:48)
	at hudson.remoting.Request$2.run(Request.java:270)
	at java.util.concurrent.Executors$RunnableAdapter.call(Executors.java:417)
	at java.util.concurrent.FutureTask$Sync.innerRun(FutureTask.java:269)
	at java.util.concurrent.FutureTask.run(FutureTask.java:123)
	at java.util.concurrent.ThreadPoolExecutor$Worker.runTask(ThreadPoolExecutor.java:651)
	at java.util.concurrent.ThreadPoolExecutor$Worker.run(ThreadPoolExecutor.java:676)
	at java.lang.Thread.run(Thread.java:595)
Caused by: org.apache.maven.plugin.CompilationFailureException: Compilation failure
<https://hudson.apache.org/hudson/job/james-server-trunk/ws/trunk/mailetcontainer-library/src/main/java/org/apache/james/mailetcontainer/lib/AbstractStateMailetProcessor.java>:[315,36]
package edu.umd.cs.findbugs.annotations does not exist

	at org.apache.maven.plugin.AbstractCompilerMojo.execute(AbstractCompilerMojo.java:656)
	at org.apache.maven.plugin.CompilerMojo.execute(CompilerMojo.java:128)
	at org.apache.maven.plugin.DefaultBuildPluginManager.executeMojo(DefaultBuildPluginManager.java:101)
	at org.apache.maven.lifecycle.internal.MojoExecutor.execute(MojoExecutor.java:209)
	... 27 more
Sending e-mails to: server-dev@james.apache.org
channel stopped


---------------------------------------------------------------------
To unsubscribe, e-mail: server-dev-unsubscribe@james.apache.org
For additional commands, e-mail: server-dev-help@james.apache.org


Mime
View raw message