james-server-dev mailing list archives

Site index · List index
Message view « Date » · « Thread »
Top « Date » · « Thread »
From Apache Hudson Server <hud...@hudson.apache.org>
Subject Build failed in Jenkins: mailbox-integration-tests #242
Date Fri, 08 Apr 2011 06:39:34 GMT
See <https://hudson.apache.org/hudson/job/mailbox-integration-tests/242/>

------------------------------------------
[...truncated 4104 lines...]
Actual   : '* OK [UIDVALIDITY 1691584235] UIDs valid'
Running org.apache.james.mailbox.inmemory.imap.FetchBodyStructureTest
ID=-7697939888055901074
ID=1831576754762410864
ID=362868687165861993
ID=-5951659346211530481
ID=7936829536888647724
ID=-128121556601949155
ID=-4843940041162853036
ID=1800083845696488662
ID=-7033667494817860930
ID=2129772118255000760
ID=-2381627602952450937
ID=-3720937666057542017
Tests run: 12, Failures: 0, Errors: 12, Skipped: 0, Time elapsed: 0.733 sec <<< FAILURE!
Location: /org/apache/james/imap/scripts/SelectedStateSetup.test:76
LastClientMsg: a1 SELECT selected
Expected: '\* OK \[UIDVALIDITY \d+\]'
Actual   : '* OK [UIDVALIDITY 204971669] UIDs valid'
Location: /org/apache/james/imap/scripts/SelectedStateSetup.test:76
LastClientMsg: a1 SELECT selected
Expected: '\* OK \[UIDVALIDITY \d+\]'
Actual   : '* OK [UIDVALIDITY 64888337] UIDs valid'
Location: /org/apache/james/imap/scripts/SelectedStateSetup.test:76
LastClientMsg: a1 SELECT selected
Expected: '\* OK \[UIDVALIDITY \d+\]'
Actual   : '* OK [UIDVALIDITY 837369934] UIDs valid'
Location: /org/apache/james/imap/scripts/SelectedStateSetup.test:76
LastClientMsg: a1 SELECT selected
Expected: '\* OK \[UIDVALIDITY \d+\]'
Actual   : '* OK [UIDVALIDITY 874054331] UIDs valid'
Location: /org/apache/james/imap/scripts/SelectedStateSetup.test:76
LastClientMsg: a1 SELECT selected
Expected: '\* OK \[UIDVALIDITY \d+\]'
Actual   : '* OK [UIDVALIDITY 962523471] UIDs valid'
Location: /org/apache/james/imap/scripts/SelectedStateSetup.test:76
LastClientMsg: a1 SELECT selected
Expected: '\* OK \[UIDVALIDITY \d+\]'
Actual   : '* OK [UIDVALIDITY 1118207839] UIDs valid'
Location: /org/apache/james/imap/scripts/SelectedStateSetup.test:76
LastClientMsg: a1 SELECT selected
Expected: '\* OK \[UIDVALIDITY \d+\]'
Actual   : '* OK [UIDVALIDITY 1334897039] UIDs valid'
Location: /org/apache/james/imap/scripts/SelectedStateSetup.test:76
LastClientMsg: a1 SELECT selected
Expected: '\* OK \[UIDVALIDITY \d+\]'
Actual   : '* OK [UIDVALIDITY 2030201337] UIDs valid'
Location: /org/apache/james/imap/scripts/SelectedStateSetup.test:76
LastClientMsg: a1 SELECT selected
Expected: '\* OK \[UIDVALIDITY \d+\]'
Actual   : '* OK [UIDVALIDITY 461634437] UIDs valid'
Location: /org/apache/james/imap/scripts/SelectedStateSetup.test:76
LastClientMsg: a1 SELECT selected
Expected: '\* OK \[UIDVALIDITY \d+\]'
Actual   : '* OK [UIDVALIDITY 748096598] UIDs valid'
Location: /org/apache/james/imap/scripts/SelectedStateSetup.test:76
LastClientMsg: a1 SELECT selected
Expected: '\* OK \[UIDVALIDITY \d+\]'
Actual   : '* OK [UIDVALIDITY 863680223] UIDs valid'
Location: /org/apache/james/imap/scripts/SelectedStateSetup.test:76
LastClientMsg: a1 SELECT selected
Expected: '\* OK \[UIDVALIDITY \d+\]'
Actual   : '* OK [UIDVALIDITY 210584718] UIDs valid'
Running org.apache.james.mailbox.inmemory.imap.FetchHeadersTest
ID=6072722877681826182
ID=3652637532349292647
ID=-1479994819203666041
ID=-1055373849353971272
ID=-8290071367504298400
ID=3867004642524325880
Tests run: 6, Failures: 0, Errors: 6, Skipped: 0, Time elapsed: 0.628 sec <<< FAILURE!
Location: /org/apache/james/imap/scripts/SelectedStateSetup.test:76
LastClientMsg: a1 SELECT selected
Expected: '\* OK \[UIDVALIDITY \d+\]'
Actual   : '* OK [UIDVALIDITY 599016231] UIDs valid'
Location: /org/apache/james/imap/scripts/SelectedStateSetup.test:76
LastClientMsg: a1 SELECT selected
Expected: '\* OK \[UIDVALIDITY \d+\]'
Actual   : '* OK [UIDVALIDITY 1402410880] UIDs valid'
Location: /org/apache/james/imap/scripts/SelectedStateSetup.test:76
LastClientMsg: a1 SELECT selected
Expected: '\* OK \[UIDVALIDITY \d+\]'
Actual   : '* OK [UIDVALIDITY 1322677273] UIDs valid'
Location: /org/apache/james/imap/scripts/SelectedStateSetup.test:76
LastClientMsg: a1 SELECT selected
Expected: '\* OK \[UIDVALIDITY \d+\]'
Actual   : '* OK [UIDVALIDITY 255280479] UIDs valid'
Location: /org/apache/james/imap/scripts/SelectedStateSetup.test:76
LastClientMsg: a1 SELECT selected
Expected: '\* OK \[UIDVALIDITY \d+\]'
Actual   : '* OK [UIDVALIDITY 730633756] UIDs valid'
Location: /org/apache/james/imap/scripts/SelectedStateSetup.test:76
LastClientMsg: a1 SELECT selected
Expected: '\* OK \[UIDVALIDITY \d+\]'
Actual   : '* OK [UIDVALIDITY 1943175520] UIDs valid'
Running org.apache.james.mailbox.inmemory.imap.EventTest
ID=-2169349544738547627
ID=-6293231582819067933
ID=-899996340047248940
Tests run: 3, Failures: 0, Errors: 3, Skipped: 0, Time elapsed: 0.585 sec <<< FAILURE!
Location: /org/apache/james/imap/scripts/SelectedStateSetup.test:76
LastClientMsg: a1 SELECT selected
Expected: '\* OK \[UIDVALIDITY \d+\]'
Actual   : '* OK [UIDVALIDITY 536039204] UIDs valid'
Location: /org/apache/james/imap/scripts/SelectedStateSetup.test:76
LastClientMsg: a1 SELECT selected
Expected: '\* OK \[UIDVALIDITY \d+\]'
Actual   : '* OK [UIDVALIDITY 544714432] UIDs valid'
Location: /org/apache/james/imap/scripts/SelectedStateSetup.test:76
LastClientMsg: a1 SELECT selected
Expected: '\* OK \[UIDVALIDITY \d+\]'
Actual   : '* OK [UIDVALIDITY 1208769437] UIDs valid'
Running org.apache.james.mailbox.inmemory.imap.PartialFetchTest
ID=-2603729817773534339
ID=-8261935234816316183
ID=1029235383841574519
ID=2548072653815193828
ID=-7177136252166583550
ID=-6810709086053048265
ID=3894925542025404155
ID=2858196717252263773
ID=-3135382539768491649
ID=-881943631681426410
ID=-3405670816991483157
ID=3953007632134700380
Tests run: 12, Failures: 0, Errors: 12, Skipped: 0, Time elapsed: 0.691 sec <<< FAILURE!

Results :

Tests in error: 
  testBodyPartialFetchUS(org.apache.james.mailbox.inmemory.imap.PartialFetchTest): 
Location: /org/apache/james/imap/scripts/SelectedStateSetup.test:76
LastClientMsg: a1 SELECT selected
Expected: '\* OK \[UIDVALIDITY \d+\]'
Actual   : '* OK [UIDVALIDITY 965821197] UIDs valid'
  testBodyPartialFetchIT(org.apache.james.mailbox.inmemory.imap.PartialFetchTest): 
Location: /org/apache/james/imap/scripts/SelectedStateSetup.test:76
LastClientMsg: a1 SELECT selected
Expected: '\* OK \[UIDVALIDITY \d+\]'
Actual   : '* OK [UIDVALIDITY 578567756] UIDs valid'
  testBodyPartialFetchKO(org.apache.james.mailbox.inmemory.imap.PartialFetchTest): 
Location: /org/apache/james/imap/scripts/SelectedStateSetup.test:76
LastClientMsg: a1 SELECT selected
Expected: '\* OK \[UIDVALIDITY \d+\]'
Actual   : '* OK [UIDVALIDITY 573959085] UIDs valid'
  testTextPartialFetchUS(org.apache.james.mailbox.inmemory.imap.PartialFetchTest): 
Location: /org/apache/james/imap/scripts/SelectedStateSetup.test:76
LastClientMsg: a1 SELECT selected
Expected: '\* OK \[UIDVALIDITY \d+\]'
Actual   : '* OK [UIDVALIDITY 1394022241] UIDs valid'
  testTextPartialFetchKO(org.apache.james.mailbox.inmemory.imap.PartialFetchTest): 
Location: /org/apache/james/imap/scripts/SelectedStateSetup.test:76
LastClientMsg: a1 SELECT selected
Expected: '\* OK \[UIDVALIDITY \d+\]'
Actual   : '* OK [UIDVALIDITY 819748899] UIDs valid'
  testTextPartialFetchIT(org.apache.james.mailbox.inmemory.imap.PartialFetchTest): 
Location: /org/apache/james/imap/scripts/SelectedStateSetup.test:76
LastClientMsg: a1 SELECT selected
Expected: '\* OK \[UIDVALIDITY \d+\]'
Actual   : '* OK [UIDVALIDITY 656506042] UIDs valid'
  testMimePartialFetchUS(org.apache.james.mailbox.inmemory.imap.PartialFetchTest): 
Location: /org/apache/james/imap/scripts/SelectedStateSetup.test:76
LastClientMsg: a1 SELECT selected
Expected: '\* OK \[UIDVALIDITY \d+\]'
Actual   : '* OK [UIDVALIDITY 183480698] UIDs valid'
  testMimePartialFetchIT(org.apache.james.mailbox.inmemory.imap.PartialFetchTest): 
Location: /org/apache/james/imap/scripts/SelectedStateSetup.test:76
LastClientMsg: a1 SELECT selected
Expected: '\* OK \[UIDVALIDITY \d+\]'
Actual   : '* OK [UIDVALIDITY 1131055679] UIDs valid'
  testMimePartialFetchKO(org.apache.james.mailbox.inmemory.imap.PartialFetchTest): 
Location: /org/apache/james/imap/scripts/SelectedStateSetup.test:76
LastClientMsg: a1 SELECT selected
Expected: '\* OK \[UIDVALIDITY \d+\]'
Actual   : '* OK [UIDVALIDITY 1606240636] UIDs valid'
  testHeaderPartialFetchUS(org.apache.james.mailbox.inmemory.imap.PartialFetchTest): 
Location: /org/apache/james/imap/scripts/SelectedStateSetup.test:76
LastClientMsg: a1 SELECT selected
Expected: '\* OK \[UIDVALIDITY \d+\]'
Actual   : '* OK [UIDVALIDITY 544848546] UIDs valid'
  testHeaderPartialFetchIT(org.apache.james.mailbox.inmemory.imap.PartialFetchTest): 
Location: /org/apache/james/imap/scripts/SelectedStateSetup.test:76
LastClientMsg: a1 SELECT selected
Expected: '\* OK \[UIDVALIDITY \d+\]'
Actual   : '* OK [UIDVALIDITY 1555864245] UIDs valid'
  testHeaderPartialFetchKO(org.apache.james.mailbox.inmemory.imap.PartialFetchTest): 
Location: /org/apache/james/imap/scripts/SelectedStateSetup.test:76
LastClientMsg: a1 SELECT selected
Expected: '\* OK \[UIDVALIDITY \d+\]'
Actual   : '* OK [UIDVALIDITY 1114596422] UIDs valid'

Tests run: 1158, Failures: 0, Errors: 807, Skipped: 0

mojoFailed org.apache.maven.plugins:maven-surefire-plugin:2.7.2(default-test)
[JENKINS] Recording test results
projectFailed org.apache.james:apache-james-mailbox-integration-tester:0.2-M2-SNAPSHOT
[JENKINS] Archiving <https://hudson.apache.org/hudson/job/mailbox-integration-tests/ws/pom.xml>
to /home/hudson/hudson/jobs/mailbox-integration-tests/modules/org.apache.james$apache-james-mailbox-integration-tester/builds/2011-04-08_06-32-51/archive/org.apache.james/apache-james-mailbox-integration-tester/0.2-M2-SNAPSHOT/pom.xml
sessionEnded
[INFO] ------------------------------------------------------------------------
[INFO] BUILD FAILURE
[INFO] ------------------------------------------------------------------------
[INFO] Total time: 6:26.410s
[INFO] Finished at: Thu Apr 07 22:39:29 GMT-08:00 2011
[INFO] Final Memory: 29M/170M
[INFO] ------------------------------------------------------------------------
maven builder waiting
mavenExecutionResult exceptions not empty
org.apache.maven.lifecycle.LifecycleExecutionException: Failed to execute goal org.apache.maven.plugins:maven-surefire-plugin:2.7.2:test
(default-test) on project apache-james-mailbox-integration-tester: There are test failures.

Please refer to <https://hudson.apache.org/hudson/job/mailbox-integration-tests/ws/target/surefire-reports>
for the individual test results.
	at org.apache.maven.lifecycle.internal.MojoExecutor.execute(MojoExecutor.java:213)
	at org.apache.maven.lifecycle.internal.MojoExecutor.execute(MojoExecutor.java:153)
	at org.apache.maven.lifecycle.internal.MojoExecutor.execute(MojoExecutor.java:145)
	at org.apache.maven.lifecycle.internal.LifecycleModuleBuilder.buildProject(LifecycleModuleBuilder.java:84)
	at org.apache.maven.lifecycle.internal.LifecycleModuleBuilder.buildProject(LifecycleModuleBuilder.java:59)
	at org.apache.maven.lifecycle.internal.LifecycleStarter.singleThreadedBuild(LifecycleStarter.java:183)
	at org.apache.maven.lifecycle.internal.LifecycleStarter.execute(LifecycleStarter.java:161)
	at org.apache.maven.DefaultMaven.doExecute(DefaultMaven.java:319)
	at org.apache.maven.DefaultMaven.execute(DefaultMaven.java:156)
	at org.jvnet.hudson.maven3.launcher.Maven3Launcher.main(Maven3Launcher.java:79)
	at sun.reflect.NativeMethodAccessorImpl.invoke0(Native Method)
	at sun.reflect.NativeMethodAccessorImpl.invoke(NativeMethodAccessorImpl.java:39)
	at sun.reflect.DelegatingMethodAccessorImpl.invoke(DelegatingMethodAccessorImpl.java:25)
	at java.lang.reflect.Method.invoke(Method.java:592)
	at org.codehaus.plexus.classworlds.launcher.Launcher.launchStandard(Launcher.java:329)
	at org.codehaus.plexus.classworlds.launcher.Launcher.launch(Launcher.java:239)
	at org.jvnet.hudson.maven3.agent.Maven3Main.launch(Maven3Main.java:146)
	at hudson.maven.Maven3Builder.call(Maven3Builder.java:124)
	at hudson.maven.Maven3Builder.call(Maven3Builder.java:71)
	at hudson.remoting.UserRequest.perform(UserRequest.java:114)
	at hudson.remoting.UserRequest.perform(UserRequest.java:48)
	at hudson.remoting.Request$2.run(Request.java:270)
	at java.util.concurrent.Executors$RunnableAdapter.call(Executors.java:417)
	at java.util.concurrent.FutureTask$Sync.innerRun(FutureTask.java:269)
	at java.util.concurrent.FutureTask.run(FutureTask.java:123)
	at java.util.concurrent.ThreadPoolExecutor$Worker.runTask(ThreadPoolExecutor.java:651)
	at java.util.concurrent.ThreadPoolExecutor$Worker.run(ThreadPoolExecutor.java:676)
	at java.lang.Thread.run(Thread.java:595)
Caused by: org.apache.maven.plugin.MojoFailureException: There are test failures.

Please refer to <https://hudson.apache.org/hudson/job/mailbox-integration-tests/ws/target/surefire-reports>
for the individual test results.
	at org.apache.maven.plugin.surefire.SurefireHelper.reportExecution(SurefireHelper.java:74)
	at org.apache.maven.plugin.surefire.SurefirePlugin.execute(SurefirePlugin.java:642)
	at org.apache.maven.plugin.DefaultBuildPluginManager.executeMojo(DefaultBuildPluginManager.java:101)
	at org.apache.maven.lifecycle.internal.MojoExecutor.execute(MojoExecutor.java:209)
	... 27 more
Maven failed with error.
Sending e-mails to: server-dev@james.apache.org
channel stopped


---------------------------------------------------------------------
To unsubscribe, e-mail: server-dev-unsubscribe@james.apache.org
For additional commands, e-mail: server-dev-help@james.apache.org


Mime
View raw message