james-server-dev mailing list archives

Site index · List index
Message view « Date » · « Thread »
Top « Date » · « Thread »
From Apache Hudson Server <hud...@hudson.apache.org>
Subject Build failed in Jenkins: mailbox-integration-tests #228
Date Tue, 05 Apr 2011 13:13:25 GMT
See <https://hudson.apache.org/hudson/job/mailbox-integration-tests/228/>

------------------------------------------
[...truncated 1732 lines...]
Expected: '\* 5 EXPUNGE'
Actual   : '* 6 EXPUNGE'
Running org.apache.james.mailbox.inmemory.imap.SelectedInboxTest
ID=-3672734780933115611
ID=-1611530642868755651
ID=6087328168816072230
ID=-2282978828118609738
ID=1580304234896278969
ID=-1326125030194094928
ID=-1326125030194094928
ID=-1326125030194094928
ID=-1326125030194094928
ID=-652088212985690660
ID=-652088212985690660
ID=-652088212985690660
ID=-652088212985690660
ID=-9118978704412124774
ID=6141675140299272695
ID=-2832124162649710436
ID=4507172038638245774
ID=5020079349336861566
ID=-723818894311984877
ID=6774410266493478715
ID=559185355269429294
ID=7117862962147396518
ID=-1853869145332813949
ID=6218148538953684790
ID=-1519886152156551388
ID=2210637658001693405
ID=2210637658001693405
ID=2210637658001693405
ID=2210637658001693405
ID=40099266156345029
ID=40099266156345029
ID=40099266156345029
ID=40099266156345029
ID=900405181684864899
ID=59587792486531533
ID=-7302942535520283174
ID=-5338490121121151813
ID=-8372279521367562359
ID=7795448731023562868
ID=7788074737899627525
ID=-7772617922829924384
ID=-241034563093473417
ID=4943853213315348147
ID=-3011346918689654210
ID=5429541894377541160
ID=1829496214508430611
ID=1829496214508430611
ID=1829496214508430611
ID=1829496214508430611
ID=-1301068143464266093
ID=-1301068143464266093
ID=-1301068143464266093
ID=-1301068143464266093
ID=513270947743895307
ID=-5281155563995915437
ID=7385536261129313945
ID=-3963431545831559655
ID=7962112647574892092
ID=-4899436396558647383
ID=-1698649410423943563
Tests run: 42, Failures: 0, Errors: 0, Skipped: 0, Time elapsed: 0.93 sec
Running org.apache.james.mailbox.inmemory.imap.SelectTest
ID=-7343020661065040725
ID=-7343020661065040725
ID=-7343020661065040725
ID=-7343020661065040725
ID=-7343020661065040725
ID=1282080863617928899
ID=1282080863617928899
ID=1282080863617928899
ID=1282080863617928899
ID=1282080863617928899
ID=-6776833449131485185
ID=-6776833449131485185
ID=-6776833449131485185
ID=-6776833449131485185
ID=-6776833449131485185
Tests run: 3, Failures: 0, Errors: 0, Skipped: 0, Time elapsed: 0.633 sec
Running org.apache.james.mailbox.inmemory.imap.NonAuthenticatedStateTest
Tests run: 21, Failures: 0, Errors: 0, Skipped: 0, Time elapsed: 0.382 sec
Running org.apache.james.mailbox.inmemory.imap.FetchTest
ID=-5339927726237672607
ID=-3394229769615972701
ID=5637842645393243072
ID=802405446755567081
ID=-1433191078633207581
ID=-2745237354655457400
ID=-4288926344101197242
ID=-704897503489094242
ID=9186289138573156518
ID=-8564539120785626232
ID=-1533476350997129727
ID=8593865223803643362
ID=1307860867419745683
ID=-4372920288305558901
ID=-5713989244361477159
ID=1797180707315652766
ID=2987588075239280273
ID=-3414391449143783303
ID=8828964861361425591
ID=-167422289119378503
ID=-2701715765039581560
ID=6306304214328370491
ID=6306304214328370491
ID=-198132811258817586
ID=-198132811258817586
ID=-220315798983124981
ID=-220315798983124981
Tests run: 24, Failures: 0, Errors: 0, Skipped: 0, Time elapsed: 1.19 sec
Running org.apache.james.mailbox.inmemory.imap.FetchBodyStructureTest
ID=1314574933966265033
ID=1314574933966265033
ID=-7244549486290811110
ID=-7244549486290811110
ID=-1947699240133725757
ID=-1947699240133725757
ID=6964475362553364445
ID=6964475362553364445
ID=5136222636811992996
ID=5136222636811992996
ID=8312486615442018928
ID=8312486615442018928
ID=-5742568779848167374
ID=-5742568779848167374
ID=4234231505425637526
ID=4234231505425637526
ID=-4126101744296822162
ID=-4126101744296822162
ID=-7411647651243562197
ID=-7411647651243562197
ID=-7483912960919716337
ID=-7483912960919716337
ID=2014759107010632705
ID=2014759107010632705
Tests run: 12, Failures: 0, Errors: 0, Skipped: 0, Time elapsed: 1.498 sec
Running org.apache.james.mailbox.inmemory.imap.FetchHeadersTest
ID=7803823708293013729
ID=7803823708293013729
ID=-2813304451700685480
ID=-2813304451700685480
ID=-6652436504448289696
ID=-6652436504448289696
ID=2012890605556541740
ID=2012890605556541740
ID=-1804816258125341607
ID=-1804816258125341607
ID=4409356639812171514
ID=4409356639812171514
Tests run: 6, Failures: 0, Errors: 0, Skipped: 0, Time elapsed: 0.862 sec
Running org.apache.james.mailbox.inmemory.imap.EventTest
ID=-2574171584038714482
ID=-2574171584038714482
ID=5163654487477634842
ID=5163654487477634842
ID=-159155619470692435
ID=-159155619470692435
Tests run: 3, Failures: 0, Errors: 0, Skipped: 0, Time elapsed: 0.628 sec
Running org.apache.james.mailbox.inmemory.imap.PartialFetchTest
ID=50903924554131696
ID=50903924554131696
ID=5652792169051660247
ID=5652792169051660247
ID=-6059222437186894508
ID=-6059222437186894508
ID=1414398607271182860
ID=1414398607271182860
ID=-305577434216183936
ID=-305577434216183936
ID=-915082372751587723
ID=-915082372751587723
ID=-2179728310857998566
ID=-2179728310857998566
ID=8672736298598085606
ID=8672736298598085606
ID=-3111228393385170887
ID=-3111228393385170887
ID=844792593355873891
ID=844792593355873891
ID=8479841307342645450
ID=8479841307342645450
ID=8069310616653238875
ID=8069310616653238875
Tests run: 12, Failures: 0, Errors: 0, Skipped: 0, Time elapsed: 0.946 sec

Results :

Tests in error: 

Tests run: 1158, Failures: 0, Errors: 48, Skipped: 0

mojoFailed org.apache.maven.plugins:maven-surefire-plugin:2.7.2(default-test)
[JENKINS] Recording test results
projectFailed org.apache.james:apache-james-mailbox-integration-tester:0.2-M2-SNAPSHOT
[JENKINS] Archiving <https://hudson.apache.org/hudson/job/mailbox-integration-tests/ws/pom.xml>
to /home/hudson/hudson/jobs/mailbox-integration-tests/modules/org.apache.james$apache-james-mailbox-integration-tester/builds/2011-04-05_13-05-11/archive/org.apache.james/apache-james-mailbox-integration-tester/0.2-M2-SNAPSHOT/pom.xml
sessionEnded
[INFO] ------------------------------------------------------------------------
[INFO] BUILD FAILURE
[INFO] ------------------------------------------------------------------------
[INFO] Total time: 7:56.660s
[INFO] Finished at: Tue Apr 05 05:13:21 GMT-08:00 2011
[INFO] Final Memory: 17M/147M
[INFO] ------------------------------------------------------------------------
maven builder waiting
mavenExecutionResult exceptions not empty
org.apache.maven.lifecycle.LifecycleExecutionException: Failed to execute goal org.apache.maven.plugins:maven-surefire-plugin:2.7.2:test
(default-test) on project apache-james-mailbox-integration-tester: There are test failures.

Please refer to <https://hudson.apache.org/hudson/job/mailbox-integration-tests/ws/target/surefire-reports>
for the individual test results.
	at org.apache.maven.lifecycle.internal.MojoExecutor.execute(MojoExecutor.java:213)
	at org.apache.maven.lifecycle.internal.MojoExecutor.execute(MojoExecutor.java:153)
	at org.apache.maven.lifecycle.internal.MojoExecutor.execute(MojoExecutor.java:145)
	at org.apache.maven.lifecycle.internal.LifecycleModuleBuilder.buildProject(LifecycleModuleBuilder.java:84)
	at org.apache.maven.lifecycle.internal.LifecycleModuleBuilder.buildProject(LifecycleModuleBuilder.java:59)
	at org.apache.maven.lifecycle.internal.LifecycleStarter.singleThreadedBuild(LifecycleStarter.java:183)
	at org.apache.maven.lifecycle.internal.LifecycleStarter.execute(LifecycleStarter.java:161)
	at org.apache.maven.DefaultMaven.doExecute(DefaultMaven.java:319)
	at org.apache.maven.DefaultMaven.execute(DefaultMaven.java:156)
	at org.jvnet.hudson.maven3.launcher.Maven3Launcher.main(Maven3Launcher.java:79)
	at sun.reflect.NativeMethodAccessorImpl.invoke0(Native Method)
	at sun.reflect.NativeMethodAccessorImpl.invoke(NativeMethodAccessorImpl.java:39)
	at sun.reflect.DelegatingMethodAccessorImpl.invoke(DelegatingMethodAccessorImpl.java:25)
	at java.lang.reflect.Method.invoke(Method.java:592)
	at org.codehaus.plexus.classworlds.launcher.Launcher.launchStandard(Launcher.java:329)
	at org.codehaus.plexus.classworlds.launcher.Launcher.launch(Launcher.java:239)
	at org.jvnet.hudson.maven3.agent.Maven3Main.launch(Maven3Main.java:146)
	at hudson.maven.Maven3Builder.call(Maven3Builder.java:124)
	at hudson.maven.Maven3Builder.call(Maven3Builder.java:71)
	at hudson.remoting.UserRequest.perform(UserRequest.java:114)
	at hudson.remoting.UserRequest.perform(UserRequest.java:48)
	at hudson.remoting.Request$2.run(Request.java:270)
	at java.util.concurrent.Executors$RunnableAdapter.call(Executors.java:417)
	at java.util.concurrent.FutureTask$Sync.innerRun(FutureTask.java:269)
	at java.util.concurrent.FutureTask.run(FutureTask.java:123)
	at java.util.concurrent.ThreadPoolExecutor$Worker.runTask(ThreadPoolExecutor.java:651)
	at java.util.concurrent.ThreadPoolExecutor$Worker.run(ThreadPoolExecutor.java:676)
	at java.lang.Thread.run(Thread.java:595)
Caused by: org.apache.maven.plugin.MojoFailureException: There are test failures.

Please refer to <https://hudson.apache.org/hudson/job/mailbox-integration-tests/ws/target/surefire-reports>
for the individual test results.
	at org.apache.maven.plugin.surefire.SurefireHelper.reportExecution(SurefireHelper.java:74)
	at org.apache.maven.plugin.surefire.SurefirePlugin.execute(SurefirePlugin.java:642)
	at org.apache.maven.plugin.DefaultBuildPluginManager.executeMojo(DefaultBuildPluginManager.java:101)
	at org.apache.maven.lifecycle.internal.MojoExecutor.execute(MojoExecutor.java:209)
	... 27 more
Maven failed with error.
Sending e-mails to: server-dev@james.apache.org
channel stopped


---------------------------------------------------------------------
To unsubscribe, e-mail: server-dev-unsubscribe@james.apache.org
For additional commands, e-mail: server-dev-help@james.apache.org


Mime
View raw message