james-server-dev mailing list archives

Site index · List index
Message view « Date » · « Thread »
Top « Date » · « Thread »
From Apache Hudson Server <hud...@hudson.apache.org>
Subject Build failed in Jenkins: mailbox-integration-tests #246
Date Fri, 08 Apr 2011 16:22:35 GMT
See <https://hudson.apache.org/hudson/job/mailbox-integration-tests/246/>

------------------------------------------
[...truncated 3297 lines...]
Expected: '\* OK \[UIDVALIDITY \d+\]'
Actual   : '* OK [UIDVALIDITY 1220311962] UIDs valid'
Location: /org/apache/james/imap/scripts/SelectedStateSetup.test:76
LastClientMsg: a1 SELECT selected
Expected: '\* OK \[UIDVALIDITY \d+\]'
Actual   : '* OK [UIDVALIDITY 284532767] UIDs valid'
Location: /org/apache/james/imap/scripts/SelectedStateSetup.test:76
LastClientMsg: a1 SELECT selected
Expected: '\* OK \[UIDVALIDITY \d+\]'
Actual   : '* OK [UIDVALIDITY 540136749] UIDs valid'
Location: /org/apache/james/imap/scripts/SelectedStateSetup.test:76
LastClientMsg: a1 SELECT selected
Expected: '\* OK \[UIDVALIDITY \d+\]'
Actual   : '* OK [UIDVALIDITY 2106950522] UIDs valid'
Location: /org/apache/james/imap/scripts/SelectedStateSetup.test:76
LastClientMsg: a1 SELECT selected
Expected: '\* OK \[UIDVALIDITY \d+\]'
Actual   : '* OK [UIDVALIDITY 852181867] UIDs valid'
Location: /org/apache/james/imap/scripts/SelectedStateSetup.test:76
LastClientMsg: a1 SELECT selected
Expected: '\* OK \[UIDVALIDITY \d+\]'
Actual   : '* OK [UIDVALIDITY 2128437658] UIDs valid'
Location: /org/apache/james/imap/scripts/SelectedStateSetup.test:76
LastClientMsg: a1 SELECT selected
Expected: '\* OK \[UIDVALIDITY \d+\]'
Actual   : '* OK [UIDVALIDITY 987649772] UIDs valid'
Location: /org/apache/james/imap/scripts/SelectedStateSetup.test:76
LastClientMsg: a1 SELECT selected
Expected: '\* OK \[UIDVALIDITY \d+\]'
Actual   : '* OK [UIDVALIDITY 1291271641] UIDs valid'
Location: /org/apache/james/imap/scripts/SelectedStateSetup.test:76
LastClientMsg: a1 SELECT selected
Expected: '\* OK \[UIDVALIDITY \d+\]'
Actual   : '* OK [UIDVALIDITY 126531747] UIDs valid'
Running org.apache.james.mailbox.inmemory.imap.FetchBodyStructureTest
Tests run: 12, Failures: 0, Errors: 12, Skipped: 0, Time elapsed: 0.771 sec <<< FAILURE!
Location: /org/apache/james/imap/scripts/SelectedStateSetup.test:76
LastClientMsg: a1 SELECT selected
Expected: '\* OK \[UIDVALIDITY \d+\]'
Actual   : '* OK [UIDVALIDITY 164642091] UIDs valid'
Location: /org/apache/james/imap/scripts/SelectedStateSetup.test:76
LastClientMsg: a1 SELECT selected
Expected: '\* OK \[UIDVALIDITY \d+\]'
Actual   : '* OK [UIDVALIDITY 399104439] UIDs valid'
Location: /org/apache/james/imap/scripts/SelectedStateSetup.test:76
LastClientMsg: a1 SELECT selected
Expected: '\* OK \[UIDVALIDITY \d+\]'
Actual   : '* OK [UIDVALIDITY 667480340] UIDs valid'
Location: /org/apache/james/imap/scripts/SelectedStateSetup.test:76
LastClientMsg: a1 SELECT selected
Expected: '\* OK \[UIDVALIDITY \d+\]'
Actual   : '* OK [UIDVALIDITY 332936304] UIDs valid'
Location: /org/apache/james/imap/scripts/SelectedStateSetup.test:76
LastClientMsg: a1 SELECT selected
Expected: '\* OK \[UIDVALIDITY \d+\]'
Actual   : '* OK [UIDVALIDITY 1129961691] UIDs valid'
Location: /org/apache/james/imap/scripts/SelectedStateSetup.test:76
LastClientMsg: a1 SELECT selected
Expected: '\* OK \[UIDVALIDITY \d+\]'
Actual   : '* OK [UIDVALIDITY 1651029200] UIDs valid'
Location: /org/apache/james/imap/scripts/SelectedStateSetup.test:76
LastClientMsg: a1 SELECT selected
Expected: '\* OK \[UIDVALIDITY \d+\]'
Actual   : '* OK [UIDVALIDITY 2089180374] UIDs valid'
Location: /org/apache/james/imap/scripts/SelectedStateSetup.test:76
LastClientMsg: a1 SELECT selected
Expected: '\* OK \[UIDVALIDITY \d+\]'
Actual   : '* OK [UIDVALIDITY 1783118432] UIDs valid'
Location: /org/apache/james/imap/scripts/SelectedStateSetup.test:76
LastClientMsg: a1 SELECT selected
Expected: '\* OK \[UIDVALIDITY \d+\]'
Actual   : '* OK [UIDVALIDITY 221012079] UIDs valid'
Location: /org/apache/james/imap/scripts/SelectedStateSetup.test:76
LastClientMsg: a1 SELECT selected
Expected: '\* OK \[UIDVALIDITY \d+\]'
Actual   : '* OK [UIDVALIDITY 1843003565] UIDs valid'
Location: /org/apache/james/imap/scripts/SelectedStateSetup.test:76
LastClientMsg: a1 SELECT selected
Expected: '\* OK \[UIDVALIDITY \d+\]'
Actual   : '* OK [UIDVALIDITY 1897564207] UIDs valid'
Location: /org/apache/james/imap/scripts/SelectedStateSetup.test:76
LastClientMsg: a1 SELECT selected
Expected: '\* OK \[UIDVALIDITY \d+\]'
Actual   : '* OK [UIDVALIDITY 1963444960] UIDs valid'
Running org.apache.james.mailbox.inmemory.imap.FetchHeadersTest
Tests run: 6, Failures: 0, Errors: 6, Skipped: 0, Time elapsed: 0.642 sec <<< FAILURE!
Location: /org/apache/james/imap/scripts/SelectedStateSetup.test:76
LastClientMsg: a1 SELECT selected
Expected: '\* OK \[UIDVALIDITY \d+\]'
Actual   : '* OK [UIDVALIDITY 80422513] UIDs valid'
Location: /org/apache/james/imap/scripts/SelectedStateSetup.test:76
LastClientMsg: a1 SELECT selected
Expected: '\* OK \[UIDVALIDITY \d+\]'
Actual   : '* OK [UIDVALIDITY 926546961] UIDs valid'
Location: /org/apache/james/imap/scripts/SelectedStateSetup.test:76
LastClientMsg: a1 SELECT selected
Expected: '\* OK \[UIDVALIDITY \d+\]'
Actual   : '* OK [UIDVALIDITY 2123264823] UIDs valid'
Location: /org/apache/james/imap/scripts/SelectedStateSetup.test:76
LastClientMsg: a1 SELECT selected
Expected: '\* OK \[UIDVALIDITY \d+\]'
Actual   : '* OK [UIDVALIDITY 1115451870] UIDs valid'
Location: /org/apache/james/imap/scripts/SelectedStateSetup.test:76
LastClientMsg: a1 SELECT selected
Expected: '\* OK \[UIDVALIDITY \d+\]'
Actual   : '* OK [UIDVALIDITY 1329997214] UIDs valid'
Location: /org/apache/james/imap/scripts/SelectedStateSetup.test:76
LastClientMsg: a1 SELECT selected
Expected: '\* OK \[UIDVALIDITY \d+\]'
Actual   : '* OK [UIDVALIDITY 1429838053] UIDs valid'
Running org.apache.james.mailbox.inmemory.imap.EventTest
Tests run: 3, Failures: 0, Errors: 3, Skipped: 0, Time elapsed: 0.6 sec <<< FAILURE!
Location: /org/apache/james/imap/scripts/SelectedStateSetup.test:76
LastClientMsg: a1 SELECT selected
Expected: '\* OK \[UIDVALIDITY \d+\]'
Actual   : '* OK [UIDVALIDITY 1058215896] UIDs valid'
Location: /org/apache/james/imap/scripts/SelectedStateSetup.test:76
LastClientMsg: a1 SELECT selected
Expected: '\* OK \[UIDVALIDITY \d+\]'
Actual   : '* OK [UIDVALIDITY 1324832497] UIDs valid'
Location: /org/apache/james/imap/scripts/SelectedStateSetup.test:76
LastClientMsg: a1 SELECT selected
Expected: '\* OK \[UIDVALIDITY \d+\]'
Actual   : '* OK [UIDVALIDITY 1265977296] UIDs valid'
Running org.apache.james.mailbox.inmemory.imap.PartialFetchTest
Tests run: 12, Failures: 0, Errors: 12, Skipped: 0, Time elapsed: 0.708 sec <<< FAILURE!

Results :

Tests in error: 
  testBodyPartialFetchUS(org.apache.james.mailbox.inmemory.imap.PartialFetchTest): 
Location: /org/apache/james/imap/scripts/SelectedStateSetup.test:76
LastClientMsg: a1 SELECT selected
Expected: '\* OK \[UIDVALIDITY \d+\]'
Actual   : '* OK [UIDVALIDITY 1834565151] UIDs valid'
  testBodyPartialFetchIT(org.apache.james.mailbox.inmemory.imap.PartialFetchTest): 
Location: /org/apache/james/imap/scripts/SelectedStateSetup.test:76
LastClientMsg: a1 SELECT selected
Expected: '\* OK \[UIDVALIDITY \d+\]'
Actual   : '* OK [UIDVALIDITY 795030755] UIDs valid'
  testBodyPartialFetchKO(org.apache.james.mailbox.inmemory.imap.PartialFetchTest): 
Location: /org/apache/james/imap/scripts/SelectedStateSetup.test:76
LastClientMsg: a1 SELECT selected
Expected: '\* OK \[UIDVALIDITY \d+\]'
Actual   : '* OK [UIDVALIDITY 833774037] UIDs valid'
  testTextPartialFetchUS(org.apache.james.mailbox.inmemory.imap.PartialFetchTest): 
Location: /org/apache/james/imap/scripts/SelectedStateSetup.test:76
LastClientMsg: a1 SELECT selected
Expected: '\* OK \[UIDVALIDITY \d+\]'
Actual   : '* OK [UIDVALIDITY 1316566880] UIDs valid'
  testTextPartialFetchKO(org.apache.james.mailbox.inmemory.imap.PartialFetchTest): 
Location: /org/apache/james/imap/scripts/SelectedStateSetup.test:76
LastClientMsg: a1 SELECT selected
Expected: '\* OK \[UIDVALIDITY \d+\]'
Actual   : '* OK [UIDVALIDITY 66169972] UIDs valid'
  testTextPartialFetchIT(org.apache.james.mailbox.inmemory.imap.PartialFetchTest): 
Location: /org/apache/james/imap/scripts/SelectedStateSetup.test:76
LastClientMsg: a1 SELECT selected
Expected: '\* OK \[UIDVALIDITY \d+\]'
Actual   : '* OK [UIDVALIDITY 218435815] UIDs valid'
  testMimePartialFetchUS(org.apache.james.mailbox.inmemory.imap.PartialFetchTest): 
Location: /org/apache/james/imap/scripts/SelectedStateSetup.test:76
LastClientMsg: a1 SELECT selected
Expected: '\* OK \[UIDVALIDITY \d+\]'
Actual   : '* OK [UIDVALIDITY 241573436] UIDs valid'
  testMimePartialFetchIT(org.apache.james.mailbox.inmemory.imap.PartialFetchTest): 
Location: /org/apache/james/imap/scripts/SelectedStateSetup.test:76
LastClientMsg: a1 SELECT selected
Expected: '\* OK \[UIDVALIDITY \d+\]'
Actual   : '* OK [UIDVALIDITY 1860258589] UIDs valid'
  testMimePartialFetchKO(org.apache.james.mailbox.inmemory.imap.PartialFetchTest): 
Location: /org/apache/james/imap/scripts/SelectedStateSetup.test:76
LastClientMsg: a1 SELECT selected
Expected: '\* OK \[UIDVALIDITY \d+\]'
Actual   : '* OK [UIDVALIDITY 727285849] UIDs valid'
  testHeaderPartialFetchUS(org.apache.james.mailbox.inmemory.imap.PartialFetchTest): 
Location: /org/apache/james/imap/scripts/SelectedStateSetup.test:76
LastClientMsg: a1 SELECT selected
Expected: '\* OK \[UIDVALIDITY \d+\]'
Actual   : '* OK [UIDVALIDITY 1106740096] UIDs valid'
  testHeaderPartialFetchIT(org.apache.james.mailbox.inmemory.imap.PartialFetchTest): 
Location: /org/apache/james/imap/scripts/SelectedStateSetup.test:76
LastClientMsg: a1 SELECT selected
Expected: '\* OK \[UIDVALIDITY \d+\]'
Actual   : '* OK [UIDVALIDITY 704167832] UIDs valid'
  testHeaderPartialFetchKO(org.apache.james.mailbox.inmemory.imap.PartialFetchTest): 
Location: /org/apache/james/imap/scripts/SelectedStateSetup.test:76
LastClientMsg: a1 SELECT selected
Expected: '\* OK \[UIDVALIDITY \d+\]'
Actual   : '* OK [UIDVALIDITY 1093992552] UIDs valid'

Tests run: 1158, Failures: 0, Errors: 807, Skipped: 0

mojoFailed org.apache.maven.plugins:maven-surefire-plugin:2.7.2(default-test)
[JENKINS] Recording test results
projectFailed org.apache.james:apache-james-mailbox-integration-tester:0.2-M2-SNAPSHOT
[JENKINS] Archiving <https://hudson.apache.org/hudson/job/mailbox-integration-tests/ws/pom.xml>
to /home/hudson/hudson/jobs/mailbox-integration-tests/modules/org.apache.james$apache-james-mailbox-integration-tester/builds/2011-04-08_16-15-34/archive/org.apache.james/apache-james-mailbox-integration-tester/0.2-M2-SNAPSHOT/pom.xml
sessionEnded
[INFO] ------------------------------------------------------------------------
[INFO] BUILD FAILURE
[INFO] ------------------------------------------------------------------------
[INFO] Total time: 6:44.186s
[INFO] Finished at: Fri Apr 08 08:22:29 GMT-08:00 2011
[INFO] Final Memory: 29M/207M
[INFO] ------------------------------------------------------------------------
maven builder waiting
mavenExecutionResult exceptions not empty
org.apache.maven.lifecycle.LifecycleExecutionException: Failed to execute goal org.apache.maven.plugins:maven-surefire-plugin:2.7.2:test
(default-test) on project apache-james-mailbox-integration-tester: There are test failures.

Please refer to <https://hudson.apache.org/hudson/job/mailbox-integration-tests/ws/target/surefire-reports>
for the individual test results.
	at org.apache.maven.lifecycle.internal.MojoExecutor.execute(MojoExecutor.java:213)
	at org.apache.maven.lifecycle.internal.MojoExecutor.execute(MojoExecutor.java:153)
	at org.apache.maven.lifecycle.internal.MojoExecutor.execute(MojoExecutor.java:145)
	at org.apache.maven.lifecycle.internal.LifecycleModuleBuilder.buildProject(LifecycleModuleBuilder.java:84)
	at org.apache.maven.lifecycle.internal.LifecycleModuleBuilder.buildProject(LifecycleModuleBuilder.java:59)
	at org.apache.maven.lifecycle.internal.LifecycleStarter.singleThreadedBuild(LifecycleStarter.java:183)
	at org.apache.maven.lifecycle.internal.LifecycleStarter.execute(LifecycleStarter.java:161)
	at org.apache.maven.DefaultMaven.doExecute(DefaultMaven.java:319)
	at org.apache.maven.DefaultMaven.execute(DefaultMaven.java:156)
	at org.jvnet.hudson.maven3.launcher.Maven3Launcher.main(Maven3Launcher.java:79)
	at sun.reflect.NativeMethodAccessorImpl.invoke0(Native Method)
	at sun.reflect.NativeMethodAccessorImpl.invoke(NativeMethodAccessorImpl.java:39)
	at sun.reflect.DelegatingMethodAccessorImpl.invoke(DelegatingMethodAccessorImpl.java:25)
	at java.lang.reflect.Method.invoke(Method.java:592)
	at org.codehaus.plexus.classworlds.launcher.Launcher.launchStandard(Launcher.java:329)
	at org.codehaus.plexus.classworlds.launcher.Launcher.launch(Launcher.java:239)
	at org.jvnet.hudson.maven3.agent.Maven3Main.launch(Maven3Main.java:146)
	at hudson.maven.Maven3Builder.call(Maven3Builder.java:124)
	at hudson.maven.Maven3Builder.call(Maven3Builder.java:71)
	at hudson.remoting.UserRequest.perform(UserRequest.java:114)
	at hudson.remoting.UserRequest.perform(UserRequest.java:48)
	at hudson.remoting.Request$2.run(Request.java:270)
	at java.util.concurrent.Executors$RunnableAdapter.call(Executors.java:417)
	at java.util.concurrent.FutureTask$Sync.innerRun(FutureTask.java:269)
	at java.util.concurrent.FutureTask.run(FutureTask.java:123)
	at java.util.concurrent.ThreadPoolExecutor$Worker.runTask(ThreadPoolExecutor.java:651)
	at java.util.concurrent.ThreadPoolExecutor$Worker.run(ThreadPoolExecutor.java:676)
	at java.lang.Thread.run(Thread.java:595)
Caused by: org.apache.maven.plugin.MojoFailureException: There are test failures.

Please refer to <https://hudson.apache.org/hudson/job/mailbox-integration-tests/ws/target/surefire-reports>
for the individual test results.
	at org.apache.maven.plugin.surefire.SurefireHelper.reportExecution(SurefireHelper.java:74)
	at org.apache.maven.plugin.surefire.SurefirePlugin.execute(SurefirePlugin.java:642)
	at org.apache.maven.plugin.DefaultBuildPluginManager.executeMojo(DefaultBuildPluginManager.java:101)
	at org.apache.maven.lifecycle.internal.MojoExecutor.execute(MojoExecutor.java:209)
	... 27 more
Maven failed with error.
Sending e-mails to: server-dev@james.apache.org
channel stopped


---------------------------------------------------------------------
To unsubscribe, e-mail: server-dev-unsubscribe@james.apache.org
For additional commands, e-mail: server-dev-help@james.apache.org


Mime
View raw message