james-server-dev mailing list archives

Site index · List index
Message view « Date » · « Thread »
Top « Date » · « Thread »
From Apache Hudson Server <hud...@hudson.apache.org>
Subject Build failed in Jenkins: mailbox-integration-tests #234
Date Thu, 07 Apr 2011 04:45:21 GMT
See <https://hudson.apache.org/hudson/job/mailbox-integration-tests/234/>

------------------------------------------
[...truncated 1682 lines...]
Expected: '\* 5 EXPUNGE'
Actual   : '* 6 EXPUNGE'
Running org.apache.james.mailbox.inmemory.imap.SelectedInboxTest
ID=-1550090657540176821
ID=-7403523598556544066
ID=8999899856654205200
ID=1459326936056737151
ID=-8861050865177165429
ID=-4328363632071440146
ID=-4328363632071440146
ID=-4328363632071440146
ID=-4328363632071440146
ID=-3549086657068857296
ID=-3549086657068857296
ID=-3549086657068857296
ID=-3549086657068857296
ID=5717044123052167160
ID=-6465898880986947580
ID=626531502360171227
ID=-4711443379374413612
ID=248227194655001308
ID=3671969035384561784
ID=-2038149059115112416
ID=6358432520788553488
ID=-6755762859677171038
ID=-9015093025277526021
ID=928638702580269489
ID=-7357471074854893502
ID=2105145814660631485
ID=2105145814660631485
ID=2105145814660631485
ID=2105145814660631485
ID=3608806771042508942
ID=3608806771042508942
ID=3608806771042508942
ID=3608806771042508942
ID=-1494131563012265124
ID=9054664760084263139
ID=7829009457421624819
ID=4119852175510553398
ID=4609664468420344513
ID=-4002392846431680953
ID=4240661412314739383
ID=-6751180228568816881
ID=1741290802921816452
ID=-9208854215727307322
ID=2947103397391968210
ID=1907375014161141157
ID=8926280781484992406
ID=8926280781484992406
ID=8926280781484992406
ID=8926280781484992406
ID=-2960437201798250890
ID=-2960437201798250890
ID=-2960437201798250890
ID=-2960437201798250890
ID=-3187483876199160314
ID=-8823022447699709094
ID=1091262323419438590
ID=-7873492798658489726
ID=-7747827613294554625
ID=6661098302071332883
ID=-2826972612820855559
Tests run: 42, Failures: 0, Errors: 0, Skipped: 0, Time elapsed: 0.998 sec
Running org.apache.james.mailbox.inmemory.imap.SelectTest
ID=-5415862737086092202
ID=-5415862737086092202
ID=-5415862737086092202
ID=-5415862737086092202
ID=-5415862737086092202
ID=8374556806064400111
ID=8374556806064400111
ID=8374556806064400111
ID=8374556806064400111
ID=8374556806064400111
ID=9140979653474760818
ID=9140979653474760818
ID=9140979653474760818
ID=9140979653474760818
ID=9140979653474760818
Tests run: 3, Failures: 0, Errors: 0, Skipped: 0, Time elapsed: 0.626 sec
Running org.apache.james.mailbox.inmemory.imap.NonAuthenticatedStateTest
Tests run: 21, Failures: 0, Errors: 0, Skipped: 0, Time elapsed: 0.378 sec
Running org.apache.james.mailbox.inmemory.imap.FetchTest
ID=-7620336942268837291
ID=8458893980088777519
ID=-7508243510828661282
ID=8040342486933077187
ID=-2792490477508838324
ID=4576217807968838018
ID=-1039872679344256900
ID=-2040496265268602135
ID=-8647816668035961205
ID=7773473842680640438
ID=-3716930779856358443
ID=7100616535505821670
ID=4473349879837175545
ID=-6568734186666586956
ID=-7979986723261655086
ID=-7323110928132198241
ID=-4239149917498304642
ID=-181145930199114909
ID=-4969788748208777126
ID=-6537608335719856642
ID=-2363879776256109054
ID=156460326174515884
ID=156460326174515884
ID=-4982266968100214110
ID=-4982266968100214110
ID=-6889475393441205893
ID=-6889475393441205893
Tests run: 24, Failures: 0, Errors: 0, Skipped: 0, Time elapsed: 1.142 sec
Running org.apache.james.mailbox.inmemory.imap.FetchBodyStructureTest
ID=-1750732884868463193
ID=-1750732884868463193
ID=7115333338497744105
ID=7115333338497744105
ID=-1188384578580894318
ID=-1188384578580894318
ID=3546611018929210012
ID=3546611018929210012
ID=5048508546204832846
ID=5048508546204832846
ID=-6033602638700117794
ID=-6033602638700117794
ID=-6696075786935498725
ID=-6696075786935498725
ID=-5701849858096422650
ID=-5701849858096422650
ID=-177894484274444514
ID=-177894484274444514
ID=320202449441704649
ID=320202449441704649
ID=8449686674347029650
ID=8449686674347029650
ID=1666082140158913072
ID=1666082140158913072
Tests run: 12, Failures: 0, Errors: 0, Skipped: 0, Time elapsed: 1.671 sec
Running org.apache.james.mailbox.inmemory.imap.FetchHeadersTest
ID=8356685243208410641
ID=8356685243208410641
ID=-7202057288311038611
ID=-7202057288311038611
ID=5531178994550393441
ID=5531178994550393441
ID=8040684863393388615
ID=8040684863393388615
ID=1077196432023175009
ID=1077196432023175009
ID=-439541785032484897
ID=-439541785032484897
Tests run: 6, Failures: 0, Errors: 0, Skipped: 0, Time elapsed: 0.791 sec
Running org.apache.james.mailbox.inmemory.imap.EventTest
ID=3376759381953896416
ID=3376759381953896416
ID=4194451082406920059
ID=4194451082406920059
ID=-6709231733198144594
ID=-6709231733198144594
Tests run: 3, Failures: 0, Errors: 0, Skipped: 0, Time elapsed: 0.612 sec
Running org.apache.james.mailbox.inmemory.imap.PartialFetchTest
ID=-373858496755707426
ID=-373858496755707426
ID=3901546951919090066
ID=3901546951919090066
ID=-3014158525392560629
ID=-3014158525392560629
ID=964892238664461687
ID=964892238664461687
ID=-4490225451140610900
ID=-4490225451140610900
ID=7229884333142735941
ID=7229884333142735941
ID=8560982421881889156
ID=8560982421881889156
ID=7901311449005677897
ID=7901311449005677897
ID=5972949890035322625
ID=5972949890035322625
ID=2992961294710573800
ID=2992961294710573800
ID=-6952230946620211002
ID=-6952230946620211002
ID=-4885573792763750015
ID=-4885573792763750015
Tests run: 12, Failures: 0, Errors: 0, Skipped: 0, Time elapsed: 1.006 sec

Results :

Tests in error: 

Tests run: 1158, Failures: 0, Errors: 48, Skipped: 0

mojoFailed org.apache.maven.plugins:maven-surefire-plugin:2.7.2(default-test)
[JENKINS] Recording test results
projectFailed org.apache.james:apache-james-mailbox-integration-tester:0.2-M2-SNAPSHOT
[JENKINS] Archiving <https://hudson.apache.org/hudson/job/mailbox-integration-tests/ws/pom.xml>
to /home/hudson/hudson/jobs/mailbox-integration-tests/modules/org.apache.james$apache-james-mailbox-integration-tester/builds/2011-04-07_04-37-13/archive/org.apache.james/apache-james-mailbox-integration-tester/0.2-M2-SNAPSHOT/pom.xml
sessionEnded
[INFO] ------------------------------------------------------------------------
[INFO] BUILD FAILURE
[INFO] ------------------------------------------------------------------------
[INFO] Total time: 7:52.395s
[INFO] Finished at: Wed Apr 06 20:45:17 GMT-08:00 2011
[INFO] Final Memory: 18M/146M
[INFO] ------------------------------------------------------------------------
maven builder waiting
mavenExecutionResult exceptions not empty
org.apache.maven.lifecycle.LifecycleExecutionException: Failed to execute goal org.apache.maven.plugins:maven-surefire-plugin:2.7.2:test
(default-test) on project apache-james-mailbox-integration-tester: There are test failures.

Please refer to <https://hudson.apache.org/hudson/job/mailbox-integration-tests/ws/target/surefire-reports>
for the individual test results.
	at org.apache.maven.lifecycle.internal.MojoExecutor.execute(MojoExecutor.java:213)
	at org.apache.maven.lifecycle.internal.MojoExecutor.execute(MojoExecutor.java:153)
	at org.apache.maven.lifecycle.internal.MojoExecutor.execute(MojoExecutor.java:145)
	at org.apache.maven.lifecycle.internal.LifecycleModuleBuilder.buildProject(LifecycleModuleBuilder.java:84)
	at org.apache.maven.lifecycle.internal.LifecycleModuleBuilder.buildProject(LifecycleModuleBuilder.java:59)
	at org.apache.maven.lifecycle.internal.LifecycleStarter.singleThreadedBuild(LifecycleStarter.java:183)
	at org.apache.maven.lifecycle.internal.LifecycleStarter.execute(LifecycleStarter.java:161)
	at org.apache.maven.DefaultMaven.doExecute(DefaultMaven.java:319)
	at org.apache.maven.DefaultMaven.execute(DefaultMaven.java:156)
	at org.jvnet.hudson.maven3.launcher.Maven3Launcher.main(Maven3Launcher.java:79)
	at sun.reflect.NativeMethodAccessorImpl.invoke0(Native Method)
	at sun.reflect.NativeMethodAccessorImpl.invoke(NativeMethodAccessorImpl.java:39)
	at sun.reflect.DelegatingMethodAccessorImpl.invoke(DelegatingMethodAccessorImpl.java:25)
	at java.lang.reflect.Method.invoke(Method.java:592)
	at org.codehaus.plexus.classworlds.launcher.Launcher.launchStandard(Launcher.java:329)
	at org.codehaus.plexus.classworlds.launcher.Launcher.launch(Launcher.java:239)
	at org.jvnet.hudson.maven3.agent.Maven3Main.launch(Maven3Main.java:146)
	at hudson.maven.Maven3Builder.call(Maven3Builder.java:124)
	at hudson.maven.Maven3Builder.call(Maven3Builder.java:71)
	at hudson.remoting.UserRequest.perform(UserRequest.java:114)
	at hudson.remoting.UserRequest.perform(UserRequest.java:48)
	at hudson.remoting.Request$2.run(Request.java:270)
	at java.util.concurrent.Executors$RunnableAdapter.call(Executors.java:417)
	at java.util.concurrent.FutureTask$Sync.innerRun(FutureTask.java:269)
	at java.util.concurrent.FutureTask.run(FutureTask.java:123)
	at java.util.concurrent.ThreadPoolExecutor$Worker.runTask(ThreadPoolExecutor.java:651)
	at java.util.concurrent.ThreadPoolExecutor$Worker.run(ThreadPoolExecutor.java:676)
	at java.lang.Thread.run(Thread.java:595)
Caused by: org.apache.maven.plugin.MojoFailureException: There are test failures.

Please refer to <https://hudson.apache.org/hudson/job/mailbox-integration-tests/ws/target/surefire-reports>
for the individual test results.
	at org.apache.maven.plugin.surefire.SurefireHelper.reportExecution(SurefireHelper.java:74)
	at org.apache.maven.plugin.surefire.SurefirePlugin.execute(SurefirePlugin.java:642)
	at org.apache.maven.plugin.DefaultBuildPluginManager.executeMojo(DefaultBuildPluginManager.java:101)
	at org.apache.maven.lifecycle.internal.MojoExecutor.execute(MojoExecutor.java:209)
	... 27 more
Maven failed with error.
Sending e-mails to: server-dev@james.apache.org
channel stopped


---------------------------------------------------------------------
To unsubscribe, e-mail: server-dev-unsubscribe@james.apache.org
For additional commands, e-mail: server-dev-help@james.apache.org


Mime
View raw message