james-server-dev mailing list archives

Site index · List index
Message view « Date » · « Thread »
Top « Date » · « Thread »
From Apache Hudson Server <hud...@hudson.apache.org>
Subject Build failed in Jenkins: mailbox-integration-tests #241
Date Fri, 08 Apr 2011 05:10:34 GMT
See <https://hudson.apache.org/hudson/job/mailbox-integration-tests/241/>

------------------------------------------
[...truncated 4106 lines...]
Actual   : '* OK [UIDVALIDITY 1928941075] UIDs valid'
Running org.apache.james.mailbox.inmemory.imap.FetchBodyStructureTest
ID=-5356803491869297078
ID=4482252113323815115
ID=-5369237170532924285
ID=3079507313311916040
ID=5186939924053332737
ID=5832612101157362862
ID=-479855518675563936
ID=8928559185248036348
ID=-9108128766056319876
ID=1638683885153797230
ID=2461733320185826419
ID=-8031629546805651007
Tests run: 12, Failures: 0, Errors: 12, Skipped: 0, Time elapsed: 0.748 sec <<< FAILURE!
Location: /org/apache/james/imap/scripts/SelectedStateSetup.test:76
LastClientMsg: a1 SELECT selected
Expected: '\* OK \[UIDVALIDITY \d+\]'
Actual   : '* OK [UIDVALIDITY 1003781511] UIDs valid'
Location: /org/apache/james/imap/scripts/SelectedStateSetup.test:76
LastClientMsg: a1 SELECT selected
Expected: '\* OK \[UIDVALIDITY \d+\]'
Actual   : '* OK [UIDVALIDITY 1173708509] UIDs valid'
Location: /org/apache/james/imap/scripts/SelectedStateSetup.test:76
LastClientMsg: a1 SELECT selected
Expected: '\* OK \[UIDVALIDITY \d+\]'
Actual   : '* OK [UIDVALIDITY 1972127477] UIDs valid'
Location: /org/apache/james/imap/scripts/SelectedStateSetup.test:76
LastClientMsg: a1 SELECT selected
Expected: '\* OK \[UIDVALIDITY \d+\]'
Actual   : '* OK [UIDVALIDITY 1869852633] UIDs valid'
Location: /org/apache/james/imap/scripts/SelectedStateSetup.test:76
LastClientMsg: a1 SELECT selected
Expected: '\* OK \[UIDVALIDITY \d+\]'
Actual   : '* OK [UIDVALIDITY 145222100] UIDs valid'
Location: /org/apache/james/imap/scripts/SelectedStateSetup.test:76
LastClientMsg: a1 SELECT selected
Expected: '\* OK \[UIDVALIDITY \d+\]'
Actual   : '* OK [UIDVALIDITY 467934306] UIDs valid'
Location: /org/apache/james/imap/scripts/SelectedStateSetup.test:76
LastClientMsg: a1 SELECT selected
Expected: '\* OK \[UIDVALIDITY \d+\]'
Actual   : '* OK [UIDVALIDITY 1148484503] UIDs valid'
Location: /org/apache/james/imap/scripts/SelectedStateSetup.test:76
LastClientMsg: a1 SELECT selected
Expected: '\* OK \[UIDVALIDITY \d+\]'
Actual   : '* OK [UIDVALIDITY 963554517] UIDs valid'
Location: /org/apache/james/imap/scripts/SelectedStateSetup.test:76
LastClientMsg: a1 SELECT selected
Expected: '\* OK \[UIDVALIDITY \d+\]'
Actual   : '* OK [UIDVALIDITY 26423626] UIDs valid'
Location: /org/apache/james/imap/scripts/SelectedStateSetup.test:76
LastClientMsg: a1 SELECT selected
Expected: '\* OK \[UIDVALIDITY \d+\]'
Actual   : '* OK [UIDVALIDITY 2080030443] UIDs valid'
Location: /org/apache/james/imap/scripts/SelectedStateSetup.test:76
LastClientMsg: a1 SELECT selected
Expected: '\* OK \[UIDVALIDITY \d+\]'
Actual   : '* OK [UIDVALIDITY 1665632991] UIDs valid'
Location: /org/apache/james/imap/scripts/SelectedStateSetup.test:76
LastClientMsg: a1 SELECT selected
Expected: '\* OK \[UIDVALIDITY \d+\]'
Actual   : '* OK [UIDVALIDITY 1709080074] UIDs valid'
Running org.apache.james.mailbox.inmemory.imap.FetchHeadersTest
ID=-3283154143174182363
ID=-3504544682373032768
ID=-2658927844380746921
ID=2915076112618954449
ID=-3455773038351594713
ID=6825999436732806631
Tests run: 6, Failures: 0, Errors: 6, Skipped: 0, Time elapsed: 0.653 sec <<< FAILURE!
Location: /org/apache/james/imap/scripts/SelectedStateSetup.test:76
LastClientMsg: a1 SELECT selected
Expected: '\* OK \[UIDVALIDITY \d+\]'
Actual   : '* OK [UIDVALIDITY 1869216891] UIDs valid'
Location: /org/apache/james/imap/scripts/SelectedStateSetup.test:76
LastClientMsg: a1 SELECT selected
Expected: '\* OK \[UIDVALIDITY \d+\]'
Actual   : '* OK [UIDVALIDITY 1568769428] UIDs valid'
Location: /org/apache/james/imap/scripts/SelectedStateSetup.test:76
LastClientMsg: a1 SELECT selected
Expected: '\* OK \[UIDVALIDITY \d+\]'
Actual   : '* OK [UIDVALIDITY 767704192] UIDs valid'
Location: /org/apache/james/imap/scripts/SelectedStateSetup.test:76
LastClientMsg: a1 SELECT selected
Expected: '\* OK \[UIDVALIDITY \d+\]'
Actual   : '* OK [UIDVALIDITY 1578876157] UIDs valid'
Location: /org/apache/james/imap/scripts/SelectedStateSetup.test:76
LastClientMsg: a1 SELECT selected
Expected: '\* OK \[UIDVALIDITY \d+\]'
Actual   : '* OK [UIDVALIDITY 123808182] UIDs valid'
Location: /org/apache/james/imap/scripts/SelectedStateSetup.test:76
LastClientMsg: a1 SELECT selected
Expected: '\* OK \[UIDVALIDITY \d+\]'
Actual   : '* OK [UIDVALIDITY 1520258955] UIDs valid'
Running org.apache.james.mailbox.inmemory.imap.EventTest
ID=8949124642642717909
ID=1509807361640405700
ID=8044455863956195478
Tests run: 3, Failures: 0, Errors: 3, Skipped: 0, Time elapsed: 0.578 sec <<< FAILURE!
Location: /org/apache/james/imap/scripts/SelectedStateSetup.test:76
LastClientMsg: a1 SELECT selected
Expected: '\* OK \[UIDVALIDITY \d+\]'
Actual   : '* OK [UIDVALIDITY 42171876] UIDs valid'
Location: /org/apache/james/imap/scripts/SelectedStateSetup.test:76
LastClientMsg: a1 SELECT selected
Expected: '\* OK \[UIDVALIDITY \d+\]'
Actual   : '* OK [UIDVALIDITY 436008396] UIDs valid'
Location: /org/apache/james/imap/scripts/SelectedStateSetup.test:76
LastClientMsg: a1 SELECT selected
Expected: '\* OK \[UIDVALIDITY \d+\]'
Actual   : '* OK [UIDVALIDITY 346373878] UIDs valid'
Running org.apache.james.mailbox.inmemory.imap.PartialFetchTest
ID=-737455722688382226
ID=-1928157391977310433
ID=-2017043873309337672
ID=-3583321462424223634
ID=-6230903843779757558
ID=469072189534904555
ID=2151849717054251905
ID=3087360271601594579
ID=-1331447751554517254
ID=3187192664287375780
ID=-9055755201844967278
ID=-4002550712974623206
Tests run: 12, Failures: 0, Errors: 12, Skipped: 0, Time elapsed: 0.726 sec <<< FAILURE!

Results :

Tests in error: 
  testBodyPartialFetchUS(org.apache.james.mailbox.inmemory.imap.PartialFetchTest): 
Location: /org/apache/james/imap/scripts/SelectedStateSetup.test:76
LastClientMsg: a1 SELECT selected
Expected: '\* OK \[UIDVALIDITY \d+\]'
Actual   : '* OK [UIDVALIDITY 1457669773] UIDs valid'
  testBodyPartialFetchIT(org.apache.james.mailbox.inmemory.imap.PartialFetchTest): 
Location: /org/apache/james/imap/scripts/SelectedStateSetup.test:76
LastClientMsg: a1 SELECT selected
Expected: '\* OK \[UIDVALIDITY \d+\]'
Actual   : '* OK [UIDVALIDITY 1921111168] UIDs valid'
  testBodyPartialFetchKO(org.apache.james.mailbox.inmemory.imap.PartialFetchTest): 
Location: /org/apache/james/imap/scripts/SelectedStateSetup.test:76
LastClientMsg: a1 SELECT selected
Expected: '\* OK \[UIDVALIDITY \d+\]'
Actual   : '* OK [UIDVALIDITY 124255619] UIDs valid'
  testTextPartialFetchUS(org.apache.james.mailbox.inmemory.imap.PartialFetchTest): 
Location: /org/apache/james/imap/scripts/SelectedStateSetup.test:76
LastClientMsg: a1 SELECT selected
Expected: '\* OK \[UIDVALIDITY \d+\]'
Actual   : '* OK [UIDVALIDITY 1116531587] UIDs valid'
  testTextPartialFetchKO(org.apache.james.mailbox.inmemory.imap.PartialFetchTest): 
Location: /org/apache/james/imap/scripts/SelectedStateSetup.test:76
LastClientMsg: a1 SELECT selected
Expected: '\* OK \[UIDVALIDITY \d+\]'
Actual   : '* OK [UIDVALIDITY 1536274940] UIDs valid'
  testTextPartialFetchIT(org.apache.james.mailbox.inmemory.imap.PartialFetchTest): 
Location: /org/apache/james/imap/scripts/SelectedStateSetup.test:76
LastClientMsg: a1 SELECT selected
Expected: '\* OK \[UIDVALIDITY \d+\]'
Actual   : '* OK [UIDVALIDITY 1044948128] UIDs valid'
  testMimePartialFetchUS(org.apache.james.mailbox.inmemory.imap.PartialFetchTest): 
Location: /org/apache/james/imap/scripts/SelectedStateSetup.test:76
LastClientMsg: a1 SELECT selected
Expected: '\* OK \[UIDVALIDITY \d+\]'
Actual   : '* OK [UIDVALIDITY 1484565612] UIDs valid'
  testMimePartialFetchIT(org.apache.james.mailbox.inmemory.imap.PartialFetchTest): 
Location: /org/apache/james/imap/scripts/SelectedStateSetup.test:76
LastClientMsg: a1 SELECT selected
Expected: '\* OK \[UIDVALIDITY \d+\]'
Actual   : '* OK [UIDVALIDITY 93758063] UIDs valid'
  testMimePartialFetchKO(org.apache.james.mailbox.inmemory.imap.PartialFetchTest): 
Location: /org/apache/james/imap/scripts/SelectedStateSetup.test:76
LastClientMsg: a1 SELECT selected
Expected: '\* OK \[UIDVALIDITY \d+\]'
Actual   : '* OK [UIDVALIDITY 1706953154] UIDs valid'
  testHeaderPartialFetchUS(org.apache.james.mailbox.inmemory.imap.PartialFetchTest): 
Location: /org/apache/james/imap/scripts/SelectedStateSetup.test:76
LastClientMsg: a1 SELECT selected
Expected: '\* OK \[UIDVALIDITY \d+\]'
Actual   : '* OK [UIDVALIDITY 761233853] UIDs valid'
  testHeaderPartialFetchIT(org.apache.james.mailbox.inmemory.imap.PartialFetchTest): 
Location: /org/apache/james/imap/scripts/SelectedStateSetup.test:76
LastClientMsg: a1 SELECT selected
Expected: '\* OK \[UIDVALIDITY \d+\]'
Actual   : '* OK [UIDVALIDITY 1723624143] UIDs valid'
  testHeaderPartialFetchKO(org.apache.james.mailbox.inmemory.imap.PartialFetchTest): 
Location: /org/apache/james/imap/scripts/SelectedStateSetup.test:76
LastClientMsg: a1 SELECT selected
Expected: '\* OK \[UIDVALIDITY \d+\]'
Actual   : '* OK [UIDVALIDITY 1111934030] UIDs valid'

Tests run: 1158, Failures: 0, Errors: 807, Skipped: 0

mojoFailed org.apache.maven.plugins:maven-surefire-plugin:2.7.2(default-test)
[JENKINS] Recording test results
projectFailed org.apache.james:apache-james-mailbox-integration-tester:0.2-M2-SNAPSHOT
[JENKINS] Archiving <https://hudson.apache.org/hudson/job/mailbox-integration-tests/ws/pom.xml>
to /home/hudson/hudson/jobs/mailbox-integration-tests/modules/org.apache.james$apache-james-mailbox-integration-tester/builds/2011-04-08_05-04-04/archive/org.apache.james/apache-james-mailbox-integration-tester/0.2-M2-SNAPSHOT/pom.xml
sessionEnded
[INFO] ------------------------------------------------------------------------
[INFO] BUILD FAILURE
[INFO] ------------------------------------------------------------------------
[INFO] Total time: 6:16.199s
[INFO] Finished at: Thu Apr 07 21:10:30 GMT-08:00 2011
[INFO] Final Memory: 27M/149M
[INFO] ------------------------------------------------------------------------
maven builder waiting
mavenExecutionResult exceptions not empty
org.apache.maven.lifecycle.LifecycleExecutionException: Failed to execute goal org.apache.maven.plugins:maven-surefire-plugin:2.7.2:test
(default-test) on project apache-james-mailbox-integration-tester: There are test failures.

Please refer to <https://hudson.apache.org/hudson/job/mailbox-integration-tests/ws/target/surefire-reports>
for the individual test results.
	at org.apache.maven.lifecycle.internal.MojoExecutor.execute(MojoExecutor.java:213)
	at org.apache.maven.lifecycle.internal.MojoExecutor.execute(MojoExecutor.java:153)
	at org.apache.maven.lifecycle.internal.MojoExecutor.execute(MojoExecutor.java:145)
	at org.apache.maven.lifecycle.internal.LifecycleModuleBuilder.buildProject(LifecycleModuleBuilder.java:84)
	at org.apache.maven.lifecycle.internal.LifecycleModuleBuilder.buildProject(LifecycleModuleBuilder.java:59)
	at org.apache.maven.lifecycle.internal.LifecycleStarter.singleThreadedBuild(LifecycleStarter.java:183)
	at org.apache.maven.lifecycle.internal.LifecycleStarter.execute(LifecycleStarter.java:161)
	at org.apache.maven.DefaultMaven.doExecute(DefaultMaven.java:319)
	at org.apache.maven.DefaultMaven.execute(DefaultMaven.java:156)
	at org.jvnet.hudson.maven3.launcher.Maven3Launcher.main(Maven3Launcher.java:79)
	at sun.reflect.NativeMethodAccessorImpl.invoke0(Native Method)
	at sun.reflect.NativeMethodAccessorImpl.invoke(NativeMethodAccessorImpl.java:39)
	at sun.reflect.DelegatingMethodAccessorImpl.invoke(DelegatingMethodAccessorImpl.java:25)
	at java.lang.reflect.Method.invoke(Method.java:592)
	at org.codehaus.plexus.classworlds.launcher.Launcher.launchStandard(Launcher.java:329)
	at org.codehaus.plexus.classworlds.launcher.Launcher.launch(Launcher.java:239)
	at org.jvnet.hudson.maven3.agent.Maven3Main.launch(Maven3Main.java:146)
	at hudson.maven.Maven3Builder.call(Maven3Builder.java:124)
	at hudson.maven.Maven3Builder.call(Maven3Builder.java:71)
	at hudson.remoting.UserRequest.perform(UserRequest.java:114)
	at hudson.remoting.UserRequest.perform(UserRequest.java:48)
	at hudson.remoting.Request$2.run(Request.java:270)
	at java.util.concurrent.Executors$RunnableAdapter.call(Executors.java:417)
	at java.util.concurrent.FutureTask$Sync.innerRun(FutureTask.java:269)
	at java.util.concurrent.FutureTask.run(FutureTask.java:123)
	at java.util.concurrent.ThreadPoolExecutor$Worker.runTask(ThreadPoolExecutor.java:651)
	at java.util.concurrent.ThreadPoolExecutor$Worker.run(ThreadPoolExecutor.java:676)
	at java.lang.Thread.run(Thread.java:595)
Caused by: org.apache.maven.plugin.MojoFailureException: There are test failures.

Please refer to <https://hudson.apache.org/hudson/job/mailbox-integration-tests/ws/target/surefire-reports>
for the individual test results.
	at org.apache.maven.plugin.surefire.SurefireHelper.reportExecution(SurefireHelper.java:74)
	at org.apache.maven.plugin.surefire.SurefirePlugin.execute(SurefirePlugin.java:642)
	at org.apache.maven.plugin.DefaultBuildPluginManager.executeMojo(DefaultBuildPluginManager.java:101)
	at org.apache.maven.lifecycle.internal.MojoExecutor.execute(MojoExecutor.java:209)
	... 27 more
Maven failed with error.
Sending e-mails to: server-dev@james.apache.org
channel stopped


---------------------------------------------------------------------
To unsubscribe, e-mail: server-dev-unsubscribe@james.apache.org
For additional commands, e-mail: server-dev-help@james.apache.org


Mime
View raw message