james-server-dev mailing list archives

Site index · List index
Message view « Date » · « Thread »
Top « Date » · « Thread »
From Apache Jenkins Server <jenk...@builds.apache.org>
Subject Build failed in Jenkins: james-server-trunk » Apache James Server Data Library #1917
Date Sun, 07 Aug 2011 09:35:10 GMT
See <https://builds.apache.org/job/james-server-trunk/org.apache.james$james-server-data-library/1917/>

------------------------------------------
[JENKINS] Archiving /home/jenkins/jenkins-slave/workspace/james-server-trunk/trunk/imapserver/pom.xml
to /home/hudson/hudson/jobs/james-server-trunk/modules/org.apache.james$james-server-imapserver/builds/2011-08-07_09-30-39/archive/org.apache.james/james-server-imapserver/3.0-beta4-SNAPSHOT/james-server-imapserver-3.0-beta4-SNAPSHOT.pom
[JENKINS] Archiving /home/jenkins/jenkins-slave/workspace/james-server-trunk/trunk/imapserver/target/james-server-imapserver-3.0-beta4-SNAPSHOT.jar
to /home/hudson/hudson/jobs/james-server-trunk/modules/org.apache.james$james-server-imapserver/builds/2011-08-07_09-30-39/archive/org.apache.james/james-server-imapserver/3.0-beta4-20110807.093456-34/james-server-imapserver-3.0-beta4-20110807.093456-34.jar
[JENKINS] Archiving /home/jenkins/jenkins-slave/workspace/james-server-trunk/trunk/imapserver/target/james-server-imapserver-3.0-beta4-SNAPSHOT-tests.jar
to /home/hudson/hudson/jobs/james-server-trunk/modules/org.apache.james$james-server-imapserver/builds/2011-08-07_09-30-39/archive/org.apache.james/james-server-imapserver/3.0-beta4-20110807.093456-34/james-server-imapserver-3.0-beta4-20110807.093456-34-tests.jar
[INFO] [INFO] Deleting <https://builds.apache.org/job/james-server-trunk/org.apache.james$james-server-data-library/ws/target>
                                                                        
[INFO] ------------------------------------------------------------------------
[INFO] Building Apache James Server Data Library 3.0-beta4-SNAPSHOT
[INFO] ------------------------------------------------------------------------
[INFO] 
[INFO] --- maven-clean-plugin:2.4.1:clean (default-clean) @ james-server-data-library ---
[INFO] 
[INFO] --- maven-remote-resources-plugin:1.1:process (default) @ james-server-data-library
---
[INFO] [INFO] Using 'UTF-8' encoding to copy filtered resources.
[INFO] Copying 2 resources
[INFO] Copying 3 resources

[INFO] --- maven-resources-plugin:2.4.3:resources (default-resources) @ james-server-data-library
---
[INFO] [INFO] Compiling 22 source files to <https://builds.apache.org/job/james-server-trunk/org.apache.james$james-server-data-library/ws/target/classes>

[INFO] --- maven-compiler-plugin:2.3.2:compile (default-compile) @ james-server-data-library
---
[INFO] 
[INFO] --- maven-bundle-plugin:2.1.0:manifest (bundle-manifest) @ james-server-data-library
---
[INFO] [INFO] Using 'UTF-8' encoding to copy filtered resources.
[INFO] Copying 0 resource
[INFO] Copying 3 resources

[INFO] --- maven-resources-plugin:2.4.3:testResources (default-testResources) @ james-server-data-library
---
[INFO] [INFO] Compiling 8 source files to <https://builds.apache.org/job/james-server-trunk/org.apache.james$james-server-data-library/ws/target/test-classes>

[INFO] --- maven-compiler-plugin:2.3.2:testCompile (default-testCompile) @ james-server-data-library
---
[INFO] -------------------------------------------------------------
[ERROR] COMPILATION ERROR : 
[INFO] -------------------------------------------------------------
mojoFailed org.apache.maven.plugins:maven-compiler-plugin:2.3.2(default-testCompile)[ERROR]
<https://builds.apache.org/job/james-server-trunk/org.apache.james$james-server-data-library/ws/src/test/java/org/apache/james/domainlist/lib/AbstractDomainListTest.java>:[27,43]
package org.apache.james.dnsservice.api.mock does not exist
[ERROR] <https://builds.apache.org/job/james-server-trunk/org.apache.james$james-server-data-library/ws/src/test/java/org/apache/james/domainlist/lib/AbstractDomainListTest.java>:[126,29]
cannot find symbol
symbol  : class MockDNSService
location: class org.apache.james.domainlist.lib.AbstractDomainListTest
[INFO] 2 errors 
[INFO] -------------------------------------------------------------

projectFailed org.apache.james:james-server-data-library:3.0-beta4-SNAPSHOT


---------------------------------------------------------------------
To unsubscribe, e-mail: server-dev-unsubscribe@james.apache.org
For additional commands, e-mail: server-dev-help@james.apache.org


Mime
View raw message