james-server-dev mailing list archives

Site index · List index
Message view « Date » · « Thread »
Top « Date » · « Thread »
From Apache Jenkins Server <jenk...@builds.apache.org>
Subject Build failed in Jenkins: mailbox-integration-tests #476
Date Sun, 04 Sep 2011 09:22:26 GMT
See <https://builds.apache.org/job/mailbox-integration-tests/476/changes>

Changes:

[ieugen] Added integration tests for HBase mailbox implementation. Please see https://issues.apache.org/jira/browse/MAILBOX-44.

------------------------------------------
Started by upstream project "imap-trunk-m2" build number 2213
Building remotely on ubuntu1
Updating https://svn.apache.org/repos/asf/james/mailbox-integration-tester/trunk
A         src/test/java/org/apache/james/mailbox/hbase
A         src/test/java/org/apache/james/mailbox/hbase/imap
A         src/test/java/org/apache/james/mailbox/hbase/imap/SearchTest.java
A         src/test/java/org/apache/james/mailbox/hbase/imap/PartialFetchTest.java
A         src/test/java/org/apache/james/mailbox/hbase/imap/UidSearchTest.java
A         src/test/java/org/apache/james/mailbox/hbase/imap/RenameTest.java
A         src/test/java/org/apache/james/mailbox/hbase/imap/SecurityTest.java
A         src/test/java/org/apache/james/mailbox/hbase/imap/ConcurrentSessionsTest.java
A         src/test/java/org/apache/james/mailbox/hbase/imap/ListingTest.java
A         src/test/java/org/apache/james/mailbox/hbase/imap/ExpungeTest.java
A         src/test/java/org/apache/james/mailbox/hbase/imap/SelectTest.java
A         src/test/java/org/apache/james/mailbox/hbase/imap/EventTest.java
A         src/test/java/org/apache/james/mailbox/hbase/imap/AuthenticatedStateTest.java
A         src/test/java/org/apache/james/mailbox/hbase/imap/FetchHeadersTest.java
A         src/test/java/org/apache/james/mailbox/hbase/imap/FetchBodyStructureTest.java
A         src/test/java/org/apache/james/mailbox/hbase/imap/SelectedInboxTest.java
A         src/test/java/org/apache/james/mailbox/hbase/imap/SelectedStateTest.java
A         src/test/java/org/apache/james/mailbox/hbase/imap/FetchTest.java
A         src/test/java/org/apache/james/mailbox/hbase/imap/FetchBodySectionTest.java
A         src/test/java/org/apache/james/mailbox/hbase/imap/NonAuthenticatedStateTest.java
A         src/test/java/org/apache/james/mailbox/hbase/host
A         src/test/java/org/apache/james/mailbox/hbase/host/HBaseHostSystem.java
U         pom.xml
At revision 1164979
Parsing POMs
Modules changed, recalculating dependency graph
[mailbox-integration-tests] $ /home/hudson/tools/java/latest1.6/bin/java -Djava.awt.headless=true
-cp /home/jenkins/jenkins-slave/maven3-agent.jar:/home/hudson/tools/maven/latest3/boot/plexus-classworlds-2.4.jar
org.jvnet.hudson.maven3.agent.Maven3Main /home/hudson/tools/maven/latest3 /home/jenkins/jenkins-slave/slave.jar
/home/jenkins/jenkins-slave/maven3-interceptor.jar 53709
<===[JENKINS REMOTING CAPACITY]===>channel started
   Executing Maven:  -B -f <https://builds.apache.org/job/mailbox-integration-tests/ws/pom.xml>
-U clean install
[INFO] Scanning for projects...
[WARNING] 
[WARNING] Some problems were encountered while building the effective model for org.apache.james:apache-james-mailbox-integration-tester:jar:1.6
[WARNING] 'dependencies.dependency.(groupId:artifactId:type:classifier)' must be unique: ${project.groupId}:apache-james-mailbox-hbase:jar
-> duplicate declaration of version 0.3 @ line 209, column 21
[WARNING] 
[WARNING] It is highly recommended to fix these problems because they threaten the stability
of your build.
[WARNING] 
[WARNING] For this reason, future Maven versions might no longer support building such malformed
projects.
[WARNING] 
[INFO]                                                                         
[INFO] ------------------------------------------------------------------------
[INFO] Building Apache James Mailbox Integration Tester 1.6
[INFO] ------------------------------------------------------------------------
Downloading: http://repository.apache.org/snapshots/org/apache/james/apache-james-imap-api/0.3-SNAPSHOT/maven-metadata.xml
Downloaded: http://repository.apache.org/snapshots/org/apache/james/apache-james-imap-api/0.3-SNAPSHOT/maven-metadata.xml
(999 B at 3.5 KB/sec)
Downloading: http://repository.apache.org/snapshots/org/apache/james/apache-james-imap-api/0.3-SNAPSHOT/apache-james-imap-api-0.3-20110904.091649-188.pom
Downloaded: http://repository.apache.org/snapshots/org/apache/james/apache-james-imap-api/0.3-SNAPSHOT/apache-james-imap-api-0.3-20110904.091649-188.pom
(2 KB at 23.3 KB/sec)
Downloading: http://repository.apache.org/snapshots/org/apache/james/apache-james-imap/0.3-SNAPSHOT/maven-metadata.xml
Downloaded: http://repository.apache.org/snapshots/org/apache/james/apache-james-imap/0.3-SNAPSHOT/maven-metadata.xml
(2 KB at 3.6 KB/sec)
Downloading: http://repository.apache.org/snapshots/org/apache/james/apache-james-imap/0.3-SNAPSHOT/apache-james-imap-0.3-20110904.091604-193.pom
Downloaded: http://repository.apache.org/snapshots/org/apache/james/apache-james-imap/0.3-SNAPSHOT/apache-james-imap-0.3-20110904.091604-193.pom
(20 KB at 120.7 KB/sec)
Downloading: http://repository.apache.org/snapshots/org/apache/james/apache-james-mailbox-api/0.4-SNAPSHOT/maven-metadata.xml
Downloaded: http://repository.apache.org/snapshots/org/apache/james/apache-james-mailbox-api/0.4-SNAPSHOT/maven-metadata.xml
(1002 B at 11.6 KB/sec)
Downloading: http://repository.apache.org/snapshots/org/apache/james/apache-james-mailbox-api/0.4-SNAPSHOT/apache-james-mailbox-api-0.4-20110904.091247-111.pom
Downloaded: http://repository.apache.org/snapshots/org/apache/james/apache-james-mailbox-api/0.4-SNAPSHOT/apache-james-mailbox-api-0.4-20110904.091247-111.pom
(3 KB at 25.9 KB/sec)
Downloading: http://repository.apache.org/snapshots/org/apache/james/apache-james-mailbox/0.4-SNAPSHOT/maven-metadata.xml
Downloaded: http://repository.apache.org/snapshots/org/apache/james/apache-james-mailbox/0.4-SNAPSHOT/maven-metadata.xml
(2 KB at 12.0 KB/sec)
Downloading: http://repository.apache.org/snapshots/org/apache/james/apache-james-mailbox/0.4-SNAPSHOT/apache-james-mailbox-0.4-20110904.091158-111.pom
Downloaded: http://repository.apache.org/snapshots/org/apache/james/apache-james-mailbox/0.4-SNAPSHOT/apache-james-mailbox-0.4-20110904.091158-111.pom
(27 KB at 222.4 KB/sec)
Downloading: http://repository.apache.org/snapshots/org/apache/james/apache-james-imap-message/0.3-SNAPSHOT/maven-metadata.xml
Downloaded: http://repository.apache.org/snapshots/org/apache/james/apache-james-imap-message/0.3-SNAPSHOT/maven-metadata.xml
(1003 B at 5.6 KB/sec)
Downloading: http://repository.apache.org/snapshots/org/apache/james/apache-james-imap-message/0.3-SNAPSHOT/apache-james-imap-message-0.3-20110904.091714-183.pom
Downloaded: http://repository.apache.org/snapshots/org/apache/james/apache-james-imap-message/0.3-SNAPSHOT/apache-james-imap-message-0.3-20110904.091714-183.pom
(3 KB at 25.4 KB/sec)
Downloading: http://repository.apache.org/snapshots/org/apache/james/apache-james-imap-processor/0.3-SNAPSHOT/maven-metadata.xml
Downloaded: http://repository.apache.org/snapshots/org/apache/james/apache-james-imap-processor/0.3-SNAPSHOT/maven-metadata.xml
(1005 B at 4.2 KB/sec)
Downloading: http://repository.apache.org/snapshots/org/apache/james/apache-james-imap-processor/0.3-SNAPSHOT/apache-james-imap-processor-0.3-20110904.091728-178.pom
Downloaded: http://repository.apache.org/snapshots/org/apache/james/apache-james-imap-processor/0.3-SNAPSHOT/apache-james-imap-processor-0.3-20110904.091728-178.pom
(3 KB at 20.9 KB/sec)
Downloading: http://repository.apache.org/snapshots/org/apache/james/apache-james-mailbox-store/0.4-SNAPSHOT/maven-metadata.xml
Downloaded: http://repository.apache.org/snapshots/org/apache/james/apache-james-mailbox-store/0.4-SNAPSHOT/maven-metadata.xml
(1004 B at 11.0 KB/sec)
Downloading: http://repository.apache.org/snapshots/org/apache/james/apache-james-mailbox-store/0.4-SNAPSHOT/apache-james-mailbox-store-0.4-20110904.091302-109.pom
Downloaded: http://repository.apache.org/snapshots/org/apache/james/apache-james-mailbox-store/0.4-SNAPSHOT/apache-james-mailbox-store-0.4-20110904.091302-109.pom
(3 KB at 27.0 KB/sec)
Downloading: http://repository.apache.org/snapshots/org/apache/james/apache-james-mailbox-jcr/0.4-SNAPSHOT/maven-metadata.xml
Downloaded: http://repository.apache.org/snapshots/org/apache/james/apache-james-mailbox-jcr/0.4-SNAPSHOT/maven-metadata.xml
(1002 B at 5.8 KB/sec)
Downloading: http://repository.apache.org/snapshots/org/apache/james/apache-james-mailbox-jcr/0.4-SNAPSHOT/apache-james-mailbox-jcr-0.4-20110904.091437-109.pom
Downloaded: http://repository.apache.org/snapshots/org/apache/james/apache-james-mailbox-jcr/0.4-SNAPSHOT/apache-james-mailbox-jcr-0.4-20110904.091437-109.pom
(4 KB at 40.4 KB/sec)
Downloading: http://repository.apache.org/snapshots/org/apache/james/apache-james-mailbox-store/0.4-SNAPSHOT/maven-metadata.xml
Downloaded: http://repository.apache.org/snapshots/org/apache/james/apache-james-mailbox-store/0.4-SNAPSHOT/maven-metadata.xml
(1004 B at 11.3 KB/sec)
Downloading: http://repository.apache.org/snapshots/org/apache/james/apache-james-mailbox-jpa/0.4-SNAPSHOT/maven-metadata.xml
Downloaded: http://repository.apache.org/snapshots/org/apache/james/apache-james-mailbox-jpa/0.4-SNAPSHOT/maven-metadata.xml
(1002 B at 5.5 KB/sec)
Downloading: http://repository.apache.org/snapshots/org/apache/james/apache-james-mailbox-jpa/0.4-SNAPSHOT/apache-james-mailbox-jpa-0.4-20110904.091347-109.pom
Downloaded: http://repository.apache.org/snapshots/org/apache/james/apache-james-mailbox-jpa/0.4-SNAPSHOT/apache-james-mailbox-jpa-0.4-20110904.091347-109.pom
(5 KB at 50.5 KB/sec)
Downloading: http://repository.apache.org/snapshots/org/apache/james/apache-james-mailbox-maildir/0.4-SNAPSHOT/maven-metadata.xml
Downloaded: http://repository.apache.org/snapshots/org/apache/james/apache-james-mailbox-maildir/0.4-SNAPSHOT/maven-metadata.xml
(1006 B at 5.8 KB/sec)
Downloading: http://repository.apache.org/snapshots/org/apache/james/apache-james-mailbox-maildir/0.4-SNAPSHOT/apache-james-mailbox-maildir-0.4-20110904.091457-100.pom
Downloaded: http://repository.apache.org/snapshots/org/apache/james/apache-james-mailbox-maildir/0.4-SNAPSHOT/apache-james-mailbox-maildir-0.4-20110904.091457-100.pom
(3 KB at 34.4 KB/sec)
Downloading: http://repository.apache.org/snapshots/org/apache/james/apache-james-mailbox-memory/0.4-SNAPSHOT/maven-metadata.xml
Downloaded: http://repository.apache.org/snapshots/org/apache/james/apache-james-mailbox-memory/0.4-SNAPSHOT/maven-metadata.xml
(1005 B at 11.2 KB/sec)
Downloading: http://repository.apache.org/snapshots/org/apache/james/apache-james-mailbox-memory/0.4-SNAPSHOT/apache-james-mailbox-memory-0.4-20110904.091322-109.pom
Downloaded: http://repository.apache.org/snapshots/org/apache/james/apache-james-mailbox-memory/0.4-SNAPSHOT/apache-james-mailbox-memory-0.4-20110904.091322-109.pom
(3 KB at 28.6 KB/sec)
Downloading: http://people.apache.org/~rawson/repo/org/apache/james/apache-james-mailbox-hbase/0.3/apache-james-mailbox-hbase-0.3.pom
Downloading: http://repo1.maven.org/maven2/org/apache/james/apache-james-mailbox-hbase/0.3/apache-james-mailbox-hbase-0.3.pom
[WARNING] The POM for org.apache.james:apache-james-mailbox-hbase:jar:0.3 is missing, no dependency
information available
Downloading: http://people.apache.org/~rawson/repo/javax/jms/jms/1.1/jms-1.1.pom
Downloading: http://repo1.maven.org/maven2/javax/jms/jms/1.1/jms-1.1.pom
Downloaded: http://repo1.maven.org/maven2/javax/jms/jms/1.1/jms-1.1.pom (0 B at 0.0 KB/sec)
Downloading: http://repository.apache.org/snapshots/org/apache/james/apache-james-imap-api/0.3-SNAPSHOT/apache-james-imap-api-0.3-20110904.091649-188.jar
Downloading: http://repository.apache.org/snapshots/org/apache/james/apache-james-imap-message/0.3-SNAPSHOT/apache-james-imap-message-0.3-20110904.091714-183.jar
Downloading: http://repository.apache.org/snapshots/org/apache/james/apache-james-imap-processor/0.3-SNAPSHOT/apache-james-imap-processor-0.3-20110904.091728-178.jar
Downloading: http://repository.apache.org/snapshots/org/apache/james/apache-james-mailbox-api/0.4-SNAPSHOT/apache-james-mailbox-api-0.4-20110904.091247-111.jar
Downloading: http://repository.apache.org/snapshots/org/apache/james/apache-james-mailbox-store/0.4-SNAPSHOT/apache-james-mailbox-store-0.4-20110904.091302-109-tests.jar
Downloaded: http://repository.apache.org/snapshots/org/apache/james/apache-james-mailbox-store/0.4-SNAPSHOT/apache-james-mailbox-store-0.4-20110904.091302-109-tests.jar
(45 KB at 188.1 KB/sec)
Downloading: http://repository.apache.org/snapshots/org/apache/james/apache-james-mailbox-jcr/0.4-SNAPSHOT/apache-james-mailbox-jcr-0.4-20110904.091437-109.jar
Downloaded: http://repository.apache.org/snapshots/org/apache/james/apache-james-imap-api/0.3-SNAPSHOT/apache-james-imap-api-0.3-20110904.091649-188.jar
(48 KB at 178.5 KB/sec)
Downloading: http://repository.apache.org/snapshots/org/apache/james/apache-james-mailbox-store/0.4-SNAPSHOT/apache-james-mailbox-store-0.4-20110904.091302-109.jar
Downloaded: http://repository.apache.org/snapshots/org/apache/james/apache-james-mailbox-api/0.4-SNAPSHOT/apache-james-mailbox-api-0.4-20110904.091247-111.jar
(77 KB at 278.0 KB/sec)
Downloading: http://repository.apache.org/snapshots/org/apache/james/apache-james-mailbox-jpa/0.4-SNAPSHOT/apache-james-mailbox-jpa-0.4-20110904.091347-109.jar
Downloaded: http://repository.apache.org/snapshots/org/apache/james/apache-james-imap-message/0.3-SNAPSHOT/apache-james-imap-message-0.3-20110904.091714-183.jar
(183 KB at 638.1 KB/sec)
Downloading: http://repository.apache.org/snapshots/org/apache/james/apache-james-mailbox-maildir/0.4-SNAPSHOT/apache-james-mailbox-maildir-0.4-20110904.091457-100.jar
Downloaded: http://repository.apache.org/snapshots/org/apache/james/apache-james-mailbox-jcr/0.4-SNAPSHOT/apache-james-mailbox-jcr-0.4-20110904.091437-109.jar
(54 KB at 455.7 KB/sec)
Downloading: http://repository.apache.org/snapshots/org/apache/james/apache-james-mailbox-memory/0.4-SNAPSHOT/apache-james-mailbox-memory-0.4-20110904.091322-109.jar
Downloaded: http://repository.apache.org/snapshots/org/apache/james/apache-james-imap-processor/0.3-SNAPSHOT/apache-james-imap-processor-0.3-20110904.091728-178.jar
(154 KB at 412.7 KB/sec)
Downloaded: http://repository.apache.org/snapshots/org/apache/james/apache-james-mailbox-maildir/0.4-SNAPSHOT/apache-james-mailbox-maildir-0.4-20110904.091457-100.jar
(65 KB at 557.4 KB/sec)
Downloaded: http://repository.apache.org/snapshots/org/apache/james/apache-james-mailbox-jpa/0.4-SNAPSHOT/apache-james-mailbox-jpa-0.4-20110904.091347-109.jar
(73 KB at 483.9 KB/sec)
Downloaded: http://repository.apache.org/snapshots/org/apache/james/apache-james-mailbox-memory/0.4-SNAPSHOT/apache-james-mailbox-memory-0.4-20110904.091322-109.jar
(21 KB at 252.6 KB/sec)
Downloaded: http://repository.apache.org/snapshots/org/apache/james/apache-james-mailbox-store/0.4-SNAPSHOT/apache-james-mailbox-store-0.4-20110904.091302-109.jar
(176 KB at 951.2 KB/sec)
Downloading: http://people.apache.org/~rawson/repo/org/apache/james/apache-james-mailbox-hbase/0.3/apache-james-mailbox-hbase-0.3.jar
Downloading: http://repo1.maven.org/maven2/org/apache/james/apache-james-mailbox-hbase/0.3/apache-james-mailbox-hbase-0.3.jar
projectFailed org.apache.james:apache-james-mailbox-integration-tester:1.6
[JENKINS] Archiving <https://builds.apache.org/job/mailbox-integration-tests/ws/pom.xml>
to /home/hudson/hudson/jobs/mailbox-integration-tests/modules/org.apache.james$apache-james-mailbox-integration-tester/builds/2011-09-04_09-21-54/archive/org.apache.james/apache-james-mailbox-integration-tester/1.6/apache-james-mailbox-integration-tester-1.6.pom
sessionEnded
[INFO] ------------------------------------------------------------------------
[INFO] BUILD FAILURE
[INFO] ------------------------------------------------------------------------
[INFO] Total time: 15.205s
[INFO] Finished at: Sun Sep 04 09:22:23 UTC 2011
[INFO] Final Memory: 6M/61M
[INFO] ------------------------------------------------------------------------
mavenExecutionResult exceptions not empty
message : Failed to execute goal on project apache-james-mailbox-integration-tester: Could
not resolve dependencies for project org.apache.james:apache-james-mailbox-integration-tester:jar:1.6:
Could not find artifact org.apache.james:apache-james-mailbox-hbase:jar:0.3 in hadoop-non-releases
(http://people.apache.org/~rawson/repo/)
cause : Could not resolve dependencies for project org.apache.james:apache-james-mailbox-integration-tester:jar:1.6:
Could not find artifact org.apache.james:apache-james-mailbox-hbase:jar:0.3 in hadoop-non-releases
(http://people.apache.org/~rawson/repo/)
Stack trace : 
org.apache.maven.lifecycle.LifecycleExecutionException: Failed to execute goal on project
apache-james-mailbox-integration-tester: Could not resolve dependencies for project org.apache.james:apache-james-mailbox-integration-tester:jar:1.6:
Could not find artifact org.apache.james:apache-james-mailbox-hbase:jar:0.3 in hadoop-non-releases
(http://people.apache.org/~rawson/repo/)
	at org.apache.maven.lifecycle.internal.LifecycleDependencyResolver.getDependencies(LifecycleDependencyResolver.java:196)
	at org.apache.maven.lifecycle.internal.LifecycleDependencyResolver.resolveProjectDependencies(LifecycleDependencyResolver.java:108)
	at org.apache.maven.lifecycle.internal.MojoExecutor.ensureDependenciesAreResolved(MojoExecutor.java:258)
	at org.apache.maven.lifecycle.internal.MojoExecutor.execute(MojoExecutor.java:201)
	at org.apache.maven.lifecycle.internal.MojoExecutor.execute(MojoExecutor.java:153)
	at org.apache.maven.lifecycle.internal.MojoExecutor.execute(MojoExecutor.java:145)
	at org.apache.maven.lifecycle.internal.LifecycleModuleBuilder.buildProject(LifecycleModuleBuilder.java:84)
	at org.apache.maven.lifecycle.internal.LifecycleModuleBuilder.buildProject(LifecycleModuleBuilder.java:59)
	at org.apache.maven.lifecycle.internal.LifecycleStarter.singleThreadedBuild(LifecycleStarter.java:183)
	at org.apache.maven.lifecycle.internal.LifecycleStarter.execute(LifecycleStarter.java:161)
	at org.apache.maven.DefaultMaven.doExecute(DefaultMaven.java:319)
	at org.apache.maven.DefaultMaven.execute(DefaultMaven.java:156)
	at org.jvnet.hudson.maven3.launcher.Maven3Launcher.main(Maven3Launcher.java:79)
	at sun.reflect.NativeMethodAccessorImpl.invoke0(Native Method)
	at sun.reflect.NativeMethodAccessorImpl.invoke(NativeMethodAccessorImpl.java:39)
	at sun.reflect.DelegatingMethodAccessorImpl.invoke(DelegatingMethodAccessorImpl.java:25)
	at java.lang.reflect.Method.invoke(Method.java:597)
	at org.codehaus.plexus.classworlds.launcher.Launcher.launchStandard(Launcher.java:329)
	at org.codehaus.plexus.classworlds.launcher.Launcher.launch(Launcher.java:239)
	at org.jvnet.hudson.maven3.agent.Maven3Main.launch(Maven3Main.java:158)
	at hudson.maven.Maven3Builder.call(Maven3Builder.java:121)
	at hudson.maven.Maven3Builder.call(Maven3Builder.java:73)
	at hudson.remoting.UserRequest.perform(UserRequest.java:118)
	at hudson.remoting.UserRequest.perform(UserRequest.java:48)
	at hudson.remoting.Request$2.run(Request.java:287)
	at java.util.concurrent.Executors$RunnableAdapter.call(Executors.java:441)
	at java.util.concurrent.FutureTask$Sync.innerRun(FutureTask.java:303)
	at java.util.concurrent.FutureTask.run(FutureTask.java:138)
	at java.util.concurrent.ThreadPoolExecutor$Worker.runTask(ThreadPoolExecutor.java:886)
	at java.util.concurrent.ThreadPoolExecutor$Worker.run(ThreadPoolExecutor.java:908)
	at java.lang.Thread.run(Thread.java:619)
Caused by: org.apache.maven.project.DependencyResolutionException: Could not resolve dependencies
for project org.apache.james:apache-james-mailbox-integration-tester:jar:1.6: Could not find
artifact org.apache.james:apache-james-mailbox-hbase:jar:0.3 in hadoop-non-releases (http://people.apache.org/~rawson/repo/)
	at org.apache.maven.project.DefaultProjectDependenciesResolver.resolve(DefaultProjectDependenciesResolver.java:170)
	at org.apache.maven.lifecycle.internal.LifecycleDependencyResolver.getDependencies(LifecycleDependencyResolver.java:171)
	... 30 more
Caused by: org.sonatype.aether.resolution.DependencyResolutionException: Could not find artifact
org.apache.james:apache-james-mailbox-hbase:jar:0.3 in hadoop-non-releases (http://people.apache.org/~rawson/repo/)
	at org.sonatype.aether.impl.internal.DefaultRepositorySystem.resolveDependencies(DefaultRepositorySystem.java:412)
	at org.apache.maven.project.DefaultProjectDependenciesResolver.resolve(DefaultProjectDependenciesResolver.java:164)
	... 31 more
Caused by: org.sonatype.aether.resolution.ArtifactResolutionException: Could not find artifact
org.apache.james:apache-james-mailbox-hbase:jar:0.3 in hadoop-non-releases (http://people.apache.org/~rawson/repo/)
	at org.sonatype.aether.impl.internal.DefaultArtifactResolver.resolve(DefaultArtifactResolver.java:541)
	at org.sonatype.aether.impl.internal.DefaultArtifactResolver.resolveArtifacts(DefaultArtifactResolver.java:220)
	at org.sonatype.aether.impl.internal.DefaultRepositorySystem.resolveDependencies(DefaultRepositorySystem.java:395)
	... 32 more
Caused by: org.sonatype.aether.transfer.ArtifactNotFoundException: Could not find artifact
org.apache.james:apache-james-mailbox-hbase:jar:0.3 in hadoop-non-releases (http://people.apache.org/~rawson/repo/)
	at org.sonatype.aether.connector.wagon.WagonRepositoryConnector$4.wrap(WagonRepositoryConnector.java:945)
	at org.sonatype.aether.connector.wagon.WagonRepositoryConnector$4.wrap(WagonRepositoryConnector.java:940)
	at org.sonatype.aether.connector.wagon.WagonRepositoryConnector$GetTask.flush(WagonRepositoryConnector.java:695)
	at org.sonatype.aether.connector.wagon.WagonRepositoryConnector$GetTask.flush(WagonRepositoryConnector.java:689)
	at org.sonatype.aether.connector.wagon.WagonRepositoryConnector.get(WagonRepositoryConnector.java:445)
	at org.sonatype.aether.impl.internal.DefaultArtifactResolver.resolve(DefaultArtifactResolver.java:460)
	... 34 more
Sending e-mails to: server-dev@james.apache.org
channel stopped


---------------------------------------------------------------------
To unsubscribe, e-mail: server-dev-unsubscribe@james.apache.org
For additional commands, e-mail: server-dev-help@james.apache.org


Mime
View raw message