james-server-dev mailing list archives

Site index · List index
Message view « Date » · « Thread »
Top « Date » · « Thread »
From Apache Jenkins Server <jenk...@builds.apache.org>
Subject Build failed in Jenkins: james-app-trunk #531
Date Mon, 23 Jan 2012 10:07:17 GMT
See <https://builds.apache.org/job/james-app-trunk/531/>

------------------------------------------
Started by timer
Building remotely on ubuntu1
Updating http://svn.apache.org/repos/asf/james/app/trunk
U         src/main/resources/META-INF/org/apache/james/spring-server.xml
U         pom.xml
At revision 1234721
no change for http://svn.apache.org/repos/asf/james/app/trunk since the previous build
Parsing POMs
Failed to transfer Could not find metadata org.apache.james:james-project:1.9-SNAPSHOT/maven-metadata.xml
in maven2-repository.dev.java.net (http://download.java.net/maven/2/)
ERROR: Failed to parse POMs
hudson.util.IOException2: remote file operation failed: <https://builds.apache.org/job/james-app-trunk/ws/trunk>
at hudson.remoting.Channel@233b2174:ubuntu1
	at hudson.FilePath.act(FilePath.java:780)
	at hudson.FilePath.act(FilePath.java:766)
	at hudson.maven.MavenModuleSetBuild$RunnerImpl.parsePoms(MavenModuleSetBuild.java:913)
	at hudson.maven.MavenModuleSetBuild$RunnerImpl.doRun(MavenModuleSetBuild.java:658)
	at hudson.model.AbstractBuild$AbstractRunner.run(AbstractBuild.java:467)
	at hudson.model.Run.run(Run.java:1404)
	at hudson.maven.MavenModuleSetBuild.run(MavenModuleSetBuild.java:481)
	at hudson.model.ResourceController.execute(ResourceController.java:88)
	at hudson.model.Executor.run(Executor.java:238)
Caused by: hudson.remoting.ProxyException: hudson.maven.MavenModuleSetBuild$MavenExecutionException:
org.apache.maven.project.ProjectBuildingException: Some problems were encountered while processing
the POMs:
[ERROR] 'dependencies.dependency.version' for org.apache.james:james-server-data-ldap:jar
is missing. @ line 208, column 21
[ERROR] 'dependencies.dependency.version' for org.apache.james:james-server-protocols-smtp:jar
is missing. @ line 214, column 21
[ERROR] 'dependencies.dependency.version' for org.apache.james:james-server-protocols-imap4:jar
is missing. @ line 219, column 21
[ERROR] 'dependencies.dependency.version' for org.apache.james:james-server-protocols-lmtp:jar
is missing. @ line 224, column 21
[ERROR] 'dependencies.dependency.version' for org.apache.james:james-server-protocols-pop3:jar
is missing. @ line 229, column 21
[ERROR] 'dependencies.dependency.version' for org.apache.james:james-server-data-file:jar
is missing. @ line 302, column 21
[ERROR] 'dependencies.dependency.version' for org.apache.james:james-server-data-jpa:jar is
missing. @ line 307, column 21
[ERROR] 'dependencies.dependency.version' for org.apache.james:james-server-data-jdbc:jar
is missing. @ line 312, column 21
[ERROR] 'dependencies.dependency.version' for org.apache.james:james-server-data-hbase:jar
is missing. @ line 317, column 21
[ERROR] 'dependencies.dependency.version' for org.apache.james:james-server-data-jcr:jar is
missing. @ line 328, column 21

	at hudson.maven.MavenModuleSetBuild$PomParser.invoke(MavenModuleSetBuild.java:1271)
	at hudson.maven.MavenModuleSetBuild$PomParser.invoke(MavenModuleSetBuild.java:1048)
	at hudson.FilePath$FileCallableWrapper.call(FilePath.java:2045)
	at hudson.remoting.UserRequest.perform(UserRequest.java:118)
	at hudson.remoting.UserRequest.perform(UserRequest.java:48)
	at hudson.remoting.Request$2.run(Request.java:287)
	at java.util.concurrent.Executors$RunnableAdapter.call(Executors.java:471)
	at java.util.concurrent.FutureTask$Sync.innerRun(FutureTask.java:334)
	at java.util.concurrent.FutureTask.run(FutureTask.java:166)
	at java.util.concurrent.ThreadPoolExecutor.runWorker(ThreadPoolExecutor.java:1110)
	at java.util.concurrent.ThreadPoolExecutor$Worker.run(ThreadPoolExecutor.java:603)
	at java.lang.Thread.run(Thread.java:636)
Caused by: hudson.remoting.ProxyException: org.apache.maven.project.ProjectBuildingException:
Some problems were encountered while processing the POMs:
[ERROR] 'dependencies.dependency.version' for org.apache.james:james-server-data-ldap:jar
is missing. @ line 208, column 21
[ERROR] 'dependencies.dependency.version' for org.apache.james:james-server-protocols-smtp:jar
is missing. @ line 214, column 21
[ERROR] 'dependencies.dependency.version' for org.apache.james:james-server-protocols-imap4:jar
is missing. @ line 219, column 21
[ERROR] 'dependencies.dependency.version' for org.apache.james:james-server-protocols-lmtp:jar
is missing. @ line 224, column 21
[ERROR] 'dependencies.dependency.version' for org.apache.james:james-server-protocols-pop3:jar
is missing. @ line 229, column 21
[ERROR] 'dependencies.dependency.version' for org.apache.james:james-server-data-file:jar
is missing. @ line 302, column 21
[ERROR] 'dependencies.dependency.version' for org.apache.james:james-server-data-jpa:jar is
missing. @ line 307, column 21
[ERROR] 'dependencies.dependency.version' for org.apache.james:james-server-data-jdbc:jar
is missing. @ line 312, column 21
[ERROR] 'dependencies.dependency.version' for org.apache.james:james-server-data-hbase:jar
is missing. @ line 317, column 21
[ERROR] 'dependencies.dependency.version' for org.apache.james:james-server-data-jcr:jar is
missing. @ line 328, column 21

	at org.apache.maven.project.DefaultProjectBuilder.build(DefaultProjectBuilder.java:339)
	at hudson.maven.MavenEmbedder.buildProjects(MavenEmbedder.java:361)
	at hudson.maven.MavenEmbedder.readProjects(MavenEmbedder.java:331)
	at hudson.maven.MavenModuleSetBuild$PomParser.invoke(MavenModuleSetBuild.java:1221)
	... 11 more


---------------------------------------------------------------------
To unsubscribe, e-mail: server-dev-unsubscribe@james.apache.org
For additional commands, e-mail: server-dev-help@james.apache.org


Mime
View raw message