james-server-dev mailing list archives

Site index · List index
Message view « Date » · « Thread »
Top « Date » · « Thread »
From Apache Jenkins Server <jenk...@builds.apache.org>
Subject Build failed in Jenkins: james-server-trunk #2605
Date Sun, 05 Feb 2012 11:21:28 GMT
See <https://builds.apache.org/job/james-server-trunk/2605/changes>

Changes:

[norman] Move to netty 3.3.1.Final

------------------------------------------
[...truncated 471 lines...]
-------------------------------------------------------
 T E S T S
-------------------------------------------------------

Results :

Tests run: 0, Failures: 0, Errors: 0, Skipped: 0

[JENKINS] Recording test results
[INFO] 
[INFO] --- maven-jar-plugin:2.3.2:jar (default-jar) @ james-server-mailetcontainer-api ---
[INFO] Building jar: <https://builds.apache.org/job/james-server-trunk/ws/trunk/mailetcontainer-api/target/james-server-mailetcontainer-api-3.0-beta4-SNAPSHOT.jar>
[INFO] 
[INFO] --- maven-site-plugin:3.0:attach-descriptor (attach-descriptor) @ james-server-mailetcontainer-api
---
[INFO] 
[INFO] --- maven-jar-plugin:2.3.2:jar (default) @ james-server-mailetcontainer-api ---
[INFO] 
[INFO] --- maven-jar-plugin:2.3.2:test-jar (default) @ james-server-mailetcontainer-api ---
[INFO] Building jar: <https://builds.apache.org/job/james-server-trunk/ws/trunk/mailetcontainer-api/target/james-server-mailetcontainer-api-3.0-beta4-SNAPSHOT-tests.jar>
[INFO] [INFO] Installing <https://builds.apache.org/job/james-server-trunk/ws/trunk/mailetcontainer-api/target/james-server-mailetcontainer-api-3.0-beta4-SNAPSHOT.jar>
to /home/jenkins/.m2/repository/org/apache/james/james-server-mailetcontainer-api/3.0-beta4-SNAPSHOT/james-server-mailetcontainer-api-3.0-beta4-SNAPSHOT.jar

[INFO] Installing <https://builds.apache.org/job/james-server-trunk/ws/trunk/mailetcontainer-api/pom.xml>
to /home/jenkins/.m2/repository/org/apache/james/james-server-mailetcontainer-api/3.0-beta4-SNAPSHOT/james-server-mailetcontainer-api-3.0-beta4-SNAPSHOT.pom
[INFO] --- maven-install-plugin:2.3.1:install (default-install) @ james-server-mailetcontainer-api
---
[INFO] Installing <https://builds.apache.org/job/james-server-trunk/ws/trunk/mailetcontainer-api/target/james-server-mailetcontainer-api-3.0-beta4-SNAPSHOT-tests.jar>
to /home/jenkins/.m2/repository/org/apache/james/james-server-mailetcontainer-api/3.0-beta4-SNAPSHOT/james-server-mailetcontainer-api-3.0-beta4-SNAPSHOT-tests.jar
[INFO] Downloading: https://repository.apache.org/content/repositories/snapshots/org/apache/james/james-server-mailetcontainer-api/3.0-beta4-SNAPSHOT/maven-metadata.xml

[INFO] --- maven-deploy-plugin:2.7:deploy (default-deploy) @ james-server-mailetcontainer-api
---
Downloaded: https://repository.apache.org/content/repositories/snapshots/org/apache/james/james-server-mailetcontainer-api/3.0-beta4-SNAPSHOT/maven-metadata.xml
(2 KB at 3.1 KB/sec)
Uploading: https://repository.apache.org/content/repositories/snapshots/org/apache/james/james-server-mailetcontainer-api/3.0-beta4-SNAPSHOT/james-server-mailetcontainer-api-3.0-beta4-20120205.112117-704.jar
Uploaded: https://repository.apache.org/content/repositories/snapshots/org/apache/james/james-server-mailetcontainer-api/3.0-beta4-SNAPSHOT/james-server-mailetcontainer-api-3.0-beta4-20120205.112117-704.jar
(12 KB at 102.8 KB/sec)
Uploading: https://repository.apache.org/content/repositories/snapshots/org/apache/james/james-server-mailetcontainer-api/3.0-beta4-SNAPSHOT/james-server-mailetcontainer-api-3.0-beta4-20120205.112117-704.pom
Uploaded: https://repository.apache.org/content/repositories/snapshots/org/apache/james/james-server-mailetcontainer-api/3.0-beta4-SNAPSHOT/james-server-mailetcontainer-api-3.0-beta4-20120205.112117-704.pom
(3 KB at 45.7 KB/sec)
Downloading: https://repository.apache.org/content/repositories/snapshots/org/apache/james/james-server-mailetcontainer-api/maven-metadata.xml
Downloaded: https://repository.apache.org/content/repositories/snapshots/org/apache/james/james-server-mailetcontainer-api/maven-metadata.xml
(420 B at 1.5 KB/sec)
Uploading: https://repository.apache.org/content/repositories/snapshots/org/apache/james/james-server-mailetcontainer-api/3.0-beta4-SNAPSHOT/maven-metadata.xml
Uploaded: https://repository.apache.org/content/repositories/snapshots/org/apache/james/james-server-mailetcontainer-api/3.0-beta4-SNAPSHOT/maven-metadata.xml
(2 KB at 9.9 KB/sec)
Uploading: https://repository.apache.org/content/repositories/snapshots/org/apache/james/james-server-mailetcontainer-api/maven-metadata.xml
Uploaded: https://repository.apache.org/content/repositories/snapshots/org/apache/james/james-server-mailetcontainer-api/maven-metadata.xml
(420 B at 3.2 KB/sec)
Uploading: https://repository.apache.org/content/repositories/snapshots/org/apache/james/james-server-mailetcontainer-api/3.0-beta4-SNAPSHOT/james-server-mailetcontainer-api-3.0-beta4-20120205.112117-704-tests.jar
Uploaded: https://repository.apache.org/content/repositories/snapshots/org/apache/james/james-server-mailetcontainer-api/3.0-beta4-SNAPSHOT/james-server-mailetcontainer-api-3.0-beta4-20120205.112117-704-tests.jar
(17 KB at 55.7 KB/sec)
Uploading: https://repository.apache.org/content/repositories/snapshots/org/apache/james/james-server-mailetcontainer-api/3.0-beta4-SNAPSHOT/maven-metadata.xml
Uploaded: https://repository.apache.org/content/repositories/snapshots/org/apache/james/james-server-mailetcontainer-api/3.0-beta4-SNAPSHOT/maven-metadata.xml
(2 KB at 13.6 KB/sec)
[JENKINS] Archiving <https://builds.apache.org/job/james-server-trunk/ws/trunk/mailetcontainer-api/pom.xml>
to /home/hudson/hudson/jobs/james-server-trunk/modules/org.apache.james$james-server-mailetcontainer-api/builds/2012-02-05_11-20-43/archive/org.apache.james/james-server-mailetcontainer-api/3.0-beta4-SNAPSHOT/james-server-mailetcontainer-api-3.0-beta4-SNAPSHOT.pom
[JENKINS] Archiving <https://builds.apache.org/job/james-server-trunk/ws/trunk/mailetcontainer-api/target/james-server-mailetcontainer-api-3.0-beta4-SNAPSHOT.jar>
to /home/hudson/hudson/jobs/james-server-trunk/modules/org.apache.james$james-server-mailetcontainer-api/builds/2012-02-05_11-20-43/archive/org.apache.james/james-server-mailetcontainer-api/3.0-beta4-20120205.112117-704/james-server-mailetcontainer-api-3.0-beta4-20120205.112117-704.jar
[JENKINS] Archiving <https://builds.apache.org/job/james-server-trunk/ws/trunk/mailetcontainer-api/target/james-server-mailetcontainer-api-3.0-beta4-SNAPSHOT-tests.jar>
to /home/hudson/hudson/jobs/james-server-trunk/modules/org.apache.james$james-server-mailetcontainer-api/builds/2012-02-05_11-20-43/archive/org.apache.james/james-server-mailetcontainer-api/3.0-beta4-20120205.112117-704/james-server-mailetcontainer-api-3.0-beta4-20120205.112117-704-tests.jar
[INFO]                                                                         
[INFO] ------------------------------------------------------------------------
[INFO] Building Apache James Server Common Utilities 3.0-beta4-SNAPSHOT
[INFO] ------------------------------------------------------------------------
[INFO] [INFO] Deleting <https://builds.apache.org/job/james-server-trunk/ws/trunk/util/target>

[INFO] --- maven-clean-plugin:2.4.1:clean (default-clean) @ james-server-util ---
[INFO] 
[INFO] --- maven-remote-resources-plugin:1.2.1:process (default) @ james-server-util ---
[debug] execute contextualize
[INFO] [INFO] Using 'UTF-8' encoding to copy filtered resources.
[INFO] skip non existing resourceDirectory <https://builds.apache.org/job/james-server-trunk/ws/trunk/util/src/main/resources>
[INFO] Copying 3 resources

[INFO] --- maven-resources-plugin:2.5:resources (default-resources) @ james-server-util ---
[INFO] 
[INFO] --- maven-compiler-plugin:2.3.2:compile (default-compile) @ james-server-util ---
[INFO] Compiling 22 source files to <https://builds.apache.org/job/james-server-trunk/ws/trunk/util/target/classes>
[INFO] 
[INFO] --- maven-bundle-plugin:2.3.5:manifest (bundle-manifest) @ james-server-util ---
[debug] execute contextualize
[INFO] [INFO] Using 'UTF-8' encoding to copy filtered resources.
[INFO] skip non existing resourceDirectory <https://builds.apache.org/job/james-server-trunk/ws/trunk/util/src/test/resources>
[INFO] Copying 3 resources

[INFO] --- maven-resources-plugin:2.5:testResources (default-testResources) @ james-server-util
---
[INFO] 
[INFO] --- maven-compiler-plugin:2.3.2:testCompile (default-testCompile) @ james-server-util
---
[INFO] Compiling 4 source files to <https://builds.apache.org/job/james-server-trunk/ws/trunk/util/target/test-classes>
[INFO] [INFO] Surefire report directory: <https://builds.apache.org/job/james-server-trunk/ws/trunk/util/target/surefire-reports>

[INFO] --- maven-surefire-plugin:2.10:test (default-test) @ james-server-util ---
-------------------------------------------------------

 T E S T S
-------------------------------------------------------

-------------------------------------------------------
 T E S T S
-------------------------------------------------------
Running org.apache.james.util.retry.naming.NamingExceptionRetryHandlerTest
Tests run: 2, Failures: 0, Errors: 0, Skipped: 0, Time elapsed: 0.012 sec
Running org.apache.james.util.retry.DoublingRetryScheduleTest
Tests run: 3, Failures: 0, Errors: 0, Skipped: 0, Time elapsed: 0.017 sec
Running org.apache.james.util.retry.ExceptionRetryHandlerTest
Tests run: 5, Failures: 0, Errors: 0, Skipped: 0, Time elapsed: 0.034 sec
Running org.apache.james.util.TimeConverterTest
Tests run: 12, Failures: 0, Errors: 0, Skipped: 0, Time elapsed: 0.023 sec

Results :

Tests run: 22, Failures: 0, Errors: 0, Skipped: 0

[JENKINS] Recording test results
[INFO] 
[INFO] --- maven-jar-plugin:2.3.2:jar (default-jar) @ james-server-util ---
[INFO] Building jar: <https://builds.apache.org/job/james-server-trunk/ws/trunk/util/target/james-server-util-3.0-beta4-SNAPSHOT.jar>
[INFO] 
[INFO] --- maven-site-plugin:3.0:attach-descriptor (attach-descriptor) @ james-server-util
---
[INFO] 
[INFO] --- maven-jar-plugin:2.3.2:jar (default) @ james-server-util ---
[INFO] 
[INFO] --- maven-jar-plugin:2.3.2:test-jar (default) @ james-server-util ---
[INFO] Building jar: <https://builds.apache.org/job/james-server-trunk/ws/trunk/util/target/james-server-util-3.0-beta4-SNAPSHOT-tests.jar>
[INFO] [INFO] Installing <https://builds.apache.org/job/james-server-trunk/ws/trunk/util/target/james-server-util-3.0-beta4-SNAPSHOT.jar>
to /home/jenkins/.m2/repository/org/apache/james/james-server-util/3.0-beta4-SNAPSHOT/james-server-util-3.0-beta4-SNAPSHOT.jar
[INFO] Installing <https://builds.apache.org/job/james-server-trunk/ws/trunk/util/pom.xml>
to /home/jenkins/.m2/repository/org/apache/james/james-server-util/3.0-beta4-SNAPSHOT/james-server-util-3.0-beta4-SNAPSHOT.pom

[INFO] --- maven-install-plugin:2.3.1:install (default-install) @ james-server-util ---
[INFO] Installing <https://builds.apache.org/job/james-server-trunk/ws/trunk/util/target/james-server-util-3.0-beta4-SNAPSHOT-tests.jar>
to /home/jenkins/.m2/repository/org/apache/james/james-server-util/3.0-beta4-SNAPSHOT/james-server-util-3.0-beta4-SNAPSHOT-tests.jar
[INFO] Downloading: https://repository.apache.org/content/repositories/snapshots/org/apache/james/james-server-util/3.0-beta4-SNAPSHOT/maven-metadata.xml

[INFO] --- maven-deploy-plugin:2.7:deploy (default-deploy) @ james-server-util ---
Downloaded: https://repository.apache.org/content/repositories/snapshots/org/apache/james/james-server-util/3.0-beta4-SNAPSHOT/maven-metadata.xml
(1019 B at 2.5 KB/sec)
Uploading: https://repository.apache.org/content/repositories/snapshots/org/apache/james/james-server-util/3.0-beta4-SNAPSHOT/james-server-util-3.0-beta4-20120205.112124-680.jar
Uploaded: https://repository.apache.org/content/repositories/snapshots/org/apache/james/james-server-util/3.0-beta4-SNAPSHOT/james-server-util-3.0-beta4-20120205.112124-680.jar
(107 KB at 930.0 KB/sec)
Uploading: https://repository.apache.org/content/repositories/snapshots/org/apache/james/james-server-util/3.0-beta4-SNAPSHOT/james-server-util-3.0-beta4-20120205.112124-680.pom
Uploaded: https://repository.apache.org/content/repositories/snapshots/org/apache/james/james-server-util/3.0-beta4-SNAPSHOT/james-server-util-3.0-beta4-20120205.112124-680.pom
(3 KB at 28.7 KB/sec)
Downloading: https://repository.apache.org/content/repositories/snapshots/org/apache/james/james-server-util/maven-metadata.xml
Downloaded: https://repository.apache.org/content/repositories/snapshots/org/apache/james/james-server-util/maven-metadata.xml
(443 B at 8.5 KB/sec)
Uploading: https://repository.apache.org/content/repositories/snapshots/org/apache/james/james-server-util/3.0-beta4-SNAPSHOT/maven-metadata.xml
Uploaded: https://repository.apache.org/content/repositories/snapshots/org/apache/james/james-server-util/3.0-beta4-SNAPSHOT/maven-metadata.xml
(1019 B at 8.9 KB/sec)
Uploading: https://repository.apache.org/content/repositories/snapshots/org/apache/james/james-server-util/maven-metadata.xml
Uploaded: https://repository.apache.org/content/repositories/snapshots/org/apache/james/james-server-util/maven-metadata.xml
(443 B at 1.5 KB/sec)
Uploading: https://repository.apache.org/content/repositories/snapshots/org/apache/james/james-server-util/3.0-beta4-SNAPSHOT/james-server-util-3.0-beta4-20120205.112124-680-tests.jar
Uploaded: https://repository.apache.org/content/repositories/snapshots/org/apache/james/james-server-util/3.0-beta4-SNAPSHOT/james-server-util-3.0-beta4-20120205.112124-680-tests.jar
(24 KB at 234.7 KB/sec)
Uploading: https://repository.apache.org/content/repositories/snapshots/org/apache/james/james-server-util/3.0-beta4-SNAPSHOT/maven-metadata.xml
Uploaded: https://repository.apache.org/content/repositories/snapshots/org/apache/james/james-server-util/3.0-beta4-SNAPSHOT/maven-metadata.xml
(1019 B at 12.8 KB/sec)
[JENKINS] Archiving <https://builds.apache.org/job/james-server-trunk/ws/trunk/util/pom.xml>
to /home/hudson/hudson/jobs/james-server-trunk/modules/org.apache.james$james-server-util/builds/2012-02-05_11-20-43/archive/org.apache.james/james-server-util/3.0-beta4-SNAPSHOT/james-server-util-3.0-beta4-SNAPSHOT.pom
[JENKINS] Archiving <https://builds.apache.org/job/james-server-trunk/ws/trunk/util/target/james-server-util-3.0-beta4-SNAPSHOT.jar>
to /home/hudson/hudson/jobs/james-server-trunk/modules/org.apache.james$james-server-util/builds/2012-02-05_11-20-43/archive/org.apache.james/james-server-util/3.0-beta4-20120205.112124-680/james-server-util-3.0-beta4-20120205.112124-680.jar
[JENKINS] Archiving <https://builds.apache.org/job/james-server-trunk/ws/trunk/util/target/james-server-util-3.0-beta4-SNAPSHOT-tests.jar>
to /home/hudson/hudson/jobs/james-server-trunk/modules/org.apache.james$james-server-util/builds/2012-02-05_11-20-43/archive/org.apache.james/james-server-util/3.0-beta4-20120205.112124-680/james-server-util-3.0-beta4-20120205.112124-680-tests.jar
[INFO]                                                                         
[INFO] ------------------------------------------------------------------------
[INFO] Building Apache James Server Protocols Library 3.0-beta4-SNAPSHOT
[INFO] ------------------------------------------------------------------------
Downloading: http://download.java.net/maven/2/io/netty/netty/3.3.1/netty-3.3.1.pom
Downloading: http://people.apache.org/~rawson/repo/io/netty/netty/3.3.1/netty-3.3.1.pom
Downloading: http://repo1.maven.org/maven2/io/netty/netty/3.3.1/netty-3.3.1.pom
[WARNING] The POM for io.netty:netty:jar:3.3.1 is missing, no dependency information available
Downloading: http://download.java.net/maven/2/io/netty/netty/3.3.1/netty-3.3.1.jar
Downloading: http://people.apache.org/~rawson/repo/io/netty/netty/3.3.1/netty-3.3.1.jar
Downloading: http://repo1.maven.org/maven2/io/netty/netty/3.3.1/netty-3.3.1.jar
[JENKINS] Archiving <https://builds.apache.org/job/james-server-trunk/ws/trunk/protocols-library/pom.xml>
to /home/hudson/hudson/jobs/james-server-trunk/modules/org.apache.james$james-server-protocols-library/builds/2012-02-05_11-20-43/archive/org.apache.james/james-server-protocols-library/3.0-beta4-SNAPSHOT/james-server-protocols-library-3.0-beta4-SNAPSHOT.pom
[INFO] ------------------------------------------------------------------------
[INFO] Reactor Summary:
[INFO] 
[INFO] Apache James Server ............................... SUCCESS [9.461s]
[INFO] Apache James Server Lifecycle API ................. SUCCESS [3.475s]
[INFO] Apache James Server Filesystem API ................ SUCCESS [3.442s]
[INFO] Apache James Server Data API ...................... SUCCESS [3.018s]
[INFO] Apache James Server Lifecycle Spring .............. SUCCESS [5.588s]
[INFO] Apache James Server Mailetcontainer API ........... SUCCESS [3.155s]
[INFO] Apache James Server Common Utilities .............. SUCCESS [6.529s]
[INFO] Apache James Server Protocols Library ............. FAILURE [0.571s]
[INFO] Apache James Server Core .......................... SKIPPED
[INFO] Apache James Server Container Spring .............. SKIPPED
[INFO] Apache James Server DNS Server API ................ SKIPPED
[INFO] Apache James Server DNSService Implementation ..... SKIPPED
[INFO] Apache James Server DNSService Library ............ SKIPPED
[INFO] Apache James Server Queue API ..................... SKIPPED
[INFO] Apache James Server FetchMail ..................... SKIPPED
[INFO] Apache James Server Data Library .................. SKIPPED
[INFO] Apache James Server HBase Data Persistence ........ SKIPPED
[INFO] Apache James Server JPA Data Persistence .......... SKIPPED
[INFO] Apache James Server JCR Data Persistence .......... SKIPPED
[INFO] Apache James Server JDBC Data Persistence ......... SKIPPED
[INFO] Apache James Server File Data Persistence ......... SKIPPED
[INFO] Apache James Server LDAP Data Implementation ...... SKIPPED
[INFO] Apache James Server Mailbox Adapter ............... SKIPPED
[INFO] Apache James Server Mailetcontainer Camel implementation  SKIPPED
[INFO] Apache James Server Mailets ....................... SKIPPED
[INFO] Apache James Server IMAP .......................... SKIPPED
[INFO] Apache James Server SMTP .......................... SKIPPED
[INFO] Apache James Server LMTP .......................... SKIPPED
[INFO] Apache James Server POP3 .......................... SKIPPED
[INFO] Apache James Server File Mail Queue ............... SKIPPED
[INFO] Apache James Server JMS Mail Queue ................ SKIPPED
[INFO] Apache James Server ActiveMQ Queue ................ SKIPPED
[INFO] Apache James Server Client ........................ SKIPPED
[INFO] ------------------------------------------------------------------------
[INFO] BUILD FAILURE
[INFO] ------------------------------------------------------------------------
[INFO] Total time: 39.634s
[INFO] Finished at: Sun Feb 05 11:21:26 UTC 2012
[INFO] Final Memory: 55M/283M
[INFO] ------------------------------------------------------------------------
Waiting for Jenkins to finish collecting data
mavenExecutionResult exceptions not empty
message : Failed to execute goal on project james-server-protocols-library: Could not resolve
dependencies for project org.apache.james:james-server-protocols-library:jar:3.0-beta4-SNAPSHOT:
Could not find artifact io.netty:netty:jar:3.3.1 in maven2-repository.dev.java.net (http://download.java.net/maven/2/)
cause : Could not resolve dependencies for project org.apache.james:james-server-protocols-library:jar:3.0-beta4-SNAPSHOT:
Could not find artifact io.netty:netty:jar:3.3.1 in maven2-repository.dev.java.net (http://download.java.net/maven/2/)
Stack trace : 
org.apache.maven.lifecycle.LifecycleExecutionException: Failed to execute goal on project
james-server-protocols-library: Could not resolve dependencies for project org.apache.james:james-server-protocols-library:jar:3.0-beta4-SNAPSHOT:
Could not find artifact io.netty:netty:jar:3.3.1 in maven2-repository.dev.java.net (http://download.java.net/maven/2/)
	at org.apache.maven.lifecycle.internal.LifecycleDependencyResolver.getDependencies(LifecycleDependencyResolver.java:196)
	at org.apache.maven.lifecycle.internal.LifecycleDependencyResolver.resolveProjectDependencies(LifecycleDependencyResolver.java:108)
	at org.apache.maven.lifecycle.internal.MojoExecutor.ensureDependenciesAreResolved(MojoExecutor.java:258)
	at org.apache.maven.lifecycle.internal.MojoExecutor.execute(MojoExecutor.java:201)
	at org.apache.maven.lifecycle.internal.MojoExecutor.execute(MojoExecutor.java:153)
	at org.apache.maven.lifecycle.internal.MojoExecutor.execute(MojoExecutor.java:145)
	at org.apache.maven.lifecycle.internal.LifecycleModuleBuilder.buildProject(LifecycleModuleBuilder.java:84)
	at org.apache.maven.lifecycle.internal.LifecycleModuleBuilder.buildProject(LifecycleModuleBuilder.java:59)
	at org.apache.maven.lifecycle.internal.LifecycleStarter.singleThreadedBuild(LifecycleStarter.java:183)
	at org.apache.maven.lifecycle.internal.LifecycleStarter.execute(LifecycleStarter.java:161)
	at org.apache.maven.DefaultMaven.doExecute(DefaultMaven.java:319)
	at org.apache.maven.DefaultMaven.execute(DefaultMaven.java:156)
	at org.jvnet.hudson.maven3.launcher.Maven3Launcher.main(Maven3Launcher.java:79)
	at sun.reflect.NativeMethodAccessorImpl.invoke0(Native Method)
	at sun.reflect.NativeMethodAccessorImpl.invoke(NativeMethodAccessorImpl.java:39)
	at sun.reflect.DelegatingMethodAccessorImpl.invoke(DelegatingMethodAccessorImpl.java:25)
	at java.lang.reflect.Method.invoke(Method.java:597)
	at org.codehaus.plexus.classworlds.launcher.Launcher.launchStandard(Launcher.java:329)
	at org.codehaus.plexus.classworlds.launcher.Launcher.launch(Launcher.java:239)
	at org.jvnet.hudson.maven3.agent.Maven3Main.launch(Maven3Main.java:158)
	at hudson.maven.Maven3Builder.call(Maven3Builder.java:104)
	at hudson.maven.Maven3Builder.call(Maven3Builder.java:70)
	at hudson.remoting.UserRequest.perform(UserRequest.java:118)
	at hudson.remoting.UserRequest.perform(UserRequest.java:48)
	at hudson.remoting.Request$2.run(Request.java:287)
	at java.util.concurrent.Executors$RunnableAdapter.call(Executors.java:441)
	at java.util.concurrent.FutureTask$Sync.innerRun(FutureTask.java:303)
	at java.util.concurrent.FutureTask.run(FutureTask.java:138)
	at java.util.concurrent.ThreadPoolExecutor$Worker.runTask(ThreadPoolExecutor.java:886)
	at java.util.concurrent.ThreadPoolExecutor$Worker.run(ThreadPoolExecutor.java:908)
	at java.lang.Thread.run(Thread.java:662)
Caused by: org.apache.maven.project.DependencyResolutionException: Could not resolve dependencies
for project org.apache.james:james-server-protocols-library:jar:3.0-beta4-SNAPSHOT: Could
not find artifact io.netty:netty:jar:3.3.1 in maven2-repository.dev.java.net (http://download.java.net/maven/2/)
	at org.apache.maven.project.DefaultProjectDependenciesResolver.resolve(DefaultProjectDependenciesResolver.java:170)
	at org.apache.maven.lifecycle.internal.LifecycleDependencyResolver.getDependencies(LifecycleDependencyResolver.java:171)
	... 30 more
Caused by: org.sonatype.aether.resolution.DependencyResolutionException: Could not find artifact
io.netty:netty:jar:3.3.1 in maven2-repository.dev.java.net (http://download.java.net/maven/2/)
	at org.sonatype.aether.impl.internal.DefaultRepositorySystem.resolveDependencies(DefaultRepositorySystem.java:412)
	at org.apache.maven.project.DefaultProjectDependenciesResolver.resolve(DefaultProjectDependenciesResolver.java:164)
	... 31 more
Caused by: org.sonatype.aether.resolution.ArtifactResolutionException: Could not find artifact
io.netty:netty:jar:3.3.1 in maven2-repository.dev.java.net (http://download.java.net/maven/2/)
	at org.sonatype.aether.impl.internal.DefaultArtifactResolver.resolve(DefaultArtifactResolver.java:541)
	at org.sonatype.aether.impl.internal.DefaultArtifactResolver.resolveArtifacts(DefaultArtifactResolver.java:220)
	at org.sonatype.aether.impl.internal.DefaultRepositorySystem.resolveDependencies(DefaultRepositorySystem.java:395)
	... 32 more
Caused by: org.sonatype.aether.transfer.ArtifactNotFoundException: Could not find artifact
io.netty:netty:jar:3.3.1 in maven2-repository.dev.java.net (http://download.java.net/maven/2/)
	at org.sonatype.aether.connector.wagon.WagonRepositoryConnector$4.wrap(WagonRepositoryConnector.java:945)
	at org.sonatype.aether.connector.wagon.WagonRepositoryConnector$4.wrap(WagonRepositoryConnector.java:940)
	at org.sonatype.aether.connector.wagon.WagonRepositoryConnector$GetTask.flush(WagonRepositoryConnector.java:695)
	at org.sonatype.aether.connector.wagon.WagonRepositoryConnector$GetTask.flush(WagonRepositoryConnector.java:689)
	at org.sonatype.aether.connector.wagon.WagonRepositoryConnector.get(WagonRepositoryConnector.java:445)
	at org.sonatype.aether.impl.internal.DefaultArtifactResolver.resolve(DefaultArtifactResolver.java:460)
	... 34 more
channel stopped


---------------------------------------------------------------------
To unsubscribe, e-mail: server-dev-unsubscribe@james.apache.org
For additional commands, e-mail: server-dev-help@james.apache.org


Mime
View raw message