james-server-dev mailing list archives

Site index · List index
Message view « Date » · « Thread »
Top « Date » · « Thread »
From Apache Jenkins Server <jenk...@builds.apache.org>
Subject Build failed in Jenkins: james-server-trunk #2653
Date Wed, 22 Feb 2012 08:41:48 GMT
See <https://builds.apache.org/job/james-server-trunk/2653/changes>

Changes:

[eric] move sieve manager file repo test to a server module

[eric] move sieve manager file repo to a server module

------------------------------------------
[...truncated 309 lines...]
location: class org.apache.james.managesieve.file.SieveFileRepository
[ERROR] <https://builds.apache.org/job/james-server-trunk/ws/trunk/filesystem-api/src/main/java/org/apache/james/filesystem/api/SieveFileRepository.java>:[446,74]
cannot find symbol
symbol  : class StorageException
location: class org.apache.james.managesieve.file.SieveFileRepository
[ERROR] <https://builds.apache.org/job/james-server-trunk/ws/trunk/filesystem-api/src/main/java/org/apache/james/filesystem/api/SieveFileRepository.java>:[470,53]
cannot find symbol
symbol  : class UserNotFoundException
location: class org.apache.james.managesieve.file.SieveFileRepository
[ERROR] <https://builds.apache.org/job/james-server-trunk/ws/trunk/filesystem-api/src/main/java/org/apache/james/filesystem/api/SieveFileRepository.java>:[470,76]
cannot find symbol
symbol  : class StorageException
location: class org.apache.james.managesieve.file.SieveFileRepository
[ERROR] <https://builds.apache.org/job/james-server-trunk/ws/trunk/filesystem-api/src/main/java/org/apache/james/filesystem/api/SieveFileRepository.java>:[496,34]
cannot find symbol
symbol  : class QuotaNotFoundException
location: class org.apache.james.managesieve.file.SieveFileRepository
[ERROR] <https://builds.apache.org/job/james-server-trunk/ws/trunk/filesystem-api/src/main/java/org/apache/james/filesystem/api/SieveFileRepository.java>:[528,50]
cannot find symbol
symbol  : class QuotaNotFoundException
location: class org.apache.james.managesieve.file.SieveFileRepository
[ERROR] <https://builds.apache.org/job/james-server-trunk/ws/trunk/filesystem-api/src/main/java/org/apache/james/filesystem/api/SieveFileRepository.java>:[528,74]
cannot find symbol
symbol  : class StorageException
location: class org.apache.james.managesieve.file.SieveFileRepository
[ERROR] <https://builds.apache.org/job/james-server-trunk/ws/trunk/filesystem-api/src/main/java/org/apache/james/filesystem/api/SieveFileRepository.java>:[543,63]
cannot find symbol
symbol  : class StorageException
location: class org.apache.james.managesieve.file.SieveFileRepository
[ERROR] <https://builds.apache.org/job/james-server-trunk/ws/trunk/filesystem-api/src/main/java/org/apache/james/filesystem/api/SieveFileRepository.java>:[549,52]
cannot find symbol
symbol  : class UserNotFoundException
location: class org.apache.james.managesieve.file.SieveFileRepository
[ERROR] <https://builds.apache.org/job/james-server-trunk/ws/trunk/filesystem-api/src/main/java/org/apache/james/filesystem/api/SieveFileRepository.java>:[557,54]
cannot find symbol
symbol  : class UserNotFoundException
location: class org.apache.james.managesieve.file.SieveFileRepository
[ERROR] <https://builds.apache.org/job/james-server-trunk/ws/trunk/filesystem-api/src/main/java/org/apache/james/filesystem/api/SieveFileRepository.java>:[565,51]
cannot find symbol
symbol  : class UserNotFoundException
location: class org.apache.james.managesieve.file.SieveFileRepository
[ERROR] <https://builds.apache.org/job/james-server-trunk/ws/trunk/filesystem-api/src/main/java/org/apache/james/filesystem/api/SieveFileRepository.java>:[565,74]
cannot find symbol
symbol  : class QuotaNotFoundException
location: class org.apache.james.managesieve.file.SieveFileRepository
[ERROR] <https://builds.apache.org/job/james-server-trunk/ws/trunk/filesystem-api/src/main/java/org/apache/james/filesystem/api/SieveFileRepository.java>:[594,54]
cannot find symbol
symbol  : class UserNotFoundException
location: class org.apache.james.managesieve.file.SieveFileRepository
[ERROR] <https://builds.apache.org/job/james-server-trunk/ws/trunk/filesystem-api/src/main/java/org/apache/james/filesystem/api/SieveFileRepository.java>:[595,12]
cannot find symbol
symbol  : class QuotaNotFoundException
location: class org.apache.james.managesieve.file.SieveFileRepository
[ERROR] <https://builds.apache.org/job/james-server-trunk/ws/trunk/filesystem-api/src/main/java/org/apache/james/filesystem/api/SieveFileRepository.java>:[595,36]
cannot find symbol
symbol  : class StorageException
location: class org.apache.james.managesieve.file.SieveFileRepository
[ERROR] <https://builds.apache.org/job/james-server-trunk/ws/trunk/filesystem-api/src/main/java/org/apache/james/filesystem/api/SieveFileRepository.java>:[613,69]
cannot find symbol
symbol  : class UserNotFoundException
location: class org.apache.james.managesieve.file.SieveFileRepository
[ERROR] <https://builds.apache.org/job/james-server-trunk/ws/trunk/filesystem-api/src/main/java/org/apache/james/filesystem/api/SieveFileRepository.java>:[614,12]
cannot find symbol
symbol  : class StorageException
location: class org.apache.james.managesieve.file.SieveFileRepository
[ERROR] <https://builds.apache.org/job/james-server-trunk/ws/trunk/filesystem-api/src/main/java/org/apache/james/filesystem/api/SieveFileRepository.java>:[107,26]
cannot find symbol
symbol  : class ManageSieveError
location: class org.apache.james.managesieve.file.SieveFileRepository
[ERROR] <https://builds.apache.org/job/james-server-trunk/ws/trunk/filesystem-api/src/main/java/org/apache/james/filesystem/api/SieveFileRepository.java>:[109,16]
cannot find symbol
symbol  : variable IOUtils
location: class org.apache.james.managesieve.file.SieveFileRepository
[ERROR] <https://builds.apache.org/job/james-server-trunk/ws/trunk/filesystem-api/src/main/java/org/apache/james/filesystem/api/SieveFileRepository.java>:[112,12]
cannot find symbol
symbol  : variable FileUtils
location: class org.apache.james.managesieve.file.SieveFileRepository
[ERROR] <https://builds.apache.org/job/james-server-trunk/ws/trunk/filesystem-api/src/main/java/org/apache/james/filesystem/api/SieveFileRepository.java>:[113,22]
cannot find symbol
symbol  : class StorageException
location: class org.apache.james.managesieve.file.SieveFileRepository
[ERROR] <https://builds.apache.org/job/james-server-trunk/ws/trunk/filesystem-api/src/main/java/org/apache/james/filesystem/api/SieveFileRepository.java>:[121,16]
cannot find symbol
symbol  : variable FileUtils
location: class org.apache.james.managesieve.file.SieveFileRepository
[ERROR] <https://builds.apache.org/job/james-server-trunk/ws/trunk/filesystem-api/src/main/java/org/apache/james/filesystem/api/SieveFileRepository.java>:[123,26]
cannot find symbol
symbol  : class StorageException
location: class org.apache.james.managesieve.file.SieveFileRepository
[ERROR] <https://builds.apache.org/job/james-server-trunk/ws/trunk/filesystem-api/src/main/java/org/apache/james/filesystem/api/SieveFileRepository.java>:[129,12]
cannot find symbol
symbol  : variable FileUtils
location: class org.apache.james.managesieve.file.SieveFileRepository
[ERROR] <https://builds.apache.org/job/james-server-trunk/ws/trunk/filesystem-api/src/main/java/org/apache/james/filesystem/api/SieveFileRepository.java>:[131,22]
cannot find symbol
symbol  : class StorageException
location: class org.apache.james.managesieve.file.SieveFileRepository
[ERROR] <https://builds.apache.org/job/james-server-trunk/ws/trunk/filesystem-api/src/main/java/org/apache/james/filesystem/api/SieveFileRepository.java>:[135,12]
cannot find symbol
symbol  : variable FileUtils
location: class org.apache.james.managesieve.file.SieveFileRepository
[ERROR] <https://builds.apache.org/job/james-server-trunk/ws/trunk/filesystem-api/src/main/java/org/apache/james/filesystem/api/SieveFileRepository.java>:[138,12]
cannot find symbol
symbol  : variable FileUtils
location: class org.apache.james.managesieve.file.SieveFileRepository
[ERROR] <https://builds.apache.org/job/james-server-trunk/ws/trunk/filesystem-api/src/main/java/org/apache/james/filesystem/api/SieveFileRepository.java>:[175,26]
cannot find symbol
symbol  : class IsActiveException
location: class org.apache.james.managesieve.file.SieveFileRepository
[ERROR] <https://builds.apache.org/job/james-server-trunk/ws/trunk/filesystem-api/src/main/java/org/apache/james/filesystem/api/SieveFileRepository.java>:[178,16]
cannot find symbol
symbol  : variable FileUtils
location: class org.apache.james.managesieve.file.SieveFileRepository
[ERROR] <https://builds.apache.org/job/james-server-trunk/ws/trunk/filesystem-api/src/main/java/org/apache/james/filesystem/api/SieveFileRepository.java>:[180,26]
cannot find symbol
symbol  : class StorageException
location: class org.apache.james.managesieve.file.SieveFileRepository
[ERROR] <https://builds.apache.org/job/james-server-trunk/ws/trunk/filesystem-api/src/main/java/org/apache/james/filesystem/api/SieveFileRepository.java>:[194,22]
cannot find symbol
symbol  : class ScriptNotFoundException
location: class org.apache.james.managesieve.file.SieveFileRepository
[ERROR] <https://builds.apache.org/job/james-server-trunk/ws/trunk/filesystem-api/src/main/java/org/apache/james/filesystem/api/SieveFileRepository.java>:[240,22]
cannot find symbol
symbol  : class QuotaExceededException
location: class org.apache.james.managesieve.file.SieveFileRepository
[ERROR] <https://builds.apache.org/job/james-server-trunk/ws/trunk/filesystem-api/src/main/java/org/apache/james/filesystem/api/SieveFileRepository.java>:[250,13]
cannot find symbol
symbol  : class ScriptSummary
location: class org.apache.james.managesieve.file.SieveFileRepository
[ERROR] <https://builds.apache.org/job/james-server-trunk/ws/trunk/filesystem-api/src/main/java/org/apache/james/filesystem/api/SieveFileRepository.java>:[250,54]
cannot find symbol
symbol  : class ScriptSummary
location: class org.apache.james.managesieve.file.SieveFileRepository
[ERROR] <https://builds.apache.org/job/james-server-trunk/ws/trunk/filesystem-api/src/main/java/org/apache/james/filesystem/api/SieveFileRepository.java>:[254,17]
cannot find symbol
symbol  : class ScriptNotFoundException
location: class org.apache.james.managesieve.file.SieveFileRepository
[ERROR] <https://builds.apache.org/job/james-server-trunk/ws/trunk/filesystem-api/src/main/java/org/apache/james/filesystem/api/SieveFileRepository.java>:[260,34]
cannot find symbol
symbol  : class ScriptSummary
location: class org.apache.james.managesieve.file.SieveFileRepository
[ERROR] <https://builds.apache.org/job/james-server-trunk/ws/trunk/filesystem-api/src/main/java/org/apache/james/filesystem/api/SieveFileRepository.java>:[303,26]
cannot find symbol
symbol  : class DuplicateException
location: class org.apache.james.managesieve.file.SieveFileRepository
[ERROR] <https://builds.apache.org/job/james-server-trunk/ws/trunk/filesystem-api/src/main/java/org/apache/james/filesystem/api/SieveFileRepository.java>:[307,16]
cannot find symbol
symbol  : variable FileUtils
location: class org.apache.james.managesieve.file.SieveFileRepository
[ERROR] <https://builds.apache.org/job/james-server-trunk/ws/trunk/filesystem-api/src/main/java/org/apache/james/filesystem/api/SieveFileRepository.java>:[311,16]
cannot find symbol
symbol  : variable FileUtils
location: class org.apache.james.managesieve.file.SieveFileRepository
[ERROR] <https://builds.apache.org/job/james-server-trunk/ws/trunk/filesystem-api/src/main/java/org/apache/james/filesystem/api/SieveFileRepository.java>:[313,26]
cannot find symbol
symbol  : class StorageException
location: class org.apache.james.managesieve.file.SieveFileRepository
[ERROR] <https://builds.apache.org/job/james-server-trunk/ws/trunk/filesystem-api/src/main/java/org/apache/james/filesystem/api/SieveFileRepository.java>:[327,22]
cannot find symbol
symbol  : class ScriptNotFoundException
location: class org.apache.james.managesieve.file.SieveFileRepository
[ERROR] <https://builds.apache.org/job/james-server-trunk/ws/trunk/filesystem-api/src/main/java/org/apache/james/filesystem/api/SieveFileRepository.java>:[344,21]
cannot find symbol
symbol  : class ScriptNotFoundException
location: class org.apache.james.managesieve.file.SieveFileRepository
[ERROR] <https://builds.apache.org/job/james-server-trunk/ws/trunk/filesystem-api/src/main/java/org/apache/james/filesystem/api/SieveFileRepository.java>:[351,25]
cannot find symbol
symbol  : class ScriptNotFoundException
location: class org.apache.james.managesieve.file.SieveFileRepository
[ERROR] <https://builds.apache.org/job/james-server-trunk/ws/trunk/filesystem-api/src/main/java/org/apache/james/filesystem/api/SieveFileRepository.java>:[366,22]
cannot find symbol
symbol  : class ConfigurationError
location: class org.apache.james.managesieve.file.SieveFileRepository
[ERROR] <https://builds.apache.org/job/james-server-trunk/ws/trunk/filesystem-api/src/main/java/org/apache/james/filesystem/api/SieveFileRepository.java>:[373,22]
cannot find symbol
symbol  : class UserNotFoundException
location: class org.apache.james.managesieve.file.SieveFileRepository
[ERROR] <https://builds.apache.org/job/james-server-trunk/ws/trunk/filesystem-api/src/main/java/org/apache/james/filesystem/api/SieveFileRepository.java>:[389,22]
cannot find symbol
symbol  : class ScriptNotFoundException
location: class org.apache.james.managesieve.file.SieveFileRepository
[ERROR] <https://builds.apache.org/job/james-server-trunk/ws/trunk/filesystem-api/src/main/java/org/apache/james/filesystem/api/SieveFileRepository.java>:[399,17]
cannot find symbol
symbol  : class ScriptNotFoundException
location: class org.apache.james.managesieve.file.SieveFileRepository
[ERROR] <https://builds.apache.org/job/james-server-trunk/ws/trunk/filesystem-api/src/main/java/org/apache/james/filesystem/api/SieveFileRepository.java>:[412,16]
cannot find symbol
symbol  : variable FileUtils
location: class org.apache.james.managesieve.file.SieveFileRepository
[ERROR] <https://builds.apache.org/job/james-server-trunk/ws/trunk/filesystem-api/src/main/java/org/apache/james/filesystem/api/SieveFileRepository.java>:[414,26]
cannot find symbol
symbol  : class StorageException
location: class org.apache.james.managesieve.file.SieveFileRepository
[ERROR] <https://builds.apache.org/job/james-server-trunk/ws/trunk/filesystem-api/src/main/java/org/apache/james/filesystem/api/SieveFileRepository.java>:[423,22]
cannot find symbol
symbol  : class ScriptNotFoundException
location: class org.apache.james.managesieve.file.SieveFileRepository
[ERROR] <https://builds.apache.org/job/james-server-trunk/ws/trunk/filesystem-api/src/main/java/org/apache/james/filesystem/api/SieveFileRepository.java>:[436,17]
cannot find symbol
symbol  : class UserNotFoundException
location: class org.apache.james.managesieve.file.SieveFileRepository
[ERROR] <https://builds.apache.org/job/james-server-trunk/ws/trunk/filesystem-api/src/main/java/org/apache/james/filesystem/api/SieveFileRepository.java>:[451,21]
cannot find symbol
symbol  : class UserNotFoundException
location: class org.apache.james.managesieve.file.SieveFileRepository
[ERROR] <https://builds.apache.org/job/james-server-trunk/ws/trunk/filesystem-api/src/main/java/org/apache/james/filesystem/api/SieveFileRepository.java>:[455,26]
cannot find symbol
symbol  : class DuplicateUserException
location: class org.apache.james.managesieve.file.SieveFileRepository
[ERROR] <https://builds.apache.org/job/james-server-trunk/ws/trunk/filesystem-api/src/main/java/org/apache/james/filesystem/api/SieveFileRepository.java>:[459,16]
cannot find symbol
symbol  : variable FileUtils
location: class org.apache.james.managesieve.file.SieveFileRepository
[ERROR] <https://builds.apache.org/job/james-server-trunk/ws/trunk/filesystem-api/src/main/java/org/apache/james/filesystem/api/SieveFileRepository.java>:[461,26]
cannot find symbol
symbol  : class StorageException
location: class org.apache.james.managesieve.file.SieveFileRepository
[INFO] 100 errors 
[INFO] -------------------------------------------------------------
[JENKINS] Archiving <https://builds.apache.org/job/james-server-trunk/ws/trunk/filesystem-api/pom.xml>
to /home/hudson/hudson/jobs/james-server-trunk/modules/org.apache.james$james-server-filesystem-api/builds/2012-02-22_08-40-44/archive/org.apache.james/james-server-filesystem-api/3.0-beta4-SNAPSHOT/james-server-filesystem-api-3.0-beta4-SNAPSHOT.pom
[INFO] ------------------------------------------------------------------------
[INFO] Reactor Summary:
[INFO] 
[INFO] Apache James Server ............................... SUCCESS [34.175s]
[INFO] Apache James Server Lifecycle API ................. SUCCESS [7.714s]
[INFO] Apache James Server Filesystem API ................ FAILURE [1.126s]
[INFO] Apache James Server Data API ...................... SKIPPED
[INFO] Apache James Server Lifecycle Spring .............. SKIPPED
[INFO] Apache James Server Mailetcontainer API ........... SKIPPED
[INFO] Apache James Server Common Utilities .............. SKIPPED
[INFO] Apache James Server Protocols Library ............. SKIPPED
[INFO] Apache James Server Core .......................... SKIPPED
[INFO] Apache James Server Container Spring .............. SKIPPED
[INFO] Apache James Server DNS Server API ................ SKIPPED
[INFO] Apache James Server DNSService Implementation ..... SKIPPED
[INFO] Apache James Server DNSService Library ............ SKIPPED
[INFO] Apache James Server Queue API ..................... SKIPPED
[INFO] Apache James Server FetchMail ..................... SKIPPED
[INFO] Apache James Server Data Library .................. SKIPPED
[INFO] Apache James Server HBase Data Persistence ........ SKIPPED
[INFO] Apache James Server JPA Data Persistence .......... SKIPPED
[INFO] Apache James Server JCR Data Persistence .......... SKIPPED
[INFO] Apache James Server JDBC Data Persistence ......... SKIPPED
[INFO] Apache James Server File Data Persistence ......... SKIPPED
[INFO] Apache James Server LDAP Data Implementation ...... SKIPPED
[INFO] Apache James Server Mailbox Adapter ............... SKIPPED
[INFO] Apache James Server Mailetcontainer Camel implementation  SKIPPED
[INFO] Apache James Server Mailets ....................... SKIPPED
[INFO] Apache James Server IMAP .......................... SKIPPED
[INFO] Apache James Server SMTP .......................... SKIPPED
[INFO] Apache James Server LMTP .......................... SKIPPED
[INFO] Apache James Server POP3 .......................... SKIPPED
[INFO] Apache James Server File Mail Queue ............... SKIPPED
[INFO] Apache James Server JMS Mail Queue ................ SKIPPED
[INFO] Apache James Server ActiveMQ Queue ................ SKIPPED
[INFO] Apache James Server Client ........................ SKIPPED
[INFO] ------------------------------------------------------------------------
[INFO] BUILD FAILURE
[INFO] ------------------------------------------------------------------------
[INFO] Total time: 54.127s
[INFO] Finished at: Wed Feb 22 08:41:47 UTC 2012
[INFO] Final Memory: 29M/147M
[INFO] ------------------------------------------------------------------------
mavenExecutionResult exceptions not empty
message : Failed to execute goal org.apache.maven.plugins:maven-compiler-plugin:2.3.2:compile
(default-compile) on project james-server-filesystem-api: Compilation failure
cause : Compilation failure
Stack trace : 
org.apache.maven.lifecycle.LifecycleExecutionException: Failed to execute goal org.apache.maven.plugins:maven-compiler-plugin:2.3.2:compile
(default-compile) on project james-server-filesystem-api: Compilation failure
	at org.apache.maven.lifecycle.internal.MojoExecutor.execute(MojoExecutor.java:213)
	at org.apache.maven.lifecycle.internal.MojoExecutor.execute(MojoExecutor.java:153)
	at org.apache.maven.lifecycle.internal.MojoExecutor.execute(MojoExecutor.java:145)
	at org.apache.maven.lifecycle.internal.LifecycleModuleBuilder.buildProject(LifecycleModuleBuilder.java:84)
	at org.apache.maven.lifecycle.internal.LifecycleModuleBuilder.buildProject(LifecycleModuleBuilder.java:59)
	at org.apache.maven.lifecycle.internal.LifecycleStarter.singleThreadedBuild(LifecycleStarter.java:183)
	at org.apache.maven.lifecycle.internal.LifecycleStarter.execute(LifecycleStarter.java:161)
	at org.apache.maven.DefaultMaven.doExecute(DefaultMaven.java:319)
	at org.apache.maven.DefaultMaven.execute(DefaultMaven.java:156)
	at org.jvnet.hudson.maven3.launcher.Maven3Launcher.main(Maven3Launcher.java:79)
	at sun.reflect.NativeMethodAccessorImpl.invoke0(Native Method)
	at sun.reflect.NativeMethodAccessorImpl.invoke(NativeMethodAccessorImpl.java:39)
	at sun.reflect.DelegatingMethodAccessorImpl.invoke(DelegatingMethodAccessorImpl.java:25)
	at java.lang.reflect.Method.invoke(Method.java:597)
	at org.codehaus.plexus.classworlds.launcher.Launcher.launchStandard(Launcher.java:329)
	at org.codehaus.plexus.classworlds.launcher.Launcher.launch(Launcher.java:239)
	at org.jvnet.hudson.maven3.agent.Maven3Main.launch(Maven3Main.java:158)
	at hudson.maven.Maven3Builder.call(Maven3Builder.java:104)
	at hudson.maven.Maven3Builder.call(Maven3Builder.java:70)
	at hudson.remoting.UserRequest.perform(UserRequest.java:118)
	at hudson.remoting.UserRequest.perform(UserRequest.java:48)
	at hudson.remoting.Request$2.run(Request.java:287)
	at hudson.remoting.InterceptingExecutorService$1.call(InterceptingExecutorService.java:72)
	at java.util.concurrent.FutureTask$Sync.innerRun(FutureTask.java:303)
	at java.util.concurrent.FutureTask.run(FutureTask.java:138)
	at java.util.concurrent.ThreadPoolExecutor$Worker.runTask(ThreadPoolExecutor.java:886)
	at java.util.concurrent.ThreadPoolExecutor$Worker.run(ThreadPoolExecutor.java:908)
	at java.lang.Thread.run(Thread.java:662)
Caused by: org.apache.maven.plugin.CompilationFailureException: Compilation failure
	at org.apache.maven.plugin.AbstractCompilerMojo.execute(AbstractCompilerMojo.java:656)
	at org.apache.maven.plugin.CompilerMojo.execute(CompilerMojo.java:128)
	at org.apache.maven.plugin.DefaultBuildPluginManager.executeMojo(DefaultBuildPluginManager.java:101)
	at org.apache.maven.lifecycle.internal.MojoExecutor.execute(MojoExecutor.java:209)
	... 27 more
channel stopped


---------------------------------------------------------------------
To unsubscribe, e-mail: server-dev-unsubscribe@james.apache.org
For additional commands, e-mail: server-dev-help@james.apache.org


Mime
View raw message