james-server-dev mailing list archives

Site index · List index
Message view « Date » · « Thread »
Top « Date » · « Thread »
From Apache Jenkins Server <jenk...@builds.apache.org>
Subject Build failed in Jenkins: james-server-trunk #2633
Date Tue, 14 Feb 2012 14:53:05 GMT
See <https://builds.apache.org/job/james-server-trunk/2633/changes>

Changes:

[eric] Use protocols 1.6.2 release (JAMES-1372)

------------------------------------------
[...truncated 2898 lines...]
Uploaded: https://repository.apache.org/content/repositories/snapshots/org/apache/james/james-server-data-library/3.0-beta4-SNAPSHOT/james-server-data-library-3.0-beta4-20120214.145112-661.pom
(5 KB at 33.8 KB/sec)
Downloading: https://repository.apache.org/content/repositories/snapshots/org/apache/james/james-server-data-library/maven-metadata.xml
Downloaded: https://repository.apache.org/content/repositories/snapshots/org/apache/james/james-server-data-library/maven-metadata.xml
(451 B at 1.0 KB/sec)
Uploading: https://repository.apache.org/content/repositories/snapshots/org/apache/james/james-server-data-library/3.0-beta4-SNAPSHOT/maven-metadata.xml
Uploaded: https://repository.apache.org/content/repositories/snapshots/org/apache/james/james-server-data-library/3.0-beta4-SNAPSHOT/maven-metadata.xml
(2 KB at 9.5 KB/sec)
Uploading: https://repository.apache.org/content/repositories/snapshots/org/apache/james/james-server-data-library/maven-metadata.xml
Uploaded: https://repository.apache.org/content/repositories/snapshots/org/apache/james/james-server-data-library/maven-metadata.xml
(451 B at 1.7 KB/sec)
Uploading: https://repository.apache.org/content/repositories/snapshots/org/apache/james/james-server-data-library/3.0-beta4-SNAPSHOT/james-server-data-library-3.0-beta4-20120214.145112-661-tests.jar
Uploaded: https://repository.apache.org/content/repositories/snapshots/org/apache/james/james-server-data-library/3.0-beta4-SNAPSHOT/james-server-data-library-3.0-beta4-20120214.145112-661-tests.jar
(30 KB at 302.2 KB/sec)
Uploading: https://repository.apache.org/content/repositories/snapshots/org/apache/james/james-server-data-library/3.0-beta4-SNAPSHOT/maven-metadata.xml
Uploaded: https://repository.apache.org/content/repositories/snapshots/org/apache/james/james-server-data-library/3.0-beta4-SNAPSHOT/maven-metadata.xml
(2 KB at 11.1 KB/sec)
[JENKINS] Archiving <https://builds.apache.org/job/james-server-trunk/ws/trunk/data-library/pom.xml>
to /home/hudson/hudson/jobs/james-server-trunk/modules/org.apache.james$james-server-data-library/builds/2012-02-14_14-41-37/archive/org.apache.james/james-server-data-library/3.0-beta4-SNAPSHOT/james-server-data-library-3.0-beta4-SNAPSHOT.pom
[JENKINS] Archiving <https://builds.apache.org/job/james-server-trunk/ws/trunk/data-library/target/james-server-data-library-3.0-beta4-SNAPSHOT.jar>
to /home/hudson/hudson/jobs/james-server-trunk/modules/org.apache.james$james-server-data-library/builds/2012-02-14_14-41-37/archive/org.apache.james/james-server-data-library/3.0-beta4-20120214.145112-661/james-server-data-library-3.0-beta4-20120214.145112-661.jar
[JENKINS] Archiving <https://builds.apache.org/job/james-server-trunk/ws/trunk/data-library/target/james-server-data-library-3.0-beta4-SNAPSHOT-tests.jar>
to /home/hudson/hudson/jobs/james-server-trunk/modules/org.apache.james$james-server-data-library/builds/2012-02-14_14-41-37/archive/org.apache.james/james-server-data-library/3.0-beta4-20120214.145112-661/james-server-data-library-3.0-beta4-20120214.145112-661-tests.jar
[INFO]                                                                         
[INFO] ------------------------------------------------------------------------
[INFO] Building Apache James Server HBase Data Persistence 3.0-beta4-SNAPSHOT
[INFO] ------------------------------------------------------------------------
[INFO] 
[INFO] --- maven-clean-plugin:2.4.1:clean (default-clean) @ james-server-data-hbase ---
[INFO] 
[INFO] --- maven-remote-resources-plugin:1.2.1:process (default) @ james-server-data-hbase
---
[INFO] [debug] execute contextualize
[INFO] Using 'UTF-8' encoding to copy filtered resources.
[INFO] skip non existing resourceDirectory <https://builds.apache.org/job/james-server-trunk/ws/trunk/data-hbase/src/main/resources>
[INFO] Copying 3 resources

[INFO] --- maven-resources-plugin:2.5:resources (default-resources) @ james-server-data-hbase
---
[INFO] 
[INFO] --- maven-compiler-plugin:2.3.2:compile (default-compile) @ james-server-data-hbase
---
[INFO] Compiling 7 source files to <https://builds.apache.org/job/james-server-trunk/ws/trunk/data-hbase/target/classes>
[INFO] 
[INFO] --- maven-bundle-plugin:2.3.5:manifest (bundle-manifest) @ james-server-data-hbase
---
[debug] execute contextualize
[INFO] [INFO] Using 'UTF-8' encoding to copy filtered resources.
[INFO] Copying 1 resource
[INFO] Copying 3 resources

[INFO] --- maven-resources-plugin:2.5:testResources (default-testResources) @ james-server-data-hbase
---
[INFO] 
[INFO] --- maven-compiler-plugin:2.3.2:testCompile (default-testCompile) @ james-server-data-hbase
---
[INFO] Compiling 5 source files to <https://builds.apache.org/job/james-server-trunk/ws/trunk/data-hbase/target/test-classes>
[INFO] 
[INFO] [INFO] Surefire report directory: <https://builds.apache.org/job/james-server-trunk/ws/trunk/data-hbase/target/surefire-reports>
--- maven-surefire-plugin:2.10:test (default-test) @ james-server-data-hbase ---

-------------------------------------------------------
 T E S T S
-------------------------------------------------------

-------------------------------------------------------
 T E S T S
-------------------------------------------------------
Running org.apache.james.JamesServerHBaseSuiteTest
Starting DataNode 0 with dfs.data.dir: <https://builds.apache.org/job/james-server-trunk/ws/trunk/data-hbase/target/test-data/4ffbe4d1-fd9f-475e-9e4e-7344e5a64430/dfs/data/data1,/home/jenkins/jenkins-slave/workspace/james-server-trunk/trunk/data-hbase/target/test-data/4ffbe4d1-fd9f-475e-9e4e-7344e5a64430/dfs/data/data2>
2012-02-14 14:51:57,286 [IPC Server handler 8 on 50561] WARN  org.apache.hadoop.hbase.zookeeper.ZKTable
- Moving table JAMES_DOMAINLIST state to enabled but was already enabled
2012-02-14 14:51:58,418 [IPC Server handler 2 on 50561] WARN  org.apache.hadoop.hbase.zookeeper.ZKTable
- Moving table JAMES_RRT state to enabled but was already enabled
2012-02-14 14:51:59,529 [IPC Server handler 6 on 50561] WARN  org.apache.hadoop.hbase.zookeeper.ZKTable
- Moving table JAMES_USERS state to enabled but was already enabled
2012-02-14 14:52:01,799 [main] ERROR MockLog - Exception during regexMap processing: 
java.util.regex.PatternSyntaxException: Regex should be formatted as regex:<regular-expression>:<parameterized-string>
near index 0
regex:(.*)@localhost
^
	at org.apache.james.rrt.lib.RecipientRewriteTableUtil.regexMap(RecipientRewriteTableUtil.java:67)
	at org.apache.james.rrt.lib.AbstractRecipientRewriteTable.getMappings(AbstractRecipientRewriteTable.java:137)
	at org.apache.james.rrt.lib.AbstractRecipientRewriteTable.getMappings(AbstractRecipientRewriteTable.java:111)
	at org.apache.james.rrt.lib.AbstractRecipientRewriteTableTest.testStoreAndRetrieveRegexMapping(AbstractRecipientRewriteTableTest.java:98)
	at sun.reflect.NativeMethodAccessorImpl.invoke0(Native Method)
	at sun.reflect.NativeMethodAccessorImpl.invoke(NativeMethodAccessorImpl.java:39)
	at sun.reflect.DelegatingMethodAccessorImpl.invoke(DelegatingMethodAccessorImpl.java:25)
	at java.lang.reflect.Method.invoke(Method.java:597)
	at junit.framework.TestCase.runTest(TestCase.java:168)
	at junit.framework.TestCase.runBare(TestCase.java:134)
	at junit.framework.TestResult$1.protect(TestResult.java:110)
	at junit.framework.TestResult.runProtected(TestResult.java:128)
	at junit.framework.TestResult.run(TestResult.java:113)
	at junit.framework.TestCase.run(TestCase.java:124)
	at junit.framework.TestSuite.runTest(TestSuite.java:243)
	at junit.framework.TestSuite.run(TestSuite.java:238)
	at org.junit.internal.runners.JUnit38ClassRunner.run(JUnit38ClassRunner.java:83)
	at org.junit.runners.Suite.runChild(Suite.java:128)
	at org.junit.runners.Suite.runChild(Suite.java:24)
	at org.junit.runners.ParentRunner$3.run(ParentRunner.java:193)
	at org.junit.runners.ParentRunner$1.schedule(ParentRunner.java:52)
	at org.junit.runners.ParentRunner.runChildren(ParentRunner.java:191)
	at org.junit.runners.ParentRunner.access$000(ParentRunner.java:42)
	at org.junit.runners.ParentRunner$2.evaluate(ParentRunner.java:184)
	at org.junit.internal.runners.statements.RunBefores.evaluate(RunBefores.java:28)
	at org.junit.internal.runners.statements.RunAfters.evaluate(RunAfters.java:31)
	at org.junit.runners.ParentRunner.run(ParentRunner.java:236)
	at org.apache.maven.surefire.junit4.JUnit4TestSet.execute(JUnit4TestSet.java:53)
	at org.apache.maven.surefire.junit4.JUnit4Provider.executeTestSet(JUnit4Provider.java:123)
	at org.apache.maven.surefire.junit4.JUnit4Provider.invoke(JUnit4Provider.java:104)
	at sun.reflect.NativeMethodAccessorImpl.invoke0(Native Method)
	at sun.reflect.NativeMethodAccessorImpl.invoke(NativeMethodAccessorImpl.java:39)
	at sun.reflect.DelegatingMethodAccessorImpl.invoke(DelegatingMethodAccessorImpl.java:25)
	at java.lang.reflect.Method.invoke(Method.java:597)
	at org.apache.maven.surefire.util.ReflectionUtils.invokeMethodWithArray(ReflectionUtils.java:164)
	at org.apache.maven.surefire.booter.ProviderFactory$ProviderProxy.invoke(ProviderFactory.java:110)
	at org.apache.maven.surefire.booter.SurefireStarter.invokeProvider(SurefireStarter.java:175)
	at org.apache.maven.surefire.booter.SurefireStarter.runSuitesInProcessWhenForked(SurefireStarter.java:81)
	at org.apache.maven.surefire.booter.ForkedBooter.main(ForkedBooter.java:68)
2012-02-14 14:52:01,818 [main] ERROR MockLog - Exception during regexMap processing: 
java.util.regex.PatternSyntaxException: Regex should be formatted as regex:<regular-expression>:<parameterized-string>
near index 0
regex:(.+)@test
^
	at org.apache.james.rrt.lib.RecipientRewriteTableUtil.regexMap(RecipientRewriteTableUtil.java:67)
	at org.apache.james.rrt.lib.AbstractRecipientRewriteTable.getMappings(AbstractRecipientRewriteTable.java:137)
	at org.apache.james.rrt.lib.AbstractRecipientRewriteTable.getMappings(AbstractRecipientRewriteTable.java:111)
	at org.apache.james.rrt.lib.AbstractRecipientRewriteTableTest.testStoreAndRetrieveRegexMapping(AbstractRecipientRewriteTableTest.java:98)
	at sun.reflect.NativeMethodAccessorImpl.invoke0(Native Method)
	at sun.reflect.NativeMethodAccessorImpl.invoke(NativeMethodAccessorImpl.java:39)
	at sun.reflect.DelegatingMethodAccessorImpl.invoke(DelegatingMethodAccessorImpl.java:25)
	at java.lang.reflect.Method.invoke(Method.java:597)
	at junit.framework.TestCase.runTest(TestCase.java:168)
	at junit.framework.TestCase.runBare(TestCase.java:134)
	at junit.framework.TestResult$1.protect(TestResult.java:110)
	at junit.framework.TestResult.runProtected(TestResult.java:128)
	at junit.framework.TestResult.run(TestResult.java:113)
	at junit.framework.TestCase.run(TestCase.java:124)
	at junit.framework.TestSuite.runTest(TestSuite.java:243)
	at junit.framework.TestSuite.run(TestSuite.java:238)
	at org.junit.internal.runners.JUnit38ClassRunner.run(JUnit38ClassRunner.java:83)
	at org.junit.runners.Suite.runChild(Suite.java:128)
	at org.junit.runners.Suite.runChild(Suite.java:24)
	at org.junit.runners.ParentRunner$3.run(ParentRunner.java:193)
	at org.junit.runners.ParentRunner$1.schedule(ParentRunner.java:52)
	at org.junit.runners.ParentRunner.runChildren(ParentRunner.java:191)
	at org.junit.runners.ParentRunner.access$000(ParentRunner.java:42)
	at org.junit.runners.ParentRunner$2.evaluate(ParentRunner.java:184)
	at org.junit.internal.runners.statements.RunBefores.evaluate(RunBefores.java:28)
	at org.junit.internal.runners.statements.RunAfters.evaluate(RunAfters.java:31)
	at org.junit.runners.ParentRunner.run(ParentRunner.java:236)
	at org.apache.maven.surefire.junit4.JUnit4TestSet.execute(JUnit4TestSet.java:53)
	at org.apache.maven.surefire.junit4.JUnit4Provider.executeTestSet(JUnit4Provider.java:123)
	at org.apache.maven.surefire.junit4.JUnit4Provider.invoke(JUnit4Provider.java:104)
	at sun.reflect.NativeMethodAccessorImpl.invoke0(Native Method)
	at sun.reflect.NativeMethodAccessorImpl.invoke(NativeMethodAccessorImpl.java:39)
	at sun.reflect.DelegatingMethodAccessorImpl.invoke(DelegatingMethodAccessorImpl.java:25)
	at java.lang.reflect.Method.invoke(Method.java:597)
	at org.apache.maven.surefire.util.ReflectionUtils.invokeMethodWithArray(ReflectionUtils.java:164)
	at org.apache.maven.surefire.booter.ProviderFactory$ProviderProxy.invoke(ProviderFactory.java:110)
	at org.apache.maven.surefire.booter.SurefireStarter.invokeProvider(SurefireStarter.java:175)
	at org.apache.maven.surefire.booter.SurefireStarter.runSuitesInProcessWhenForked(SurefireStarter.java:81)
	at org.apache.maven.surefire.booter.ForkedBooter.main(ForkedBooter.java:68)
Tests run: 21, Failures: 1, Errors: 0, Skipped: 0, Time elapsed: 29.76 sec <<< FAILURE!

Results :

Failed tests:   testUpperCaseSameUser(org.apache.james.user.hbase.HBaseUsersRepositoryTest):
The exception message must contain the username value

Tests run: 21, Failures: 1, Errors: 0, Skipped: 0

[JENKINS] Recording test results
[JENKINS] Archiving <https://builds.apache.org/job/james-server-trunk/ws/trunk/data-hbase/pom.xml>
to /home/hudson/hudson/jobs/james-server-trunk/modules/org.apache.james$james-server-data-hbase/builds/2012-02-14_14-41-37/archive/org.apache.james/james-server-data-hbase/3.0-beta4-SNAPSHOT/james-server-data-hbase-3.0-beta4-SNAPSHOT.pom
[INFO] ------------------------------------------------------------------------
[INFO] Reactor Summary:
[INFO] 
[INFO] Apache James Server ............................... SUCCESS [1:40.451s]
[INFO] Apache James Server Lifecycle API ................. SUCCESS [19.095s]
[INFO] Apache James Server Filesystem API ................ SUCCESS [12.423s]
[INFO] Apache James Server Data API ...................... SUCCESS [13.197s]
[INFO] Apache James Server Lifecycle Spring .............. SUCCESS [33.319s]
[INFO] Apache James Server Mailetcontainer API ........... SUCCESS [22.861s]
[INFO] Apache James Server Common Utilities .............. SUCCESS [56.731s]
[INFO] Apache James Server Protocols Library ............. SUCCESS [34.587s]
[INFO] Apache James Server Core .......................... SUCCESS [37.717s]
[INFO] Apache James Server Container Spring .............. SUCCESS [24.867s]
[INFO] Apache James Server DNS Server API ................ SUCCESS [13.178s]
[INFO] Apache James Server DNSService Implementation ..... SUCCESS [38.513s]
[INFO] Apache James Server DNSService Library ............ SUCCESS [29.718s]
[INFO] Apache James Server Queue API ..................... SUCCESS [17.223s]
[INFO] Apache James Server FetchMail ..................... SUCCESS [32.892s]
[INFO] Apache James Server Data Library .................. SUCCESS [33.416s]
[INFO] Apache James Server HBase Data Persistence ........ FAILURE [45.859s]
[INFO] Apache James Server JPA Data Persistence .......... SKIPPED
[INFO] Apache James Server JCR Data Persistence .......... SKIPPED
[INFO] Apache James Server JDBC Data Persistence ......... SKIPPED
[INFO] Apache James Server File Data Persistence ......... SKIPPED
[INFO] Apache James Server LDAP Data Implementation ...... SKIPPED
[INFO] Apache James Server Mailbox Adapter ............... SKIPPED
[INFO] Apache James Server Mailetcontainer Camel implementation  SKIPPED
[INFO] Apache James Server Mailets ....................... SKIPPED
[INFO] Apache James Server IMAP .......................... SKIPPED
[INFO] Apache James Server SMTP .......................... SKIPPED
[INFO] Apache James Server LMTP .......................... SKIPPED
[INFO] Apache James Server POP3 .......................... SKIPPED
[INFO] Apache James Server File Mail Queue ............... SKIPPED
[INFO] Apache James Server JMS Mail Queue ................ SKIPPED
[INFO] Apache James Server ActiveMQ Queue ................ SKIPPED
[INFO] Apache James Server Client ........................ SKIPPED
[INFO] ------------------------------------------------------------------------
[INFO] BUILD FAILURE
[INFO] ------------------------------------------------------------------------
[INFO] Total time: 10:11.982s
[INFO] Finished at: Tue Feb 14 14:52:08 UTC 2012
[INFO] Final Memory: 60M/166M
[INFO] ------------------------------------------------------------------------
Waiting for Jenkins to finish collecting data
mavenExecutionResult exceptions not empty
message : Failed to execute goal org.apache.maven.plugins:maven-surefire-plugin:2.10:test
(default-test) on project james-server-data-hbase: There are test failures.

Please refer to <https://builds.apache.org/job/james-server-trunk/ws/trunk/data-hbase/target/surefire-reports>
for the individual test results.
cause : There are test failures.

Please refer to <https://builds.apache.org/job/james-server-trunk/ws/trunk/data-hbase/target/surefire-reports>
for the individual test results.
Stack trace : 
org.apache.maven.lifecycle.LifecycleExecutionException: Failed to execute goal org.apache.maven.plugins:maven-surefire-plugin:2.10:test
(default-test) on project james-server-data-hbase: There are test failures.

Please refer to <https://builds.apache.org/job/james-server-trunk/ws/trunk/data-hbase/target/surefire-reports>
for the individual test results.
	at org.apache.maven.lifecycle.internal.MojoExecutor.execute(MojoExecutor.java:213)
	at org.apache.maven.lifecycle.internal.MojoExecutor.execute(MojoExecutor.java:153)
	at org.apache.maven.lifecycle.internal.MojoExecutor.execute(MojoExecutor.java:145)
	at org.apache.maven.lifecycle.internal.LifecycleModuleBuilder.buildProject(LifecycleModuleBuilder.java:84)
	at org.apache.maven.lifecycle.internal.LifecycleModuleBuilder.buildProject(LifecycleModuleBuilder.java:59)
	at org.apache.maven.lifecycle.internal.LifecycleStarter.singleThreadedBuild(LifecycleStarter.java:183)
	at org.apache.maven.lifecycle.internal.LifecycleStarter.execute(LifecycleStarter.java:161)
	at org.apache.maven.DefaultMaven.doExecute(DefaultMaven.java:319)
	at org.apache.maven.DefaultMaven.execute(DefaultMaven.java:156)
	at org.jvnet.hudson.maven3.launcher.Maven3Launcher.main(Maven3Launcher.java:79)
	at sun.reflect.NativeMethodAccessorImpl.invoke0(Native Method)
	at sun.reflect.NativeMethodAccessorImpl.invoke(NativeMethodAccessorImpl.java:39)
	at sun.reflect.DelegatingMethodAccessorImpl.invoke(DelegatingMethodAccessorImpl.java:25)
	at java.lang.reflect.Method.invoke(Method.java:597)
	at org.codehaus.plexus.classworlds.launcher.Launcher.launchStandard(Launcher.java:329)
	at org.codehaus.plexus.classworlds.launcher.Launcher.launch(Launcher.java:239)
	at org.jvnet.hudson.maven3.agent.Maven3Main.launch(Maven3Main.java:158)
	at hudson.maven.Maven3Builder.call(Maven3Builder.java:104)
	at hudson.maven.Maven3Builder.call(Maven3Builder.java:70)
	at hudson.remoting.UserRequest.perform(UserRequest.java:118)
	at hudson.remoting.UserRequest.perform(UserRequest.java:48)
	at hudson.remoting.Request$2.run(Request.java:287)
	at hudson.remoting.InterceptingExecutorService$1.call(InterceptingExecutorService.java:72)
	at java.util.concurrent.FutureTask$Sync.innerRun(FutureTask.java:303)
	at java.util.concurrent.FutureTask.run(FutureTask.java:138)
	at java.util.concurrent.ThreadPoolExecutor$Worker.runTask(ThreadPoolExecutor.java:886)
	at java.util.concurrent.ThreadPoolExecutor$Worker.run(ThreadPoolExecutor.java:908)
	at java.lang.Thread.run(Thread.java:662)
Caused by: org.apache.maven.plugin.MojoFailureException: There are test failures.

Please refer to <https://builds.apache.org/job/james-server-trunk/ws/trunk/data-hbase/target/surefire-reports>
for the individual test results.
	at org.apache.maven.plugin.surefire.SurefireHelper.reportExecution(SurefireHelper.java:87)
	at org.apache.maven.plugin.surefire.SurefirePlugin.writeSummary(SurefirePlugin.java:641)
	at org.apache.maven.plugin.surefire.SurefirePlugin.handleSummary(SurefirePlugin.java:615)
	at org.apache.maven.plugin.surefire.AbstractSurefireMojo.executeAfterPreconditionsChecked(AbstractSurefireMojo.java:137)
	at org.apache.maven.plugin.surefire.AbstractSurefireMojo.execute(AbstractSurefireMojo.java:98)
	at org.apache.maven.plugin.DefaultBuildPluginManager.executeMojo(DefaultBuildPluginManager.java:101)
	at org.apache.maven.lifecycle.internal.MojoExecutor.execute(MojoExecutor.java:209)
	... 27 more
channel stopped


---------------------------------------------------------------------
To unsubscribe, e-mail: server-dev-unsubscribe@james.apache.org
For additional commands, e-mail: server-dev-help@james.apache.org


Mime
View raw message