james-server-dev mailing list archives

Site index · List index
Message view « Date » · « Thread »
Top « Date » · « Thread »
From Apache Jenkins Server <jenk...@builds.apache.org>
Subject Build failed in Jenkins: james-server-trunk #2704
Date Sun, 11 Mar 2012 23:24:33 GMT
See <https://builds.apache.org/job/james-server-trunk/2704/changes>

Changes:

[ieugen] JAMES-1393

- changed access priviledge from protected to public for @After methof
Issue #JAMES-1393 - Upgrate all test suites to junit 4.10

[ieugen] JAMES-1393

- updated tests to juni 4.x style
- added @Override and reformated code
Issue #JAMES-1393 - Upgrate all test suites to junit 4.10

------------------------------------------
[...truncated 1676 lines...]
	at org.apache.james.rrt.lib.AbstractRecipientRewriteTable.getMappings(AbstractRecipientRewriteTable.java:111)
	at org.apache.james.rrt.lib.AbstractRecipientRewriteTableTest.testStoreAndRetrieveRegexMapping(AbstractRecipientRewriteTableTest.java:101)
	at sun.reflect.NativeMethodAccessorImpl.invoke0(Native Method)
	at sun.reflect.NativeMethodAccessorImpl.invoke(NativeMethodAccessorImpl.java:39)
	at sun.reflect.DelegatingMethodAccessorImpl.invoke(DelegatingMethodAccessorImpl.java:25)
	at java.lang.reflect.Method.invoke(Method.java:597)
	at org.junit.runners.model.FrameworkMethod$1.runReflectiveCall(FrameworkMethod.java:45)
	at org.junit.internal.runners.model.ReflectiveCallable.run(ReflectiveCallable.java:15)
	at org.junit.runners.model.FrameworkMethod.invokeExplosively(FrameworkMethod.java:42)
	at org.junit.internal.runners.statements.InvokeMethod.evaluate(InvokeMethod.java:20)
	at org.junit.internal.runners.statements.RunBefores.evaluate(RunBefores.java:28)
	at org.junit.internal.runners.statements.RunAfters.evaluate(RunAfters.java:30)
	at org.junit.runners.ParentRunner.runLeaf(ParentRunner.java:263)
	at org.junit.runners.BlockJUnit4ClassRunner.runChild(BlockJUnit4ClassRunner.java:68)
	at org.junit.runners.BlockJUnit4ClassRunner.runChild(BlockJUnit4ClassRunner.java:47)
	at org.junit.runners.ParentRunner$3.run(ParentRunner.java:231)
	at org.junit.runners.ParentRunner$1.schedule(ParentRunner.java:60)
	at org.junit.runners.ParentRunner.runChildren(ParentRunner.java:229)
	at org.junit.runners.ParentRunner.access$000(ParentRunner.java:50)
	at org.junit.runners.ParentRunner$2.evaluate(ParentRunner.java:222)
	at org.junit.runners.ParentRunner.run(ParentRunner.java:300)
	at org.apache.maven.surefire.junit4.JUnit4TestSet.execute(JUnit4TestSet.java:53)
	at org.apache.maven.surefire.junit4.JUnit4Provider.executeTestSet(JUnit4Provider.java:123)
	at org.apache.maven.surefire.junit4.JUnit4Provider.invoke(JUnit4Provider.java:104)
	at sun.reflect.NativeMethodAccessorImpl.invoke0(Native Method)
	at sun.reflect.NativeMethodAccessorImpl.invoke(NativeMethodAccessorImpl.java:39)
	at sun.reflect.DelegatingMethodAccessorImpl.invoke(DelegatingMethodAccessorImpl.java:25)
	at java.lang.reflect.Method.invoke(Method.java:597)
	at org.apache.maven.surefire.util.ReflectionUtils.invokeMethodWithArray(ReflectionUtils.java:164)
	at org.apache.maven.surefire.booter.ProviderFactory$ProviderProxy.invoke(ProviderFactory.java:110)
	at org.apache.maven.surefire.booter.SurefireStarter.invokeProvider(SurefireStarter.java:175)
	at org.apache.maven.surefire.booter.SurefireStarter.runSuitesInProcessWhenForked(SurefireStarter.java:81)
	at org.apache.maven.surefire.booter.ForkedBooter.main(ForkedBooter.java:68)
2012-03-11 23:24:23,614 [main] ERROR MockLog - Exception during regexMap processing: 
java.util.regex.PatternSyntaxException: Regex should be formatted as regex:<regular-expression>:<parameterized-string>
near index 0
regex:(.+)@test
^
	at org.apache.james.rrt.lib.RecipientRewriteTableUtil.regexMap(RecipientRewriteTableUtil.java:67)
	at org.apache.james.rrt.lib.AbstractRecipientRewriteTable.getMappings(AbstractRecipientRewriteTable.java:137)
	at org.apache.james.rrt.lib.AbstractRecipientRewriteTable.getMappings(AbstractRecipientRewriteTable.java:111)
	at org.apache.james.rrt.lib.AbstractRecipientRewriteTableTest.testStoreAndRetrieveRegexMapping(AbstractRecipientRewriteTableTest.java:101)
	at sun.reflect.NativeMethodAccessorImpl.invoke0(Native Method)
	at sun.reflect.NativeMethodAccessorImpl.invoke(NativeMethodAccessorImpl.java:39)
	at sun.reflect.DelegatingMethodAccessorImpl.invoke(DelegatingMethodAccessorImpl.java:25)
	at java.lang.reflect.Method.invoke(Method.java:597)
	at org.junit.runners.model.FrameworkMethod$1.runReflectiveCall(FrameworkMethod.java:45)
	at org.junit.internal.runners.model.ReflectiveCallable.run(ReflectiveCallable.java:15)
	at org.junit.runners.model.FrameworkMethod.invokeExplosively(FrameworkMethod.java:42)
	at org.junit.internal.runners.statements.InvokeMethod.evaluate(InvokeMethod.java:20)
	at org.junit.internal.runners.statements.RunBefores.evaluate(RunBefores.java:28)
	at org.junit.internal.runners.statements.RunAfters.evaluate(RunAfters.java:30)
	at org.junit.runners.ParentRunner.runLeaf(ParentRunner.java:263)
	at org.junit.runners.BlockJUnit4ClassRunner.runChild(BlockJUnit4ClassRunner.java:68)
	at org.junit.runners.BlockJUnit4ClassRunner.runChild(BlockJUnit4ClassRunner.java:47)
	at org.junit.runners.ParentRunner$3.run(ParentRunner.java:231)
	at org.junit.runners.ParentRunner$1.schedule(ParentRunner.java:60)
	at org.junit.runners.ParentRunner.runChildren(ParentRunner.java:229)
	at org.junit.runners.ParentRunner.access$000(ParentRunner.java:50)
	at org.junit.runners.ParentRunner$2.evaluate(ParentRunner.java:222)
	at org.junit.runners.ParentRunner.run(ParentRunner.java:300)
	at org.apache.maven.surefire.junit4.JUnit4TestSet.execute(JUnit4TestSet.java:53)
	at org.apache.maven.surefire.junit4.JUnit4Provider.executeTestSet(JUnit4Provider.java:123)
	at org.apache.maven.surefire.junit4.JUnit4Provider.invoke(JUnit4Provider.java:104)
	at sun.reflect.NativeMethodAccessorImpl.invoke0(Native Method)
	at sun.reflect.NativeMethodAccessorImpl.invoke(NativeMethodAccessorImpl.java:39)
	at sun.reflect.DelegatingMethodAccessorImpl.invoke(DelegatingMethodAccessorImpl.java:25)
	at java.lang.reflect.Method.invoke(Method.java:597)
	at org.apache.maven.surefire.util.ReflectionUtils.invokeMethodWithArray(ReflectionUtils.java:164)
	at org.apache.maven.surefire.booter.ProviderFactory$ProviderProxy.invoke(ProviderFactory.java:110)
	at org.apache.maven.surefire.booter.SurefireStarter.invokeProvider(SurefireStarter.java:175)
	at org.apache.maven.surefire.booter.SurefireStarter.runSuitesInProcessWhenForked(SurefireStarter.java:81)
	at org.apache.maven.surefire.booter.ForkedBooter.main(ForkedBooter.java:68)
Tests run: 6, Failures: 0, Errors: 0, Skipped: 0, Time elapsed: 1.353 sec
Running org.apache.james.user.jpa.JpaUsersRepositoryTest
1497  WARN   [main] openjpa.Runtime - Query "SELECT COUNT(user) FROM JamesUser user" is removed
from cache  excluded permanently. Query "SELECT COUNT(user) FROM JamesUser user" is not cached
because it returns a single value rather than a list. A query that returns single value can
not be cached. .
1513  WARN   [main] openjpa.Runtime - Query "SELECT COUNT(user) FROM JamesUser user WHERE
user.name=:name" is removed from cache  excluded permanently. Query "SELECT COUNT(user) FROM
JamesUser user WHERE user.name=:name" is not cached because it returns a single value rather
than a list. A query that returns single value can not be cached. .
Tests run: 7, Failures: 0, Errors: 0, Skipped: 0, Time elapsed: 1.811 sec
Running org.apache.james.domainlist.jpa.JPADomainListTest
Tests run: 5, Failures: 0, Errors: 0, Skipped: 0, Time elapsed: 1.791 sec

Results :

Tests run: 18, Failures: 0, Errors: 0, Skipped: 0

[JENKINS] Recording test results
[INFO] 
[INFO] --- maven-jar-plugin:2.3.2:jar (default-jar) @ james-server-data-jpa ---
[INFO] Building jar: <https://builds.apache.org/job/james-server-trunk/ws/trunk/data-jpa/target/james-server-data-jpa-3.0-beta5-SNAPSHOT.jar>
[INFO] 
[INFO] --- maven-site-plugin:3.0:attach-descriptor (attach-descriptor) @ james-server-data-jpa
---
[INFO] 
[INFO] --- maven-jar-plugin:2.3.2:jar (default) @ james-server-data-jpa ---
[INFO] 
[INFO] --- maven-jar-plugin:2.3.2:test-jar (default) @ james-server-data-jpa ---
[INFO] Building jar: <https://builds.apache.org/job/james-server-trunk/ws/trunk/data-jpa/target/james-server-data-jpa-3.0-beta5-SNAPSHOT-tests.jar>
[INFO] [INFO] Installing <https://builds.apache.org/job/james-server-trunk/ws/trunk/data-jpa/target/james-server-data-jpa-3.0-beta5-SNAPSHOT.jar>
to /home/jenkins/jenkins-slave/maven-repositories/1/org/apache/james/james-server-data-jpa/3.0-beta5-SNAPSHOT/james-server-data-jpa-3.0-beta5-SNAPSHOT.jar

[INFO] --- maven-install-plugin:2.3.1:install (default-install) @ james-server-data-jpa ---
[INFO] Installing <https://builds.apache.org/job/james-server-trunk/ws/trunk/data-jpa/pom.xml>
to /home/jenkins/jenkins-slave/maven-repositories/1/org/apache/james/james-server-data-jpa/3.0-beta5-SNAPSHOT/james-server-data-jpa-3.0-beta5-SNAPSHOT.pom
[INFO] Installing <https://builds.apache.org/job/james-server-trunk/ws/trunk/data-jpa/target/james-server-data-jpa-3.0-beta5-SNAPSHOT-tests.jar>
to /home/jenkins/jenkins-slave/maven-repositories/1/org/apache/james/james-server-data-jpa/3.0-beta5-SNAPSHOT/james-server-data-jpa-3.0-beta5-SNAPSHOT-tests.jar
[INFO] Downloading: https://repository.apache.org/content/repositories/snapshots/org/apache/james/james-server-data-jpa/3.0-beta5-SNAPSHOT/maven-metadata.xml

[INFO] --- maven-deploy-plugin:2.7:deploy (default-deploy) @ james-server-data-jpa ---
Downloaded: https://repository.apache.org/content/repositories/snapshots/org/apache/james/james-server-data-jpa/3.0-beta5-SNAPSHOT/maven-metadata.xml
(1019 B at 7.7 KB/sec)
Uploading: https://repository.apache.org/content/repositories/snapshots/org/apache/james/james-server-data-jpa/3.0-beta5-SNAPSHOT/james-server-data-jpa-3.0-beta5-20120311.232428-14.jar
Uploaded: https://repository.apache.org/content/repositories/snapshots/org/apache/james/james-server-data-jpa/3.0-beta5-SNAPSHOT/james-server-data-jpa-3.0-beta5-20120311.232428-14.jar
(34 KB at 498.2 KB/sec)
Uploading: https://repository.apache.org/content/repositories/snapshots/org/apache/james/james-server-data-jpa/3.0-beta5-SNAPSHOT/james-server-data-jpa-3.0-beta5-20120311.232428-14.pom
Uploaded: https://repository.apache.org/content/repositories/snapshots/org/apache/james/james-server-data-jpa/3.0-beta5-SNAPSHOT/james-server-data-jpa-3.0-beta5-20120311.232428-14.pom
(7 KB at 109.9 KB/sec)
Downloading: https://repository.apache.org/content/repositories/snapshots/org/apache/james/james-server-data-jpa/maven-metadata.xml
Downloaded: https://repository.apache.org/content/repositories/snapshots/org/apache/james/james-server-data-jpa/maven-metadata.xml
(409 B at 6.5 KB/sec)
Uploading: https://repository.apache.org/content/repositories/snapshots/org/apache/james/james-server-data-jpa/3.0-beta5-SNAPSHOT/maven-metadata.xml
Uploaded: https://repository.apache.org/content/repositories/snapshots/org/apache/james/james-server-data-jpa/3.0-beta5-SNAPSHOT/maven-metadata.xml
(1019 B at 11.7 KB/sec)
Uploading: https://repository.apache.org/content/repositories/snapshots/org/apache/james/james-server-data-jpa/maven-metadata.xml
Uploaded: https://repository.apache.org/content/repositories/snapshots/org/apache/james/james-server-data-jpa/maven-metadata.xml
(409 B at 7.0 KB/sec)
Uploading: https://repository.apache.org/content/repositories/snapshots/org/apache/james/james-server-data-jpa/3.0-beta5-SNAPSHOT/james-server-data-jpa-3.0-beta5-20120311.232428-14-tests.jar
Uploaded: https://repository.apache.org/content/repositories/snapshots/org/apache/james/james-server-data-jpa/3.0-beta5-SNAPSHOT/james-server-data-jpa-3.0-beta5-20120311.232428-14-tests.jar
(17 KB at 224.8 KB/sec)
Uploading: https://repository.apache.org/content/repositories/snapshots/org/apache/james/james-server-data-jpa/3.0-beta5-SNAPSHOT/maven-metadata.xml
Uploaded: https://repository.apache.org/content/repositories/snapshots/org/apache/james/james-server-data-jpa/3.0-beta5-SNAPSHOT/maven-metadata.xml
(1019 B at 18.4 KB/sec)
[JENKINS] Archiving <https://builds.apache.org/job/james-server-trunk/ws/trunk/data-jpa/pom.xml>
to /home/hudson/hudson/jobs/james-server-trunk/modules/org.apache.james$james-server-data-jpa/builds/2012-03-11_23-22-41/archive/org.apache.james/james-server-data-jpa/3.0-beta5-SNAPSHOT/james-server-data-jpa-3.0-beta5-SNAPSHOT.pom
[JENKINS] Archiving <https://builds.apache.org/job/james-server-trunk/ws/trunk/data-jpa/target/james-server-data-jpa-3.0-beta5-SNAPSHOT.jar>
to /home/hudson/hudson/jobs/james-server-trunk/modules/org.apache.james$james-server-data-jpa/builds/2012-03-11_23-22-41/archive/org.apache.james/james-server-data-jpa/3.0-beta5-20120311.232428-14/james-server-data-jpa-3.0-beta5-20120311.232428-14.jar
[JENKINS] Archiving <https://builds.apache.org/job/james-server-trunk/ws/trunk/data-jpa/target/james-server-data-jpa-3.0-beta5-SNAPSHOT-tests.jar>
to /home/hudson/hudson/jobs/james-server-trunk/modules/org.apache.james$james-server-data-jpa/builds/2012-03-11_23-22-41/archive/org.apache.james/james-server-data-jpa/3.0-beta5-20120311.232428-14/james-server-data-jpa-3.0-beta5-20120311.232428-14-tests.jar
[INFO]                                                                         
[INFO] ------------------------------------------------------------------------
[INFO] Building Apache James Server JCR Data Persistence 3.0-beta5-SNAPSHOT
[INFO] ------------------------------------------------------------------------
[INFO] [INFO] Deleting <https://builds.apache.org/job/james-server-trunk/ws/trunk/data-jcr/target>

[INFO] --- maven-clean-plugin:2.4.1:clean (default-clean) @ james-server-data-jcr ---
[INFO] 
[INFO] --- maven-remote-resources-plugin:1.2.1:process (default) @ james-server-data-jcr ---
[debug] execute contextualize
[INFO] [INFO] Using 'UTF-8' encoding to copy filtered resources.
[INFO] Copying 1 resource

[INFO] --- maven-resources-plugin:2.5:resources (default-resources) @ james-server-data-jcr
---
[INFO] Copying 3 resources
[INFO] 
[INFO] --- maven-compiler-plugin:2.3.2:compile (default-compile) @ james-server-data-jcr ---
[INFO] Compiling 3 source files to <https://builds.apache.org/job/james-server-trunk/ws/trunk/data-jcr/target/classes>
[INFO] 
[INFO] --- maven-bundle-plugin:2.3.5:manifest (bundle-manifest) @ james-server-data-jcr ---
[debug] execute contextualize
[INFO] [INFO] Using 'UTF-8' encoding to copy filtered resources.

[INFO] Copying 2 resources
[INFO] --- maven-resources-plugin:2.5:testResources (default-testResources) @ james-server-data-jcr
---
[INFO] Copying 3 resources
[INFO] 
[INFO] --- maven-compiler-plugin:2.3.2:testCompile (default-testCompile) @ james-server-data-jcr
---
[INFO] Compiling 1 source file to <https://builds.apache.org/job/james-server-trunk/ws/trunk/data-jcr/target/test-classes>
[INFO] -------------------------------------------------------------
[ERROR] COMPILATION ERROR : 
[INFO] -------------------------------------------------------------
[ERROR] <https://builds.apache.org/job/james-server-trunk/ws/trunk/data-jcr/src/test/java/org/apache/james/user/jcr/JcrUserRepositoryTest.java>:[74,19]
tearDown() in org.apache.james.user.jcr.JcrUserRepositoryTest cannot override tearDown() in
org.apache.james.user.lib.AbstractUsersRepositoryTest; attempting to assign weaker access
privileges; was public
[INFO] 1 error
[INFO] -------------------------------------------------------------
[JENKINS] Archiving <https://builds.apache.org/job/james-server-trunk/ws/trunk/data-jcr/pom.xml>
to /home/hudson/hudson/jobs/james-server-trunk/modules/org.apache.james$james-server-data-jcr/builds/2012-03-11_23-22-41/archive/org.apache.james/james-server-data-jcr/3.0-beta5-SNAPSHOT/james-server-data-jcr-3.0-beta5-SNAPSHOT.pom
[INFO] ------------------------------------------------------------------------
[INFO] Reactor Summary:
[INFO] 
[INFO] Apache James Server ............................... SUCCESS [8.942s]
[INFO] Apache James Server Lifecycle API ................. SUCCESS [3.424s]
[INFO] Apache James Server Filesystem API ................ SUCCESS [2.769s]
[INFO] Apache James Server Data API ...................... SUCCESS [2.357s]
[INFO] Apache James Server Lifecycle Spring .............. SUCCESS [5.304s]
[INFO] Apache James Server Mailetcontainer API ........... SUCCESS [2.079s]
[INFO] Apache James Server Common Utilities .............. SUCCESS [5.694s]
[INFO] Apache James Server Protocols Library ............. SUCCESS [3.014s]
[INFO] Apache James Server Core .......................... SUCCESS [10.536s]
[INFO] Apache James Server Container Spring .............. SUCCESS [4.782s]
[INFO] Apache James Server DNS Server API ................ SUCCESS [2.211s]
[INFO] Apache James Server DNSService Implementation ..... SUCCESS [2.618s]
[INFO] Apache James Server DNSService Library ............ SUCCESS [4.032s]
[INFO] Apache James Server Queue API ..................... SUCCESS [2.088s]
[INFO] Apache James Server FetchMail ..................... SUCCESS [1.848s]
[INFO] Apache James Server Data Library .................. SUCCESS [2.959s]
[INFO] Apache James Server HBase Data Persistence ........ SUCCESS [20.538s]
[INFO] Apache James Server JPA Data Persistence .......... SUCCESS [9.426s]
[INFO] Apache James Server JCR Data Persistence .......... FAILURE [2.383s]
[INFO] Apache James Server JDBC Data Persistence ......... SKIPPED
[INFO] Apache James Server File Data Persistence ......... SKIPPED
[INFO] Apache James Server LDAP Data Implementation ...... SKIPPED
[INFO] Apache James Server Mailbox Adapter ............... SKIPPED
[INFO] Apache James Server Mailetcontainer Camel ......... SKIPPED
[INFO] Apache James Server Mailets ....................... SKIPPED
[INFO] Apache James Server IMAP .......................... SKIPPED
[INFO] Apache James Server SMTP .......................... SKIPPED
[INFO] Apache James Server LMTP .......................... SKIPPED
[INFO] Apache James Server POP3 .......................... SKIPPED
[INFO] Apache James Server File Mail Queue ............... SKIPPED
[INFO] Apache James Server JMS Mail Queue ................ SKIPPED
[INFO] Apache James Server ActiveMQ Queue ................ SKIPPED
[INFO] Apache James Server Client ........................ SKIPPED
[INFO] ------------------------------------------------------------------------
[INFO] BUILD FAILURE
[INFO] ------------------------------------------------------------------------
[INFO] Total time: 1:47.400s
[INFO] Finished at: Sun Mar 11 23:24:31 UTC 2012
[INFO] Final Memory: 78M/291M
[INFO] ------------------------------------------------------------------------
Waiting for Jenkins to finish collecting data
mavenExecutionResult exceptions not empty
message : Failed to execute goal org.apache.maven.plugins:maven-compiler-plugin:2.3.2:testCompile
(default-testCompile) on project james-server-data-jcr: Compilation failure
<https://builds.apache.org/job/james-server-trunk/ws/trunk/data-jcr/src/test/java/org/apache/james/user/jcr/JcrUserRepositoryTest.java>:[74,19]
tearDown() in org.apache.james.user.jcr.JcrUserRepositoryTest cannot override tearDown() in
org.apache.james.user.lib.AbstractUsersRepositoryTest; attempting to assign weaker access
privileges; was public

cause : Compilation failure
<https://builds.apache.org/job/james-server-trunk/ws/trunk/data-jcr/src/test/java/org/apache/james/user/jcr/JcrUserRepositoryTest.java>:[74,19]
tearDown() in org.apache.james.user.jcr.JcrUserRepositoryTest cannot override tearDown() in
org.apache.james.user.lib.AbstractUsersRepositoryTest; attempting to assign weaker access
privileges; was public

Stack trace : 
org.apache.maven.lifecycle.LifecycleExecutionException: Failed to execute goal org.apache.maven.plugins:maven-compiler-plugin:2.3.2:testCompile
(default-testCompile) on project james-server-data-jcr: Compilation failure
<https://builds.apache.org/job/james-server-trunk/ws/trunk/data-jcr/src/test/java/org/apache/james/user/jcr/JcrUserRepositoryTest.java>:[74,19]
tearDown() in org.apache.james.user.jcr.JcrUserRepositoryTest cannot override tearDown() in
org.apache.james.user.lib.AbstractUsersRepositoryTest; attempting to assign weaker access
privileges; was public

	at org.apache.maven.lifecycle.internal.MojoExecutor.execute(MojoExecutor.java:213)
	at org.apache.maven.lifecycle.internal.MojoExecutor.execute(MojoExecutor.java:153)
	at org.apache.maven.lifecycle.internal.MojoExecutor.execute(MojoExecutor.java:145)
	at org.apache.maven.lifecycle.internal.LifecycleModuleBuilder.buildProject(LifecycleModuleBuilder.java:84)
	at org.apache.maven.lifecycle.internal.LifecycleModuleBuilder.buildProject(LifecycleModuleBuilder.java:59)
	at org.apache.maven.lifecycle.internal.LifecycleStarter.singleThreadedBuild(LifecycleStarter.java:183)
	at org.apache.maven.lifecycle.internal.LifecycleStarter.execute(LifecycleStarter.java:161)
	at org.apache.maven.DefaultMaven.doExecute(DefaultMaven.java:319)
	at org.apache.maven.DefaultMaven.execute(DefaultMaven.java:156)
	at org.jvnet.hudson.maven3.launcher.Maven3Launcher.main(Maven3Launcher.java:79)
	at sun.reflect.NativeMethodAccessorImpl.invoke0(Native Method)
	at sun.reflect.NativeMethodAccessorImpl.invoke(NativeMethodAccessorImpl.java:39)
	at sun.reflect.DelegatingMethodAccessorImpl.invoke(DelegatingMethodAccessorImpl.java:25)
	at java.lang.reflect.Method.invoke(Method.java:597)
	at org.codehaus.plexus.classworlds.launcher.Launcher.launchStandard(Launcher.java:329)
	at org.codehaus.plexus.classworlds.launcher.Launcher.launch(Launcher.java:239)
	at org.jvnet.hudson.maven3.agent.Maven3Main.launch(Maven3Main.java:158)
	at hudson.maven.Maven3Builder.call(Maven3Builder.java:104)
	at hudson.maven.Maven3Builder.call(Maven3Builder.java:70)
	at hudson.remoting.UserRequest.perform(UserRequest.java:118)
	at hudson.remoting.UserRequest.perform(UserRequest.java:48)
	at hudson.remoting.Request$2.run(Request.java:287)
	at hudson.remoting.InterceptingExecutorService$1.call(InterceptingExecutorService.java:72)
	at java.util.concurrent.FutureTask$Sync.innerRun(FutureTask.java:303)
	at java.util.concurrent.FutureTask.run(FutureTask.java:138)
	at java.util.concurrent.ThreadPoolExecutor$Worker.runTask(ThreadPoolExecutor.java:886)
	at java.util.concurrent.ThreadPoolExecutor$Worker.run(ThreadPoolExecutor.java:908)
	at java.lang.Thread.run(Thread.java:662)
Caused by: org.apache.maven.plugin.CompilationFailureException: Compilation failure
<https://builds.apache.org/job/james-server-trunk/ws/trunk/data-jcr/src/test/java/org/apache/james/user/jcr/JcrUserRepositoryTest.java>:[74,19]
tearDown() in org.apache.james.user.jcr.JcrUserRepositoryTest cannot override tearDown() in
org.apache.james.user.lib.AbstractUsersRepositoryTest; attempting to assign weaker access
privileges; was public

	at org.apache.maven.plugin.AbstractCompilerMojo.execute(AbstractCompilerMojo.java:656)
	at org.apache.maven.plugin.TestCompilerMojo.execute(TestCompilerMojo.java:161)
	at org.apache.maven.plugin.DefaultBuildPluginManager.executeMojo(DefaultBuildPluginManager.java:101)
	at org.apache.maven.lifecycle.internal.MojoExecutor.execute(MojoExecutor.java:209)
	... 27 more
channel stopped


---------------------------------------------------------------------
To unsubscribe, e-mail: server-dev-unsubscribe@james.apache.org
For additional commands, e-mail: server-dev-help@james.apache.org


Mime
View raw message