james-server-dev mailing list archives

Site index · List index
Message view « Date » · « Thread »
Top « Date » · « Thread »
From Apache Jenkins Server <jenk...@builds.apache.org>
Subject Build failed in Jenkins: james-server-trunk #2681
Date Thu, 01 Mar 2012 15:10:50 GMT
See <https://builds.apache.org/job/james-server-trunk/2681/changes>

Changes:

[eric] [maven-release-plugin] prepare for next development iteration

------------------------------------------
[...truncated 2463 lines...]
Uploaded: https://repository.apache.org/content/repositories/snapshots/org/apache/james/james-server-data-ldap/maven-metadata.xml
(346 B at 2.5 KB/sec)
Uploading: https://repository.apache.org/content/repositories/snapshots/org/apache/james/james-server-data-ldap/3.0-beta5-SNAPSHOT/james-server-data-ldap-3.0-beta5-20120301.151000-2-tests.jar
Uploaded: https://repository.apache.org/content/repositories/snapshots/org/apache/james/james-server-data-ldap/3.0-beta5-SNAPSHOT/james-server-data-ldap-3.0-beta5-20120301.151000-2-tests.jar
(9 KB at 51.2 KB/sec)
Uploading: https://repository.apache.org/content/repositories/snapshots/org/apache/james/james-server-data-ldap/3.0-beta5-SNAPSHOT/maven-metadata.xml
Uploaded: https://repository.apache.org/content/repositories/snapshots/org/apache/james/james-server-data-ldap/3.0-beta5-SNAPSHOT/maven-metadata.xml
(1016 B at 6.7 KB/sec)
[JENKINS] Archiving <https://builds.apache.org/job/james-server-trunk/ws/trunk/data-ldap/pom.xml>
to /home/hudson/hudson/jobs/james-server-trunk/modules/org.apache.james$james-server-data-ldap/builds/2012-03-01_15-04-42/archive/org.apache.james/james-server-data-ldap/3.0-beta5-SNAPSHOT/james-server-data-ldap-3.0-beta5-SNAPSHOT.pom
[JENKINS] Archiving <https://builds.apache.org/job/james-server-trunk/ws/trunk/data-ldap/target/james-server-data-ldap-3.0-beta5-SNAPSHOT.jar>
to /home/hudson/hudson/jobs/james-server-trunk/modules/org.apache.james$james-server-data-ldap/builds/2012-03-01_15-04-42/archive/org.apache.james/james-server-data-ldap/3.0-beta5-20120301.151000-2/james-server-data-ldap-3.0-beta5-20120301.151000-2.jar
[JENKINS] Archiving <https://builds.apache.org/job/james-server-trunk/ws/trunk/data-ldap/target/james-server-data-ldap-3.0-beta5-SNAPSHOT-tests.jar>
to /home/hudson/hudson/jobs/james-server-trunk/modules/org.apache.james$james-server-data-ldap/builds/2012-03-01_15-04-42/archive/org.apache.james/james-server-data-ldap/3.0-beta5-20120301.151000-2/james-server-data-ldap-3.0-beta5-20120301.151000-2-tests.jar
[INFO] Downloading: http://download.java.net/maven/2/org/apache/james/apache-james-mailbox-maildir/0.4/apache-james-mailbox-maildir-0.4.pom
                                                                        
[INFO] ------------------------------------------------------------------------
[INFO] Building Apache James Server Mailbox Adapter 3.0-beta5-SNAPSHOT
[INFO] ------------------------------------------------------------------------
Downloading: http://people.apache.org/~rawson/repo/org/apache/james/apache-james-mailbox-maildir/0.4/apache-james-mailbox-maildir-0.4.pom
Downloading: http://repo1.maven.org/maven2/org/apache/james/apache-james-mailbox-maildir/0.4/apache-james-mailbox-maildir-0.4.pom
Downloaded: http://repo1.maven.org/maven2/org/apache/james/apache-james-mailbox-maildir/0.4/apache-james-mailbox-maildir-0.4.pom
(4 KB at 0.3 KB/sec)
Downloading: http://download.java.net/maven/2/org/apache/james/apache-james-mailbox-maildir/0.4/apache-james-mailbox-maildir-0.4.jar
Downloading: http://people.apache.org/~rawson/repo/org/apache/james/apache-james-mailbox-maildir/0.4/apache-james-mailbox-maildir-0.4.jar
Downloading: http://repo1.maven.org/maven2/org/apache/james/apache-james-mailbox-maildir/0.4/apache-james-mailbox-maildir-0.4.jar
Downloaded: http://repo1.maven.org/maven2/org/apache/james/apache-james-mailbox-maildir/0.4/apache-james-mailbox-maildir-0.4.jar
(70 KB at 32.7 KB/sec)
[INFO] [INFO] Deleting <https://builds.apache.org/job/james-server-trunk/ws/trunk/mailbox-adapter/target>

[INFO] --- maven-clean-plugin:2.4.1:clean (default-clean) @ james-server-mailbox-adapter ---
[INFO] 
[INFO] --- maven-remote-resources-plugin:1.2.1:process (default) @ james-server-mailbox-adapter
---
[debug] execute contextualize
[INFO] [INFO] Using 'UTF-8' encoding to copy filtered resources.
[INFO] Copying 1 resource
[INFO] Copying 3 resources

[INFO] --- maven-resources-plugin:2.5:resources (default-resources) @ james-server-mailbox-adapter
---
[INFO] [INFO] Compiling 4 source files to <https://builds.apache.org/job/james-server-trunk/ws/trunk/mailbox-adapter/target/classes>

[INFO] --- maven-compiler-plugin:2.3.2:compile (default-compile) @ james-server-mailbox-adapter
---
[INFO] 
[INFO] --- maven-bundle-plugin:2.3.5:manifest (bundle-manifest) @ james-server-mailbox-adapter
---
[debug] execute contextualize
[INFO] [INFO] Using 'UTF-8' encoding to copy filtered resources.
[INFO] skip non existing resourceDirectory <https://builds.apache.org/job/james-server-trunk/ws/trunk/mailbox-adapter/src/test/resources>
[INFO] Copying 3 resources

[INFO] --- maven-resources-plugin:2.5:testResources (default-testResources) @ james-server-mailbox-adapter
---
[INFO] [INFO] No sources to compile

[INFO] --- maven-compiler-plugin:2.3.2:testCompile (default-testCompile) @ james-server-mailbox-adapter
---
[INFO] [INFO] Surefire report directory: <https://builds.apache.org/job/james-server-trunk/ws/trunk/mailbox-adapter/target/surefire-reports>

-------------------------------------------------------
 T E S T S
-------------------------------------------------------

-------------------------------------------------------
 T E S T S
-------------------------------------------------------

[INFO] --- maven-surefire-plugin:2.10:test (default-test) @ james-server-mailbox-adapter ---

Results :

Tests run: 0, Failures: 0, Errors: 0, Skipped: 0

[JENKINS] Recording test results
[INFO] [INFO] Building jar: <https://builds.apache.org/job/james-server-trunk/ws/trunk/mailbox-adapter/target/james-server-mailbox-adapter-3.0-beta5-SNAPSHOT.jar>

[INFO] --- maven-jar-plugin:2.3.2:jar (default-jar) @ james-server-mailbox-adapter ---
[INFO] 
[INFO] --- maven-site-plugin:3.0:attach-descriptor (attach-descriptor) @ james-server-mailbox-adapter
---
[INFO] 
[INFO] --- maven-jar-plugin:2.3.2:jar (default) @ james-server-mailbox-adapter ---
[INFO] [INFO] Building jar: <https://builds.apache.org/job/james-server-trunk/ws/trunk/mailbox-adapter/target/james-server-mailbox-adapter-3.0-beta5-SNAPSHOT-tests.jar>

[INFO] --- maven-jar-plugin:2.3.2:test-jar (default) @ james-server-mailbox-adapter ---
[INFO] Installing <https://builds.apache.org/job/james-server-trunk/ws/trunk/mailbox-adapter/target/james-server-mailbox-adapter-3.0-beta5-SNAPSHOT.jar>
to /home/hudson/hudson-slave/maven-repositories/1/org/apache/james/james-server-mailbox-adapter/3.0-beta5-SNAPSHOT/james-server-mailbox-adapter-3.0-beta5-SNAPSHOT.jar
[INFO] [INFO] Installing <https://builds.apache.org/job/james-server-trunk/ws/trunk/mailbox-adapter/pom.xml>
to /home/hudson/hudson-slave/maven-repositories/1/org/apache/james/james-server-mailbox-adapter/3.0-beta5-SNAPSHOT/james-server-mailbox-adapter-3.0-beta5-SNAPSHOT.pom
[INFO] Installing <https://builds.apache.org/job/james-server-trunk/ws/trunk/mailbox-adapter/target/james-server-mailbox-adapter-3.0-beta5-SNAPSHOT-tests.jar>
to /home/hudson/hudson-slave/maven-repositories/1/org/apache/james/james-server-mailbox-adapter/3.0-beta5-SNAPSHOT/james-server-mailbox-adapter-3.0-beta5-SNAPSHOT-tests.jar

[INFO] --- maven-install-plugin:2.3.1:install (default-install) @ james-server-mailbox-adapter
---
[INFO] Downloading: https://repository.apache.org/content/repositories/snapshots/org/apache/james/james-server-mailbox-adapter/3.0-beta5-SNAPSHOT/maven-metadata.xml

[INFO] --- maven-deploy-plugin:2.7:deploy (default-deploy) @ james-server-mailbox-adapter
---
Downloaded: https://repository.apache.org/content/repositories/snapshots/org/apache/james/james-server-mailbox-adapter/3.0-beta5-SNAPSHOT/maven-metadata.xml
(1022 B at 5.0 KB/sec)
Uploading: https://repository.apache.org/content/repositories/snapshots/org/apache/james/james-server-mailbox-adapter/3.0-beta5-SNAPSHOT/james-server-mailbox-adapter-3.0-beta5-20120301.151018-2.jar
Uploaded: https://repository.apache.org/content/repositories/snapshots/org/apache/james/james-server-mailbox-adapter/3.0-beta5-SNAPSHOT/james-server-mailbox-adapter-3.0-beta5-20120301.151018-2.jar
(15 KB at 44.4 KB/sec)
Uploading: https://repository.apache.org/content/repositories/snapshots/org/apache/james/james-server-mailbox-adapter/3.0-beta5-SNAPSHOT/james-server-mailbox-adapter-3.0-beta5-20120301.151018-2.pom
Uploaded: https://repository.apache.org/content/repositories/snapshots/org/apache/james/james-server-mailbox-adapter/3.0-beta5-SNAPSHOT/james-server-mailbox-adapter-3.0-beta5-20120301.151018-2.pom
(4 KB at 17.7 KB/sec)
Downloading: https://repository.apache.org/content/repositories/snapshots/org/apache/james/james-server-mailbox-adapter/maven-metadata.xml
Downloaded: https://repository.apache.org/content/repositories/snapshots/org/apache/james/james-server-mailbox-adapter/maven-metadata.xml
(498 B at 3.0 KB/sec)
Uploading: https://repository.apache.org/content/repositories/snapshots/org/apache/james/james-server-mailbox-adapter/3.0-beta5-SNAPSHOT/maven-metadata.xml
Uploaded: https://repository.apache.org/content/repositories/snapshots/org/apache/james/james-server-mailbox-adapter/3.0-beta5-SNAPSHOT/maven-metadata.xml
(1022 B at 4.0 KB/sec)
Uploading: https://repository.apache.org/content/repositories/snapshots/org/apache/james/james-server-mailbox-adapter/maven-metadata.xml
Uploaded: https://repository.apache.org/content/repositories/snapshots/org/apache/james/james-server-mailbox-adapter/maven-metadata.xml
(498 B at 2.4 KB/sec)
Uploading: https://repository.apache.org/content/repositories/snapshots/org/apache/james/james-server-mailbox-adapter/3.0-beta5-SNAPSHOT/james-server-mailbox-adapter-3.0-beta5-20120301.151018-2-tests.jar
Uploaded: https://repository.apache.org/content/repositories/snapshots/org/apache/james/james-server-mailbox-adapter/3.0-beta5-SNAPSHOT/james-server-mailbox-adapter-3.0-beta5-20120301.151018-2-tests.jar
(9 KB at 33.9 KB/sec)
Uploading: https://repository.apache.org/content/repositories/snapshots/org/apache/james/james-server-mailbox-adapter/3.0-beta5-SNAPSHOT/maven-metadata.xml
Uploaded: https://repository.apache.org/content/repositories/snapshots/org/apache/james/james-server-mailbox-adapter/3.0-beta5-SNAPSHOT/maven-metadata.xml
(1022 B at 5.5 KB/sec)
[JENKINS] Archiving <https://builds.apache.org/job/james-server-trunk/ws/trunk/mailbox-adapter/pom.xml>
to /home/hudson/hudson/jobs/james-server-trunk/modules/org.apache.james$james-server-mailbox-adapter/builds/2012-03-01_15-04-42/archive/org.apache.james/james-server-mailbox-adapter/3.0-beta5-SNAPSHOT/james-server-mailbox-adapter-3.0-beta5-SNAPSHOT.pom
[JENKINS] Archiving <https://builds.apache.org/job/james-server-trunk/ws/trunk/mailbox-adapter/target/james-server-mailbox-adapter-3.0-beta5-SNAPSHOT.jar>
to /home/hudson/hudson/jobs/james-server-trunk/modules/org.apache.james$james-server-mailbox-adapter/builds/2012-03-01_15-04-42/archive/org.apache.james/james-server-mailbox-adapter/3.0-beta5-20120301.151018-2/james-server-mailbox-adapter-3.0-beta5-20120301.151018-2.jar
[JENKINS] Archiving <https://builds.apache.org/job/james-server-trunk/ws/trunk/mailbox-adapter/target/james-server-mailbox-adapter-3.0-beta5-SNAPSHOT-tests.jar>
to /home/hudson/hudson/jobs/james-server-trunk/modules/org.apache.james$james-server-mailbox-adapter/builds/2012-03-01_15-04-42/archive/org.apache.james/james-server-mailbox-adapter/3.0-beta5-20120301.151018-2/james-server-mailbox-adapter-3.0-beta5-20120301.151018-2-tests.jar
[INFO] Downloading: http://download.java.net/maven/2/org/apache/camel/camel-core/2.5.0/camel-core-2.5.0.pom
                                                                        
[INFO] ------------------------------------------------------------------------
[INFO] Building Apache James Server Mailetcontainer Camel 3.0-beta5-SNAPSHOT
[INFO] ------------------------------------------------------------------------
Downloading: http://people.apache.org/~rawson/repo/org/apache/camel/camel-core/2.5.0/camel-core-2.5.0.pom
Downloading: http://repo1.maven.org/maven2/org/apache/camel/camel-core/2.5.0/camel-core-2.5.0.pom
Downloading: http://download.java.net/maven/2/org/apache/james/apache-standard-mailets/1.1/apache-standard-mailets-1.1.pom
Downloading: http://people.apache.org/~rawson/repo/org/apache/james/apache-standard-mailets/1.1/apache-standard-mailets-1.1.pom
Downloading: http://repo1.maven.org/maven2/org/apache/james/apache-standard-mailets/1.1/apache-standard-mailets-1.1.pom
Downloaded: http://repo1.maven.org/maven2/org/apache/james/apache-standard-mailets/1.1/apache-standard-mailets-1.1.pom
(18 KB at 5.9 KB/sec)
[JENKINS] Archiving <https://builds.apache.org/job/james-server-trunk/ws/trunk/mailetcontainer-camel/pom.xml>
to /home/hudson/hudson/jobs/james-server-trunk/modules/org.apache.james$james-server-mailetcontainer-camel/builds/2012-03-01_15-04-42/archive/org.apache.james/james-server-mailetcontainer-camel/3.0-beta5-SNAPSHOT/james-server-mailetcontainer-camel-3.0-beta5-SNAPSHOT.pom
[INFO] ------------------------------------------------------------------------
[INFO] Reactor Summary:
[INFO] 
[INFO] Apache James Server ............................... SUCCESS [29.815s]
[INFO] Apache James Server Lifecycle API ................. SUCCESS [5.826s]
[INFO] Apache James Server Filesystem API ................ SUCCESS [20.197s]
[INFO] Apache James Server Data API ...................... SUCCESS [7.415s]
[INFO] Apache James Server Lifecycle Spring .............. SUCCESS [16.074s]
[INFO] Apache James Server Mailetcontainer API ........... SUCCESS [4.161s]
[INFO] Apache James Server Common Utilities .............. SUCCESS [6.211s]
[INFO] Apache James Server Protocols Library ............. SUCCESS [10.825s]
[INFO] Apache James Server Core .......................... SUCCESS [19.647s]
[INFO] Apache James Server Container Spring .............. SUCCESS [20.002s]
[INFO] Apache James Server DNS Server API ................ SUCCESS [4.277s]
[INFO] Apache James Server DNSService Implementation ..... SUCCESS [4.831s]
[INFO] Apache James Server DNSService Library ............ SUCCESS [6.723s]
[INFO] Apache James Server Queue API ..................... SUCCESS [4.136s]
[INFO] Apache James Server FetchMail ..................... SUCCESS [4.592s]
[INFO] Apache James Server Data Library .................. SUCCESS [5.702s]
[INFO] Apache James Server HBase Data Persistence ........ SUCCESS [40.966s]
[INFO] Apache James Server JPA Data Persistence .......... SUCCESS [15.458s]
[INFO] Apache James Server JCR Data Persistence .......... SUCCESS [17.316s]
[INFO] Apache James Server JDBC Data Persistence ......... SUCCESS [21.280s]
[INFO] Apache James Server File Data Persistence ......... SUCCESS [7.411s]
[INFO] Apache James Server LDAP Data Implementation ...... SUCCESS [4.639s]
[INFO] Apache James Server Mailbox Adapter ............... SUCCESS [17.117s]
[INFO] Apache James Server Mailetcontainer Camel ......... FAILURE [24.411s]
[INFO] Apache James Server Mailets ....................... SKIPPED
[INFO] Apache James Server IMAP .......................... SKIPPED
[INFO] Apache James Server SMTP .......................... SKIPPED
[INFO] Apache James Server LMTP .......................... SKIPPED
[INFO] Apache James Server POP3 .......................... SKIPPED
[INFO] Apache James Server File Mail Queue ............... SKIPPED
[INFO] Apache James Server JMS Mail Queue ................ SKIPPED
[INFO] Apache James Server ActiveMQ Queue ................ SKIPPED
[INFO] Apache James Server Client ........................ SKIPPED
[INFO] ------------------------------------------------------------------------
[INFO] BUILD FAILURE
[INFO] ------------------------------------------------------------------------
[INFO] Total time: 5:54.018s
[INFO] Finished at: Thu Mar 01 15:10:47 UTC 2012
[INFO] Final Memory: 68M/446M
[INFO] ------------------------------------------------------------------------
mavenExecutionResult exceptions not empty
message : Failed to execute goal on project james-server-mailetcontainer-camel: Could not
resolve dependencies for project org.apache.james:james-server-mailetcontainer-camel:jar:3.0-beta5-SNAPSHOT:
Failed to collect dependencies for [org.apache.james:james-server-mailetcontainer-api:jar:3.0-beta5-SNAPSHOT
(compile), org.apache.james:james-server-queue-api:jar:3.0-beta5-SNAPSHOT (compile), org.apache.james:james-server-util:jar:3.0-beta5-SNAPSHOT
(compile), org.apache.james:james-server-dnsservice-api:jar:3.0-beta5-SNAPSHOT (compile),
org.apache.james:james-server-dnsservice-library:jar:3.0-beta5-SNAPSHOT (compile), org.apache.james:james-server-lifecycle-api:jar:3.0-beta5-SNAPSHOT
(compile), org.apache.james:james-server-data-api:jar:3.0-beta5-SNAPSHOT (compile), org.apache.james:james-server-core:jar:3.0-beta5-SNAPSHOT
(compile), org.apache.james:apache-mailet:jar:2.4 (compile), org.slf4j:slf4j-api:jar:1.6.1
(compile), commons-configuration:commons-configuration:jar:1.6 (compile), javax.mail:mail:jar:1.4.4
(compile), org.apache.camel:camel-core:jar:2.5.0 (compile), org.apache.geronimo.specs:geronimo-annotation_1.1_spec:jar:1.0.1
(compile), junit:junit:jar:3.8.1 (test), org.apache.james:apache-mailet-base:jar:tests:1.1
(test), org.apache.james:apache-standard-mailets:jar:1.1 (test), org.apache.james:james-server-mailetcontainer-api:jar:tests:3.0-beta5-SNAPSHOT
(test)]
cause : Could not resolve dependencies for project org.apache.james:james-server-mailetcontainer-camel:jar:3.0-beta5-SNAPSHOT:
Failed to collect dependencies for [org.apache.james:james-server-mailetcontainer-api:jar:3.0-beta5-SNAPSHOT
(compile), org.apache.james:james-server-queue-api:jar:3.0-beta5-SNAPSHOT (compile), org.apache.james:james-server-util:jar:3.0-beta5-SNAPSHOT
(compile), org.apache.james:james-server-dnsservice-api:jar:3.0-beta5-SNAPSHOT (compile),
org.apache.james:james-server-dnsservice-library:jar:3.0-beta5-SNAPSHOT (compile), org.apache.james:james-server-lifecycle-api:jar:3.0-beta5-SNAPSHOT
(compile), org.apache.james:james-server-data-api:jar:3.0-beta5-SNAPSHOT (compile), org.apache.james:james-server-core:jar:3.0-beta5-SNAPSHOT
(compile), org.apache.james:apache-mailet:jar:2.4 (compile), org.slf4j:slf4j-api:jar:1.6.1
(compile), commons-configuration:commons-configuration:jar:1.6 (compile), javax.mail:mail:jar:1.4.4
(compile), org.apache.camel:camel-core:jar:2.5.0 (compile), org.apache.geronimo.specs:geronimo-annotation_1.1_spec:jar:1.0.1
(compile), junit:junit:jar:3.8.1 (test), org.apache.james:apache-mailet-base:jar:tests:1.1
(test), org.apache.james:apache-standard-mailets:jar:1.1 (test), org.apache.james:james-server-mailetcontainer-api:jar:tests:3.0-beta5-SNAPSHOT
(test)]
Stack trace : 
org.apache.maven.lifecycle.LifecycleExecutionException: Failed to execute goal on project
james-server-mailetcontainer-camel: Could not resolve dependencies for project org.apache.james:james-server-mailetcontainer-camel:jar:3.0-beta5-SNAPSHOT:
Failed to collect dependencies for [org.apache.james:james-server-mailetcontainer-api:jar:3.0-beta5-SNAPSHOT
(compile), org.apache.james:james-server-queue-api:jar:3.0-beta5-SNAPSHOT (compile), org.apache.james:james-server-util:jar:3.0-beta5-SNAPSHOT
(compile), org.apache.james:james-server-dnsservice-api:jar:3.0-beta5-SNAPSHOT (compile),
org.apache.james:james-server-dnsservice-library:jar:3.0-beta5-SNAPSHOT (compile), org.apache.james:james-server-lifecycle-api:jar:3.0-beta5-SNAPSHOT
(compile), org.apache.james:james-server-data-api:jar:3.0-beta5-SNAPSHOT (compile), org.apache.james:james-server-core:jar:3.0-beta5-SNAPSHOT
(compile), org.apache.james:apache-mailet:jar:2.4 (compile), org.slf4j:slf4j-api:jar:1.6.1
(compile), commons-configuration:commons-configuration:jar:1.6 (compile), javax.mail:mail:jar:1.4.4
(compile), org.apache.camel:camel-core:jar:2.5.0 (compile), org.apache.geronimo.specs:geronimo-annotation_1.1_spec:jar:1.0.1
(compile), junit:junit:jar:3.8.1 (test), org.apache.james:apache-mailet-base:jar:tests:1.1
(test), org.apache.james:apache-standard-mailets:jar:1.1 (test), org.apache.james:james-server-mailetcontainer-api:jar:tests:3.0-beta5-SNAPSHOT
(test)]
	at org.apache.maven.lifecycle.internal.LifecycleDependencyResolver.getDependencies(LifecycleDependencyResolver.java:196)
	at org.apache.maven.lifecycle.internal.LifecycleDependencyResolver.resolveProjectDependencies(LifecycleDependencyResolver.java:108)
	at org.apache.maven.lifecycle.internal.MojoExecutor.ensureDependenciesAreResolved(MojoExecutor.java:258)
	at org.apache.maven.lifecycle.internal.MojoExecutor.execute(MojoExecutor.java:201)
	at org.apache.maven.lifecycle.internal.MojoExecutor.execute(MojoExecutor.java:153)
	at org.apache.maven.lifecycle.internal.MojoExecutor.execute(MojoExecutor.java:145)
	at org.apache.maven.lifecycle.internal.LifecycleModuleBuilder.buildProject(LifecycleModuleBuilder.java:84)
	at org.apache.maven.lifecycle.internal.LifecycleModuleBuilder.buildProject(LifecycleModuleBuilder.java:59)
	at org.apache.maven.lifecycle.internal.LifecycleStarter.singleThreadedBuild(LifecycleStarter.java:183)
	at org.apache.maven.lifecycle.internal.LifecycleStarter.execute(LifecycleStarter.java:161)
	at org.apache.maven.DefaultMaven.doExecute(DefaultMaven.java:319)
	at org.apache.maven.DefaultMaven.execute(DefaultMaven.java:156)
	at org.jvnet.hudson.maven3.launcher.Maven3Launcher.main(Maven3Launcher.java:79)
	at sun.reflect.NativeMethodAccessorImpl.invoke0(Native Method)
	at sun.reflect.NativeMethodAccessorImpl.invoke(NativeMethodAccessorImpl.java:39)
	at sun.reflect.DelegatingMethodAccessorImpl.invoke(DelegatingMethodAccessorImpl.java:25)
	at java.lang.reflect.Method.invoke(Method.java:597)
	at org.codehaus.plexus.classworlds.launcher.Launcher.launchStandard(Launcher.java:329)
	at org.codehaus.plexus.classworlds.launcher.Launcher.launch(Launcher.java:239)
	at org.jvnet.hudson.maven3.agent.Maven3Main.launch(Maven3Main.java:158)
	at hudson.maven.Maven3Builder.call(Maven3Builder.java:104)
	at hudson.maven.Maven3Builder.call(Maven3Builder.java:70)
	at hudson.remoting.UserRequest.perform(UserRequest.java:118)
	at hudson.remoting.UserRequest.perform(UserRequest.java:48)
	at hudson.remoting.Request$2.run(Request.java:287)
	at hudson.remoting.InterceptingExecutorService$1.call(InterceptingExecutorService.java:72)
	at java.util.concurrent.FutureTask$Sync.innerRun(FutureTask.java:303)
	at java.util.concurrent.FutureTask.run(FutureTask.java:138)
	at java.util.concurrent.ThreadPoolExecutor$Worker.runTask(ThreadPoolExecutor.java:886)
	at java.util.concurrent.ThreadPoolExecutor$Worker.run(ThreadPoolExecutor.java:908)
	at java.lang.Thread.run(Thread.java:662)
Caused by: org.apache.maven.project.DependencyResolutionException: Could not resolve dependencies
for project org.apache.james:james-server-mailetcontainer-camel:jar:3.0-beta5-SNAPSHOT: Failed
to collect dependencies for [org.apache.james:james-server-mailetcontainer-api:jar:3.0-beta5-SNAPSHOT
(compile), org.apache.james:james-server-queue-api:jar:3.0-beta5-SNAPSHOT (compile), org.apache.james:james-server-util:jar:3.0-beta5-SNAPSHOT
(compile), org.apache.james:james-server-dnsservice-api:jar:3.0-beta5-SNAPSHOT (compile),
org.apache.james:james-server-dnsservice-library:jar:3.0-beta5-SNAPSHOT (compile), org.apache.james:james-server-lifecycle-api:jar:3.0-beta5-SNAPSHOT
(compile), org.apache.james:james-server-data-api:jar:3.0-beta5-SNAPSHOT (compile), org.apache.james:james-server-core:jar:3.0-beta5-SNAPSHOT
(compile), org.apache.james:apache-mailet:jar:2.4 (compile), org.slf4j:slf4j-api:jar:1.6.1
(compile), commons-configuration:commons-configuration:jar:1.6 (compile), javax.mail:mail:jar:1.4.4
(compile), org.apache.camel:camel-core:jar:2.5.0 (compile), org.apache.geronimo.specs:geronimo-annotation_1.1_spec:jar:1.0.1
(compile), junit:junit:jar:3.8.1 (test), org.apache.james:apache-mailet-base:jar:tests:1.1
(test), org.apache.james:apache-standard-mailets:jar:1.1 (test), org.apache.james:james-server-mailetcontainer-api:jar:tests:3.0-beta5-SNAPSHOT
(test)]
	at org.apache.maven.project.DefaultProjectDependenciesResolver.resolve(DefaultProjectDependenciesResolver.java:139)
	at org.apache.maven.lifecycle.internal.LifecycleDependencyResolver.getDependencies(LifecycleDependencyResolver.java:171)
	... 30 more
Caused by: org.sonatype.aether.collection.DependencyCollectionException: Failed to collect
dependencies for [org.apache.james:james-server-mailetcontainer-api:jar:3.0-beta5-SNAPSHOT
(compile), org.apache.james:james-server-queue-api:jar:3.0-beta5-SNAPSHOT (compile), org.apache.james:james-server-util:jar:3.0-beta5-SNAPSHOT
(compile), org.apache.james:james-server-dnsservice-api:jar:3.0-beta5-SNAPSHOT (compile),
org.apache.james:james-server-dnsservice-library:jar:3.0-beta5-SNAPSHOT (compile), org.apache.james:james-server-lifecycle-api:jar:3.0-beta5-SNAPSHOT
(compile), org.apache.james:james-server-data-api:jar:3.0-beta5-SNAPSHOT (compile), org.apache.james:james-server-core:jar:3.0-beta5-SNAPSHOT
(compile), org.apache.james:apache-mailet:jar:2.4 (compile), org.slf4j:slf4j-api:jar:1.6.1
(compile), commons-configuration:commons-configuration:jar:1.6 (compile), javax.mail:mail:jar:1.4.4
(compile), org.apache.camel:camel-core:jar:2.5.0 (compile), org.apache.geronimo.specs:geronimo-annotation_1.1_spec:jar:1.0.1
(compile), junit:junit:jar:3.8.1 (test), org.apache.james:apache-mailet-base:jar:tests:1.1
(test), org.apache.james:apache-standard-mailets:jar:1.1 (test), org.apache.james:james-server-mailetcontainer-api:jar:tests:3.0-beta5-SNAPSHOT
(test)]
	at org.sonatype.aether.impl.internal.DefaultDependencyCollector.collectDependencies(DefaultDependencyCollector.java:262)
	at org.sonatype.aether.impl.internal.DefaultRepositorySystem.collectDependencies(DefaultRepositorySystem.java:345)
	at org.apache.maven.project.DefaultProjectDependenciesResolver.resolve(DefaultProjectDependenciesResolver.java:131)
	... 31 more
Caused by: org.sonatype.aether.resolution.ArtifactDescriptorException: Failed to read artifact
descriptor for org.apache.camel:camel-core:jar:2.5.0
	at org.apache.maven.repository.internal.DefaultArtifactDescriptorReader.loadPom(DefaultArtifactDescriptorReader.java:282)
	at org.apache.maven.repository.internal.DefaultArtifactDescriptorReader.readArtifactDescriptor(DefaultArtifactDescriptorReader.java:172)
	at org.sonatype.aether.impl.internal.DefaultDependencyCollector.process(DefaultDependencyCollector.java:419)
	at org.sonatype.aether.impl.internal.DefaultDependencyCollector.collectDependencies(DefaultDependencyCollector.java:243)
	... 33 more
Caused by: org.sonatype.aether.resolution.ArtifactResolutionException: Could not transfer
artifact org.apache.camel:camel-core:pom:2.5.0 from/to central (http://repo1.maven.org/maven2):
Error transferring file: Connection timed out
	at org.sonatype.aether.impl.internal.DefaultArtifactResolver.resolve(DefaultArtifactResolver.java:541)
	at org.sonatype.aether.impl.internal.DefaultArtifactResolver.resolveArtifacts(DefaultArtifactResolver.java:220)
	at org.sonatype.aether.impl.internal.DefaultArtifactResolver.resolveArtifact(DefaultArtifactResolver.java:197)
	at org.apache.maven.repository.internal.DefaultArtifactDescriptorReader.loadPom(DefaultArtifactDescriptorReader.java:267)
	... 36 more
Caused by: org.sonatype.aether.transfer.ArtifactTransferException: Could not transfer artifact
org.apache.camel:camel-core:pom:2.5.0 from/to central (http://repo1.maven.org/maven2): Error
transferring file: Connection timed out
	at org.sonatype.aether.connector.wagon.WagonRepositoryConnector$4.wrap(WagonRepositoryConnector.java:949)
	at org.sonatype.aether.connector.wagon.WagonRepositoryConnector$4.wrap(WagonRepositoryConnector.java:940)
	at org.sonatype.aether.connector.wagon.WagonRepositoryConnector$GetTask.flush(WagonRepositoryConnector.java:695)
	at org.sonatype.aether.connector.wagon.WagonRepositoryConnector$GetTask.flush(WagonRepositoryConnector.java:689)
	at org.sonatype.aether.connector.wagon.WagonRepositoryConnector.get(WagonRepositoryConnector.java:445)
	at org.sonatype.aether.impl.internal.DefaultArtifactResolver.resolve(DefaultArtifactResolver.java:460)
	... 39 more
Caused by: org.apache.maven.wagon.TransferFailedException: Error transferring file: Connection
timed out
	at org.apache.maven.wagon.providers.http.LightweightHttpWagon.fillInputData(LightweightHttpWagon.java:143)
	at org.apache.maven.wagon.StreamWagon.getInputStream(StreamWagon.java:116)
	at org.apache.maven.wagon.StreamWagon.getIfNewer(StreamWagon.java:88)
	at org.apache.maven.wagon.StreamWagon.get(StreamWagon.java:61)
	at org.sonatype.aether.connector.wagon.WagonRepositoryConnector$GetTask.run(WagonRepositoryConnector.java:608)
	at org.sonatype.aether.util.concurrency.RunnableErrorForwarder$1.run(RunnableErrorForwarder.java:64)
	... 3 more
Caused by: java.net.ConnectException: Connection timed out
	at java.net.PlainSocketImpl.socketConnect(Native Method)
	at java.net.PlainSocketImpl.doConnect(PlainSocketImpl.java:351)
	at java.net.PlainSocketImpl.connectToAddress(PlainSocketImpl.java:213)
	at java.net.PlainSocketImpl.connect(PlainSocketImpl.java:200)
	at java.net.SocksSocketImpl.connect(SocksSocketImpl.java:366)
	at java.net.Socket.connect(Socket.java:529)
	at java.net.Socket.connect(Socket.java:478)
	at sun.net.NetworkClient.doConnect(NetworkClient.java:163)
	at sun.net.www.http.HttpClient.openServer(HttpClient.java:395)
	at sun.net.www.http.HttpClient.openServer(HttpClient.java:530)
	at sun.net.www.http.HttpClient.<init>(HttpClient.java:234)
	at sun.net.www.http.HttpClient.New(HttpClient.java:307)
	at sun.net.www.http.HttpClient.New(HttpClient.java:324)
	at sun.net.www.protocol.http.HttpURLConnection.getNewHttpClient(HttpURLConnection.java:970)
	at sun.net.www.protocol.http.HttpURLConnection.plainConnect(HttpURLConnection.java:911)
	at sun.net.www.protocol.http.HttpURLConnection.connect(HttpURLConnection.java:836)
	at sun.net.www.protocol.http.HttpURLConnection.getInputStream(HttpURLConnection.java:1172)
	at java.net.HttpURLConnection.getResponseCode(HttpURLConnection.java:379)
	at org.apache.maven.wagon.providers.http.LightweightHttpWagon.fillInputData(LightweightHttpWagon.java:115)
	... 8 more
Maven failed with error.
channel stopped


---------------------------------------------------------------------
To unsubscribe, e-mail: server-dev-unsubscribe@james.apache.org
For additional commands, e-mail: server-dev-help@james.apache.org


Mime
View raw message