james-server-dev mailing list archives

Site index · List index
Message view « Date » · « Thread »
Top « Date » · « Thread »
From Apache Jenkins Server <jenk...@builds.apache.org>
Subject Build failed in Jenkins: james-server-trunk #2703
Date Sun, 11 Mar 2012 23:16:32 GMT
See <https://builds.apache.org/job/james-server-trunk/2703/changes>

Changes:

[ieugen] JAMES-1393

- updated tests to juni 4.x style
- added @Override and reformated code

Issue #JAMES-1393 - Upgrate all test suites to junit 4.10

[ieugen] JAMES-1393

- changed @After method access from protected to public
Issue #JAMES-1393 - Upgrate all test suites to junit 4.10

------------------------------------------
[...truncated 1433 lines...]
[JENKINS] Recording test results
[INFO] [INFO] Building jar: <https://builds.apache.org/job/james-server-trunk/ws/trunk/data-library/target/james-server-data-library-3.0-beta5-SNAPSHOT.jar>

[INFO] --- maven-jar-plugin:2.3.2:jar (default-jar) @ james-server-data-library ---
[INFO] 
[INFO] --- maven-site-plugin:3.0:attach-descriptor (attach-descriptor) @ james-server-data-library
---
[INFO] 
[INFO] --- maven-jar-plugin:2.3.2:jar (default) @ james-server-data-library ---
[INFO] [INFO] Building jar: <https://builds.apache.org/job/james-server-trunk/ws/trunk/data-library/target/james-server-data-library-3.0-beta5-SNAPSHOT-tests.jar>

[INFO] --- maven-jar-plugin:2.3.2:test-jar (default) @ james-server-data-library ---
[INFO] [INFO] Installing <https://builds.apache.org/job/james-server-trunk/ws/trunk/data-library/target/james-server-data-library-3.0-beta5-SNAPSHOT.jar>
to /home/jenkins/jenkins-slave/maven-repositories/0/org/apache/james/james-server-data-library/3.0-beta5-SNAPSHOT/james-server-data-library-3.0-beta5-SNAPSHOT.jar

[INFO] --- maven-install-plugin:2.3.1:install (default-install) @ james-server-data-library
---
[INFO] Installing <https://builds.apache.org/job/james-server-trunk/ws/trunk/data-library/pom.xml>
to /home/jenkins/jenkins-slave/maven-repositories/0/org/apache/james/james-server-data-library/3.0-beta5-SNAPSHOT/james-server-data-library-3.0-beta5-SNAPSHOT.pom
[INFO] Installing <https://builds.apache.org/job/james-server-trunk/ws/trunk/data-library/target/james-server-data-library-3.0-beta5-SNAPSHOT-tests.jar>
to /home/jenkins/jenkins-slave/maven-repositories/0/org/apache/james/james-server-data-library/3.0-beta5-SNAPSHOT/james-server-data-library-3.0-beta5-SNAPSHOT-tests.jar
[INFO] Downloading: https://repository.apache.org/content/repositories/snapshots/org/apache/james/james-server-data-library/3.0-beta5-SNAPSHOT/maven-metadata.xml

[INFO] --- maven-deploy-plugin:2.7:deploy (default-deploy) @ james-server-data-library ---
Downloaded: https://repository.apache.org/content/repositories/snapshots/org/apache/james/james-server-data-library/3.0-beta5-SNAPSHOT/maven-metadata.xml
(1023 B at 4.3 KB/sec)
Uploading: https://repository.apache.org/content/repositories/snapshots/org/apache/james/james-server-data-library/3.0-beta5-SNAPSHOT/james-server-data-library-3.0-beta5-20120311.231557-21.jar
Uploaded: https://repository.apache.org/content/repositories/snapshots/org/apache/james/james-server-data-library/3.0-beta5-SNAPSHOT/james-server-data-library-3.0-beta5-20120311.231557-21.jar
(52 KB at 135.4 KB/sec)
Uploading: https://repository.apache.org/content/repositories/snapshots/org/apache/james/james-server-data-library/3.0-beta5-SNAPSHOT/james-server-data-library-3.0-beta5-20120311.231557-21.pom
Uploaded: https://repository.apache.org/content/repositories/snapshots/org/apache/james/james-server-data-library/3.0-beta5-SNAPSHOT/james-server-data-library-3.0-beta5-20120311.231557-21.pom
(4 KB at 22.8 KB/sec)
Downloading: https://repository.apache.org/content/repositories/snapshots/org/apache/james/james-server-data-library/maven-metadata.xml
Downloaded: https://repository.apache.org/content/repositories/snapshots/org/apache/james/james-server-data-library/maven-metadata.xml
(495 B at 3.2 KB/sec)
Uploading: https://repository.apache.org/content/repositories/snapshots/org/apache/james/james-server-data-library/3.0-beta5-SNAPSHOT/maven-metadata.xml
Uploaded: https://repository.apache.org/content/repositories/snapshots/org/apache/james/james-server-data-library/3.0-beta5-SNAPSHOT/maven-metadata.xml
(1023 B at 3.9 KB/sec)
Uploading: https://repository.apache.org/content/repositories/snapshots/org/apache/james/james-server-data-library/maven-metadata.xml
Uploaded: https://repository.apache.org/content/repositories/snapshots/org/apache/james/james-server-data-library/maven-metadata.xml
(495 B at 2.9 KB/sec)
Uploading: https://repository.apache.org/content/repositories/snapshots/org/apache/james/james-server-data-library/3.0-beta5-SNAPSHOT/james-server-data-library-3.0-beta5-20120311.231557-21-tests.jar
Uploaded: https://repository.apache.org/content/repositories/snapshots/org/apache/james/james-server-data-library/3.0-beta5-SNAPSHOT/james-server-data-library-3.0-beta5-20120311.231557-21-tests.jar
(30 KB at 113.0 KB/sec)
Uploading: https://repository.apache.org/content/repositories/snapshots/org/apache/james/james-server-data-library/3.0-beta5-SNAPSHOT/maven-metadata.xml
Uploaded: https://repository.apache.org/content/repositories/snapshots/org/apache/james/james-server-data-library/3.0-beta5-SNAPSHOT/maven-metadata.xml
(1023 B at 6.3 KB/sec)
[JENKINS] Archiving <https://builds.apache.org/job/james-server-trunk/ws/trunk/data-library/pom.xml>
to /home/hudson/hudson/jobs/james-server-trunk/modules/org.apache.james$james-server-data-library/builds/2012-03-11_23-13-03/archive/org.apache.james/james-server-data-library/3.0-beta5-SNAPSHOT/james-server-data-library-3.0-beta5-SNAPSHOT.pom
[JENKINS] Archiving <https://builds.apache.org/job/james-server-trunk/ws/trunk/data-library/target/james-server-data-library-3.0-beta5-SNAPSHOT.jar>
to /home/hudson/hudson/jobs/james-server-trunk/modules/org.apache.james$james-server-data-library/builds/2012-03-11_23-13-03/archive/org.apache.james/james-server-data-library/3.0-beta5-20120311.231557-21/james-server-data-library-3.0-beta5-20120311.231557-21.jar
[JENKINS] Archiving <https://builds.apache.org/job/james-server-trunk/ws/trunk/data-library/target/james-server-data-library-3.0-beta5-SNAPSHOT-tests.jar>
to /home/hudson/hudson/jobs/james-server-trunk/modules/org.apache.james$james-server-data-library/builds/2012-03-11_23-13-03/archive/org.apache.james/james-server-data-library/3.0-beta5-20120311.231557-21/james-server-data-library-3.0-beta5-20120311.231557-21-tests.jar
[INFO] Downloading: http://download.java.net/maven/2/org/apache/hbase/hbase/0.92.0/hbase-0.92.0.pom
                                                                        
[INFO] ------------------------------------------------------------------------
[INFO] Building Apache James Server HBase Data Persistence 3.0-beta5-SNAPSHOT
[INFO] ------------------------------------------------------------------------
Downloading: http://people.apache.org/~rawson/repo/org/apache/hbase/hbase/0.92.0/hbase-0.92.0.pom
Downloading: http://repo1.maven.org/maven2/org/apache/hbase/hbase/0.92.0/hbase-0.92.0.pom
Downloaded: http://repo1.maven.org/maven2/org/apache/hbase/hbase/0.92.0/hbase-0.92.0.pom (68
KB at 172.3 KB/sec)
Downloading: http://download.java.net/maven/2/org/jamon/jamon-runtime/2.3.1/jamon-runtime-2.3.1.pom
Downloading: http://people.apache.org/~rawson/repo/org/jamon/jamon-runtime/2.3.1/jamon-runtime-2.3.1.pom
Downloading: http://repo1.maven.org/maven2/org/jamon/jamon-runtime/2.3.1/jamon-runtime-2.3.1.pom
Downloaded: http://repo1.maven.org/maven2/org/jamon/jamon-runtime/2.3.1/jamon-runtime-2.3.1.pom
(2 KB at 5.9 KB/sec)
Downloading: http://download.java.net/maven/2/org/jamon/jamon-project/1.0.2/jamon-project-1.0.2.pom
Downloading: http://people.apache.org/~rawson/repo/org/jamon/jamon-project/1.0.2/jamon-project-1.0.2.pom
Downloading: http://repo1.maven.org/maven2/org/jamon/jamon-project/1.0.2/jamon-project-1.0.2.pom
Downloaded: http://repo1.maven.org/maven2/org/jamon/jamon-project/1.0.2/jamon-project-1.0.2.pom
(9 KB at 28.2 KB/sec)
Downloading: http://download.java.net/maven/2/org/apache/maven/plugins/maven-release-plugin/2.2.2/maven-release-plugin-2.2.2.pom
Downloading: http://people.apache.org/~rawson/repo/org/apache/maven/plugins/maven-release-plugin/2.2.2/maven-release-plugin-2.2.2.pom
Downloading: http://repo1.maven.org/maven2/org/apache/maven/plugins/maven-release-plugin/2.2.2/maven-release-plugin-2.2.2.pom
Downloaded: http://repo1.maven.org/maven2/org/apache/maven/plugins/maven-release-plugin/2.2.2/maven-release-plugin-2.2.2.pom
(9 KB at 10.8 KB/sec)
Downloading: http://download.java.net/maven/2/org/apache/maven/release/maven-release/2.2.2/maven-release-2.2.2.pom
Downloading: http://people.apache.org/~rawson/repo/org/apache/maven/release/maven-release/2.2.2/maven-release-2.2.2.pom
Downloading: http://repo1.maven.org/maven2/org/apache/maven/release/maven-release/2.2.2/maven-release-2.2.2.pom
Downloaded: http://repo1.maven.org/maven2/org/apache/maven/release/maven-release/2.2.2/maven-release-2.2.2.pom
(9 KB at 28.0 KB/sec)
Downloading: http://download.java.net/maven/2/org/apache/maven/release/maven-release-manager/2.2.2/maven-release-manager-2.2.2.pom
Downloading: http://people.apache.org/~rawson/repo/org/apache/maven/release/maven-release-manager/2.2.2/maven-release-manager-2.2.2.pom
Downloading: http://repo1.maven.org/maven2/org/apache/maven/release/maven-release-manager/2.2.2/maven-release-manager-2.2.2.pom
Downloaded: http://repo1.maven.org/maven2/org/apache/maven/release/maven-release-manager/2.2.2/maven-release-manager-2.2.2.pom
(10 KB at 30.0 KB/sec)
Downloading: http://download.java.net/maven/2/org/apache/james/apache-james-mailbox-hbase/0.5-SNAPSHOT/maven-metadata.xml
Downloading: http://repository.apache.org/snapshots/org/apache/james/apache-james-mailbox-hbase/0.5-SNAPSHOT/maven-metadata.xml
Downloaded: http://repository.apache.org/snapshots/org/apache/james/apache-james-mailbox-hbase/0.5-SNAPSHOT/maven-metadata.xml
(1000 B at 7.4 KB/sec)
Downloading: http://download.java.net/maven/2/org/apache/james/apache-james-mailbox-hbase/0.5-SNAPSHOT/apache-james-mailbox-hbase-0.5-20120311.041921-22.pom
Downloading: http://repository.apache.org/snapshots/org/apache/james/apache-james-mailbox-hbase/0.5-SNAPSHOT/apache-james-mailbox-hbase-0.5-20120311.041921-22.pom
Downloaded: http://repository.apache.org/snapshots/org/apache/james/apache-james-mailbox-hbase/0.5-SNAPSHOT/apache-james-mailbox-hbase-0.5-20120311.041921-22.pom
(6 KB at 53.2 KB/sec)
Downloading: http://download.java.net/maven/2/org/apache/james/apache-james-mailbox/0.5-SNAPSHOT/maven-metadata.xml
Downloading: http://repository.apache.org/snapshots/org/apache/james/apache-james-mailbox/0.5-SNAPSHOT/maven-metadata.xml
Downloaded: http://repository.apache.org/snapshots/org/apache/james/apache-james-mailbox/0.5-SNAPSHOT/maven-metadata.xml
(2 KB at 8.3 KB/sec)
Downloading: http://repository.apache.org/snapshots/org/apache/james/apache-james-mailbox/0.5-SNAPSHOT/apache-james-mailbox-0.5-20120311.041321-23.pom
Downloaded: http://repository.apache.org/snapshots/org/apache/james/apache-james-mailbox/0.5-SNAPSHOT/apache-james-mailbox-0.5-20120311.041321-23.pom
(22 KB at 230.9 KB/sec)
Downloading: http://download.java.net/maven/2/org/jruby/jruby-complete/1.6.5/jruby-complete-1.6.5.pom
Downloading: http://people.apache.org/~rawson/repo/org/jruby/jruby-complete/1.6.5/jruby-complete-1.6.5.pom
Downloading: http://repo1.maven.org/maven2/org/jruby/jruby-complete/1.6.5/jruby-complete-1.6.5.pom
Downloaded: http://repo1.maven.org/maven2/org/jruby/jruby-complete/1.6.5/jruby-complete-1.6.5.pom
(3 KB at 8.7 KB/sec)
Downloading: http://download.java.net/maven/2/org/jruby/jruby-common/1.6.5/jruby-common-1.6.5.pom
Downloading: http://people.apache.org/~rawson/repo/org/jruby/jruby-common/1.6.5/jruby-common-1.6.5.pom
Downloading: http://repo1.maven.org/maven2/org/jruby/jruby-common/1.6.5/jruby-common-1.6.5.pom
Downloaded: http://repo1.maven.org/maven2/org/jruby/jruby-common/1.6.5/jruby-common-1.6.5.pom
(5 KB at 12.5 KB/sec)
Downloading: http://download.java.net/maven/2/org/jruby/shared/1.6.5/shared-1.6.5.pom
Downloading: http://people.apache.org/~rawson/repo/org/jruby/shared/1.6.5/shared-1.6.5.pom
Downloading: http://repo1.maven.org/maven2/org/jruby/shared/1.6.5/shared-1.6.5.pom
Downloaded: http://repo1.maven.org/maven2/org/jruby/shared/1.6.5/shared-1.6.5.pom (7 KB at
20.1 KB/sec)
Downloading: http://download.java.net/maven/2/org/apache/hbase/hbase/0.92.0/hbase-0.92.0.jar
Downloading: http://download.java.net/maven/2/com/github/stephenc/high-scale-lib/high-scale-lib/1.1.1/high-scale-lib-1.1.1.jar
Downloading: http://download.java.net/maven/2/org/codehaus/jackson/jackson-mapper-asl/1.5.5/jackson-mapper-asl-1.5.5.jar
Downloading: http://download.java.net/maven/2/org/jamon/jamon-runtime/2.3.1/jamon-runtime-2.3.1.jar
Downloading: http://download.java.net/maven/2/org/apache/maven/plugins/maven-release-plugin/2.2.2/maven-release-plugin-2.2.2.jar
Downloading: http://download.java.net/maven/2/org/apache/maven/release/maven-release-manager/2.2.2/maven-release-manager-2.2.2.jar
Downloading: http://download.java.net/maven/2/org/apache/hbase/hbase/0.92.0/hbase-0.92.0-tests.jar
Downloading: http://download.java.net/maven/2/org/jruby/jruby-complete/1.6.5/jruby-complete-1.6.5.jar
Downloading: http://people.apache.org/~rawson/repo/org/apache/hbase/hbase/0.92.0/hbase-0.92.0.jar
Downloading: http://people.apache.org/~rawson/repo/com/github/stephenc/high-scale-lib/high-scale-lib/1.1.1/high-scale-lib-1.1.1.jar
Downloading: http://people.apache.org/~rawson/repo/org/codehaus/jackson/jackson-mapper-asl/1.5.5/jackson-mapper-asl-1.5.5.jar
Downloading: http://people.apache.org/~rawson/repo/org/jamon/jamon-runtime/2.3.1/jamon-runtime-2.3.1.jar
Downloading: http://people.apache.org/~rawson/repo/org/apache/maven/plugins/maven-release-plugin/2.2.2/maven-release-plugin-2.2.2.jar
Downloading: http://people.apache.org/~rawson/repo/org/apache/maven/release/maven-release-manager/2.2.2/maven-release-manager-2.2.2.jar
Downloading: http://people.apache.org/~rawson/repo/org/apache/hbase/hbase/0.92.0/hbase-0.92.0-tests.jar
Downloading: http://people.apache.org/~rawson/repo/org/jruby/jruby-complete/1.6.5/jruby-complete-1.6.5.jar
Downloading: http://repo1.maven.org/maven2/org/apache/hbase/hbase/0.92.0/hbase-0.92.0.jar
Downloading: http://repo1.maven.org/maven2/com/github/stephenc/high-scale-lib/high-scale-lib/1.1.1/high-scale-lib-1.1.1.jar
Downloading: http://repo1.maven.org/maven2/org/codehaus/jackson/jackson-mapper-asl/1.5.5/jackson-mapper-asl-1.5.5.jar
Downloading: http://repo1.maven.org/maven2/org/jamon/jamon-runtime/2.3.1/jamon-runtime-2.3.1.jar
Downloading: http://repo1.maven.org/maven2/org/apache/maven/plugins/maven-release-plugin/2.2.2/maven-release-plugin-2.2.2.jar
Downloaded: http://repo1.maven.org/maven2/org/jamon/jamon-runtime/2.3.1/jamon-runtime-2.3.1.jar
(21 KB at 15.2 KB/sec)
Downloading: http://repo1.maven.org/maven2/org/apache/maven/release/maven-release-manager/2.2.2/maven-release-manager-2.2.2.jar
Downloaded: http://repo1.maven.org/maven2/com/github/stephenc/high-scale-lib/high-scale-lib/1.1.1/high-scale-lib-1.1.1.jar
(94 KB at 60.3 KB/sec)
Downloading: http://repo1.maven.org/maven2/org/apache/hbase/hbase/0.92.0/hbase-0.92.0-tests.jar
Downloaded: http://repo1.maven.org/maven2/org/apache/maven/plugins/maven-release-plugin/2.2.2/maven-release-plugin-2.2.2.jar
(43 KB at 23.4 KB/sec)
Downloading: http://repo1.maven.org/maven2/org/jruby/jruby-complete/1.6.5/jruby-complete-1.6.5.jar
Downloaded: http://repo1.maven.org/maven2/org/apache/hbase/hbase/0.92.0/hbase-0.92.0.jar (3033
KB at 1475.6 KB/sec)
Downloaded: http://repo1.maven.org/maven2/org/codehaus/jackson/jackson-mapper-asl/1.5.5/jackson-mapper-asl-1.5.5.jar
(475 KB at 185.3 KB/sec)
Downloaded: http://repo1.maven.org/maven2/org/apache/maven/release/maven-release-manager/2.2.2/maven-release-manager-2.2.2.jar
(169 KB at 84.8 KB/sec)
Downloaded: http://repo1.maven.org/maven2/org/apache/hbase/hbase/0.92.0/hbase-0.92.0-tests.jar
(1450 KB at 671.2 KB/sec)
Downloaded: http://repo1.maven.org/maven2/org/jruby/jruby-complete/1.6.5/jruby-complete-1.6.5.jar
(13001 KB at 3407.6 KB/sec)
Downloading: http://repository.apache.org/snapshots/org/apache/james/apache-james-mailbox-hbase/0.5-SNAPSHOT/apache-james-mailbox-hbase-0.5-20120311.041921-22-tests.jar
Downloaded: http://repository.apache.org/snapshots/org/apache/james/apache-james-mailbox-hbase/0.5-SNAPSHOT/apache-james-mailbox-hbase-0.5-20120311.041921-22-tests.jar
(41 KB at 215.2 KB/sec)
[INFO] Deleting <https://builds.apache.org/job/james-server-trunk/ws/trunk/data-hbase/target>
[INFO] 
[INFO] --- maven-clean-plugin:2.4.1:clean (default-clean) @ james-server-data-hbase ---
[INFO] 
[INFO] --- maven-remote-resources-plugin:1.2.1:process (default) @ james-server-data-hbase
---
Downloading: http://repository.apache.org/snapshots/org/apache/james/apache-james-mailbox-hbase/0.5-SNAPSHOT/maven-metadata.xml
Downloading: http://download.java.net/maven/2/org/apache/james/apache-james-mailbox-hbase/0.5-SNAPSHOT/maven-metadata.xml
Downloaded: http://repository.apache.org/snapshots/org/apache/james/apache-james-mailbox-hbase/0.5-SNAPSHOT/maven-metadata.xml
(1000 B at 7.9 KB/sec)
[INFO] [debug] execute contextualize
[INFO] Using 'UTF-8' encoding to copy filtered resources.
[INFO] skip non existing resourceDirectory <https://builds.apache.org/job/james-server-trunk/ws/trunk/data-hbase/src/main/resources>
[INFO] Copying 3 resources

[INFO] --- maven-resources-plugin:2.5:resources (default-resources) @ james-server-data-hbase
---
[INFO] [INFO] Compiling 7 source files to <https://builds.apache.org/job/james-server-trunk/ws/trunk/data-hbase/target/classes>

[INFO] --- maven-compiler-plugin:2.3.2:compile (default-compile) @ james-server-data-hbase
---
[INFO] 
[INFO] --- maven-bundle-plugin:2.3.5:manifest (bundle-manifest) @ james-server-data-hbase
---
[debug] execute contextualize
[INFO] [INFO] Using 'UTF-8' encoding to copy filtered resources.
[INFO] Copying 3 resources
[INFO] Copying 3 resources

[INFO] --- maven-resources-plugin:2.5:testResources (default-testResources) @ james-server-data-hbase
---
[INFO] [INFO] Compiling 5 source files to <https://builds.apache.org/job/james-server-trunk/ws/trunk/data-hbase/target/test-classes>

[INFO] --- maven-compiler-plugin:2.3.2:testCompile (default-testCompile) @ james-server-data-hbase
---
[INFO] -------------------------------------------------------------
[ERROR] COMPILATION ERROR : 
[INFO] -------------------------------------------------------------
[ERROR] <https://builds.apache.org/job/james-server-trunk/ws/trunk/data-hbase/src/test/java/org/apache/james/user/hbase/HBaseUsersRepositoryTest.java>:[52,19]
tearDown() in org.apache.james.user.hbase.HBaseUsersRepositoryTest cannot override tearDown()
in org.apache.james.user.lib.AbstractUsersRepositoryTest; attempting to assign weaker access
privileges; was public
[INFO] 1 error
[INFO] -------------------------------------------------------------
[JENKINS] Archiving <https://builds.apache.org/job/james-server-trunk/ws/trunk/data-hbase/pom.xml>
to /home/hudson/hudson/jobs/james-server-trunk/modules/org.apache.james$james-server-data-hbase/builds/2012-03-11_23-13-03/archive/org.apache.james/james-server-data-hbase/3.0-beta5-SNAPSHOT/james-server-data-hbase-3.0-beta5-SNAPSHOT.pom
[INFO] ------------------------------------------------------------------------
[INFO] Reactor Summary:
[INFO] 
[INFO] Apache James Server ............................... SUCCESS [30.550s]
[INFO] Apache James Server Lifecycle API ................. SUCCESS [6.863s]
[INFO] Apache James Server Filesystem API ................ SUCCESS [5.820s]
[INFO] Apache James Server Data API ...................... SUCCESS [5.104s]
[INFO] Apache James Server Lifecycle Spring .............. SUCCESS [10.442s]
[INFO] Apache James Server Mailetcontainer API ........... SUCCESS [4.375s]
[INFO] Apache James Server Common Utilities .............. SUCCESS [13.660s]
[INFO] Apache James Server Protocols Library ............. SUCCESS [7.259s]
[INFO] Apache James Server Core .......................... SUCCESS [14.880s]
[INFO] Apache James Server Container Spring .............. SUCCESS [9.525s]
[INFO] Apache James Server DNS Server API ................ SUCCESS [4.402s]
[INFO] Apache James Server DNSService Implementation ..... SUCCESS [4.992s]
[INFO] Apache James Server DNSService Library ............ SUCCESS [7.222s]
[INFO] Apache James Server Queue API ..................... SUCCESS [5.045s]
[INFO] Apache James Server FetchMail ..................... SUCCESS [4.674s]
[INFO] Apache James Server Data Library .................. SUCCESS [6.159s]
[INFO] Apache James Server HBase Data Persistence ........ FAILURE [28.227s]
[INFO] Apache James Server JPA Data Persistence .......... SKIPPED
[INFO] Apache James Server JCR Data Persistence .......... SKIPPED
[INFO] Apache James Server JDBC Data Persistence ......... SKIPPED
[INFO] Apache James Server File Data Persistence ......... SKIPPED
[INFO] Apache James Server LDAP Data Implementation ...... SKIPPED
[INFO] Apache James Server Mailbox Adapter ............... SKIPPED
[INFO] Apache James Server Mailetcontainer Camel ......... SKIPPED
[INFO] Apache James Server Mailets ....................... SKIPPED
[INFO] Apache James Server IMAP .......................... SKIPPED
[INFO] Apache James Server SMTP .......................... SKIPPED
[INFO] Apache James Server LMTP .......................... SKIPPED
[INFO] Apache James Server POP3 .......................... SKIPPED
[INFO] Apache James Server File Mail Queue ............... SKIPPED
[INFO] Apache James Server JMS Mail Queue ................ SKIPPED
[INFO] Apache James Server ActiveMQ Queue ................ SKIPPED
[INFO] Apache James Server Client ........................ SKIPPED
[INFO] ------------------------------------------------------------------------
[INFO] BUILD FAILURE
[INFO] ------------------------------------------------------------------------
[INFO] Total time: 3:16.942s
[INFO] Finished at: Sun Mar 11 23:16:30 UTC 2012
[INFO] Final Memory: 75M/334M
[INFO] ------------------------------------------------------------------------
Waiting for Jenkins to finish collecting data
mavenExecutionResult exceptions not empty
message : Failed to execute goal org.apache.maven.plugins:maven-compiler-plugin:2.3.2:testCompile
(default-testCompile) on project james-server-data-hbase: Compilation failure
<https://builds.apache.org/job/james-server-trunk/ws/trunk/data-hbase/src/test/java/org/apache/james/user/hbase/HBaseUsersRepositoryTest.java>:[52,19]
tearDown() in org.apache.james.user.hbase.HBaseUsersRepositoryTest cannot override tearDown()
in org.apache.james.user.lib.AbstractUsersRepositoryTest; attempting to assign weaker access
privileges; was public

cause : Compilation failure
<https://builds.apache.org/job/james-server-trunk/ws/trunk/data-hbase/src/test/java/org/apache/james/user/hbase/HBaseUsersRepositoryTest.java>:[52,19]
tearDown() in org.apache.james.user.hbase.HBaseUsersRepositoryTest cannot override tearDown()
in org.apache.james.user.lib.AbstractUsersRepositoryTest; attempting to assign weaker access
privileges; was public

Stack trace : 
org.apache.maven.lifecycle.LifecycleExecutionException: Failed to execute goal org.apache.maven.plugins:maven-compiler-plugin:2.3.2:testCompile
(default-testCompile) on project james-server-data-hbase: Compilation failure
<https://builds.apache.org/job/james-server-trunk/ws/trunk/data-hbase/src/test/java/org/apache/james/user/hbase/HBaseUsersRepositoryTest.java>:[52,19]
tearDown() in org.apache.james.user.hbase.HBaseUsersRepositoryTest cannot override tearDown()
in org.apache.james.user.lib.AbstractUsersRepositoryTest; attempting to assign weaker access
privileges; was public

	at org.apache.maven.lifecycle.internal.MojoExecutor.execute(MojoExecutor.java:213)
	at org.apache.maven.lifecycle.internal.MojoExecutor.execute(MojoExecutor.java:153)
	at org.apache.maven.lifecycle.internal.MojoExecutor.execute(MojoExecutor.java:145)
	at org.apache.maven.lifecycle.internal.LifecycleModuleBuilder.buildProject(LifecycleModuleBuilder.java:84)
	at org.apache.maven.lifecycle.internal.LifecycleModuleBuilder.buildProject(LifecycleModuleBuilder.java:59)
	at org.apache.maven.lifecycle.internal.LifecycleStarter.singleThreadedBuild(LifecycleStarter.java:183)
	at org.apache.maven.lifecycle.internal.LifecycleStarter.execute(LifecycleStarter.java:161)
	at org.apache.maven.DefaultMaven.doExecute(DefaultMaven.java:319)
	at org.apache.maven.DefaultMaven.execute(DefaultMaven.java:156)
	at org.jvnet.hudson.maven3.launcher.Maven3Launcher.main(Maven3Launcher.java:79)
	at sun.reflect.NativeMethodAccessorImpl.invoke0(Native Method)
	at sun.reflect.NativeMethodAccessorImpl.invoke(NativeMethodAccessorImpl.java:39)
	at sun.reflect.DelegatingMethodAccessorImpl.invoke(DelegatingMethodAccessorImpl.java:25)
	at java.lang.reflect.Method.invoke(Method.java:597)
	at org.codehaus.plexus.classworlds.launcher.Launcher.launchStandard(Launcher.java:329)
	at org.codehaus.plexus.classworlds.launcher.Launcher.launch(Launcher.java:239)
	at org.jvnet.hudson.maven3.agent.Maven3Main.launch(Maven3Main.java:158)
	at hudson.maven.Maven3Builder.call(Maven3Builder.java:104)
	at hudson.maven.Maven3Builder.call(Maven3Builder.java:70)
	at hudson.remoting.UserRequest.perform(UserRequest.java:118)
	at hudson.remoting.UserRequest.perform(UserRequest.java:48)
	at hudson.remoting.Request$2.run(Request.java:287)
	at hudson.remoting.InterceptingExecutorService$1.call(InterceptingExecutorService.java:72)
	at java.util.concurrent.FutureTask$Sync.innerRun(FutureTask.java:303)
	at java.util.concurrent.FutureTask.run(FutureTask.java:138)
	at java.util.concurrent.ThreadPoolExecutor$Worker.runTask(ThreadPoolExecutor.java:886)
	at java.util.concurrent.ThreadPoolExecutor$Worker.run(ThreadPoolExecutor.java:908)
	at java.lang.Thread.run(Thread.java:662)
Caused by: org.apache.maven.plugin.CompilationFailureException: Compilation failure
<https://builds.apache.org/job/james-server-trunk/ws/trunk/data-hbase/src/test/java/org/apache/james/user/hbase/HBaseUsersRepositoryTest.java>:[52,19]
tearDown() in org.apache.james.user.hbase.HBaseUsersRepositoryTest cannot override tearDown()
in org.apache.james.user.lib.AbstractUsersRepositoryTest; attempting to assign weaker access
privileges; was public

	at org.apache.maven.plugin.AbstractCompilerMojo.execute(AbstractCompilerMojo.java:656)
	at org.apache.maven.plugin.TestCompilerMojo.execute(TestCompilerMojo.java:161)
	at org.apache.maven.plugin.DefaultBuildPluginManager.executeMojo(DefaultBuildPluginManager.java:101)
	at org.apache.maven.lifecycle.internal.MojoExecutor.execute(MojoExecutor.java:209)
	... 27 more
channel stopped


---------------------------------------------------------------------
To unsubscribe, e-mail: server-dev-unsubscribe@james.apache.org
For additional commands, e-mail: server-dev-help@james.apache.org


Mime
View raw message