james-server-dev mailing list archives

Site index · List index
Message view « Date » · « Thread »
Top « Date » · « Thread »
From Apache Jenkins Server <jenk...@builds.apache.org>
Subject Build failed in Jenkins: james-app-trunk #640
Date Fri, 02 Mar 2012 17:16:16 GMT
See <https://builds.apache.org/job/james-app-trunk/640/changes>

Changes:

[eric] [maven-release-plugin] prepare for next development iteration

[eric] [maven-release-plugin] prepare release apache-james-3.0-beta4

[eric] Update the templates to reflect the latest changes on our server/containers (JAMES-1376)

[eric] Add missing artifact definitions in app to prepare the release

[eric] Fix parent version to 3.0-beta4 to prepare the release

------------------------------------------
Started by an SCM change
Started by an SCM change
Building remotely on ubuntu5 in workspace <https://builds.apache.org/job/james-app-trunk/ws/>
Updating http://svn.apache.org/repos/asf/james/app/trunk
U         src/main/resources/lmtpserver-template.conf
U         src/main/resources/pop3server-template.conf
U         src/main/resources/smtpserver-template.conf
U         src/main/resources/imapserver-template.conf
U         src/main/resources/mailetcontainer-template.conf
U         pom.xml
At revision 1296312
Parsing POMs
Failed to transfer Could not find artifact org.apache.james:james-server:pom:3.0-beta4 in
central (http://repo.maven.apache.org/maven2)
ERROR: Failed to parse POMs
hudson.util.IOException2: remote file operation failed: <https://builds.apache.org/job/james-app-trunk/ws/trunk>
at hudson.remoting.Channel@1c8cd2ab:ubuntu5
	at hudson.FilePath.act(FilePath.java:784)
	at hudson.FilePath.act(FilePath.java:770)
	at hudson.maven.MavenModuleSetBuild$RunnerImpl.parsePoms(MavenModuleSetBuild.java:914)
	at hudson.maven.MavenModuleSetBuild$RunnerImpl.doRun(MavenModuleSetBuild.java:658)
	at hudson.model.AbstractBuild$AbstractRunner.run(AbstractBuild.java:473)
	at hudson.model.Run.run(Run.java:1408)
	at hudson.maven.MavenModuleSetBuild.run(MavenModuleSetBuild.java:481)
	at hudson.model.ResourceController.execute(ResourceController.java:88)
	at hudson.model.Executor.run(Executor.java:238)
Caused by: hudson.remoting.ProxyException: hudson.maven.MavenModuleSetBuild$MavenExecutionException:
org.apache.maven.project.ProjectBuildingException: Some problems were encountered while processing
the POMs:
[FATAL] Non-resolvable parent POM: Could not find artifact org.apache.james:james-server:pom:3.0-beta4
in central (http://repo.maven.apache.org/maven2) and 'parent.relativePath' points at no local
POM @ line 24, column 13

	at hudson.maven.MavenModuleSetBuild$PomParser.invoke(MavenModuleSetBuild.java:1274)
	at hudson.maven.MavenModuleSetBuild$PomParser.invoke(MavenModuleSetBuild.java:1049)
	at hudson.FilePath$FileCallableWrapper.call(FilePath.java:2099)
	at hudson.remoting.UserRequest.perform(UserRequest.java:118)
	at hudson.remoting.UserRequest.perform(UserRequest.java:48)
	at hudson.remoting.Request$2.run(Request.java:287)
	at hudson.remoting.InterceptingExecutorService$1.call(InterceptingExecutorService.java:72)
	at java.util.concurrent.FutureTask$Sync.innerRun(FutureTask.java:334)
	at java.util.concurrent.FutureTask.run(FutureTask.java:166)
	at java.util.concurrent.ThreadPoolExecutor.runWorker(ThreadPoolExecutor.java:1110)
	at java.util.concurrent.ThreadPoolExecutor$Worker.run(ThreadPoolExecutor.java:603)
	at java.lang.Thread.run(Thread.java:636)
Caused by: hudson.remoting.ProxyException: org.apache.maven.project.ProjectBuildingException:
Some problems were encountered while processing the POMs:
[FATAL] Non-resolvable parent POM: Could not find artifact org.apache.james:james-server:pom:3.0-beta4
in central (http://repo.maven.apache.org/maven2) and 'parent.relativePath' points at no local
POM @ line 24, column 13

	at org.apache.maven.project.DefaultProjectBuilder.build(DefaultProjectBuilder.java:363)
	at hudson.maven.MavenEmbedder.buildProjects(MavenEmbedder.java:361)
	at hudson.maven.MavenEmbedder.readProjects(MavenEmbedder.java:331)
	at hudson.maven.MavenModuleSetBuild$PomParser.invoke(MavenModuleSetBuild.java:1224)
	... 11 more


---------------------------------------------------------------------
To unsubscribe, e-mail: server-dev-unsubscribe@james.apache.org
For additional commands, e-mail: server-dev-help@james.apache.org


Mime
View raw message