james-server-dev mailing list archives

Site index · List index
Message view « Date » · « Thread »
Top « Date » · « Thread »
From Apache Jenkins Server <jenk...@builds.apache.org>
Subject Build failed in Jenkins: james-server-trunk #2699
Date Sun, 11 Mar 2012 22:25:16 GMT
See <https://builds.apache.org/job/james-server-trunk/2699/changes>

Changes:

[ieugen] JAMES-1393

- added @Override and reformated code
Issue #JAMES-1393 - Upgrate all test suites to junit 4.10

[ieugen] JAMES-1393

- updated tests to juni 4.x style
- added @Override and reformated code
Issue #JAMES-1393 - Upgrate all test suites to junit 4.10

------------------------------------------
[...truncated 1387 lines...]
 T E S T S
-------------------------------------------------------

[INFO] --- maven-surefire-plugin:2.10:test (default-test) @ james-server-data-library ---
Running org.apache.james.user.lib.UsersRepositoryManagementTest
Tests run: 5, Failures: 0, Errors: 0, Skipped: 0, Time elapsed: 0.107 sec

Results :

Tests run: 5, Failures: 0, Errors: 0, Skipped: 0

[JENKINS] Recording test results
[INFO] [INFO] Building jar: <https://builds.apache.org/job/james-server-trunk/ws/trunk/data-library/target/james-server-data-library-3.0-beta5-SNAPSHOT.jar>

[INFO] --- maven-jar-plugin:2.3.2:jar (default-jar) @ james-server-data-library ---
[INFO] 
[INFO] --- maven-site-plugin:3.0:attach-descriptor (attach-descriptor) @ james-server-data-library
---
[INFO] 
[INFO] --- maven-jar-plugin:2.3.2:jar (default) @ james-server-data-library ---
[INFO] [INFO] Building jar: <https://builds.apache.org/job/james-server-trunk/ws/trunk/data-library/target/james-server-data-library-3.0-beta5-SNAPSHOT-tests.jar>

[INFO] --- maven-jar-plugin:2.3.2:test-jar (default) @ james-server-data-library ---
[INFO] [INFO] Installing <https://builds.apache.org/job/james-server-trunk/ws/trunk/data-library/target/james-server-data-library-3.0-beta5-SNAPSHOT.jar>
to /home/hudson/hudson-slave/maven-repositories/1/org/apache/james/james-server-data-library/3.0-beta5-SNAPSHOT/james-server-data-library-3.0-beta5-SNAPSHOT.jar
[INFO] Installing <https://builds.apache.org/job/james-server-trunk/ws/trunk/data-library/pom.xml>
to /home/hudson/hudson-slave/maven-repositories/1/org/apache/james/james-server-data-library/3.0-beta5-SNAPSHOT/james-server-data-library-3.0-beta5-SNAPSHOT.pom
[INFO] Installing <https://builds.apache.org/job/james-server-trunk/ws/trunk/data-library/target/james-server-data-library-3.0-beta5-SNAPSHOT-tests.jar>
to /home/hudson/hudson-slave/maven-repositories/1/org/apache/james/james-server-data-library/3.0-beta5-SNAPSHOT/james-server-data-library-3.0-beta5-SNAPSHOT-tests.jar

[INFO] --- maven-install-plugin:2.3.1:install (default-install) @ james-server-data-library
---
[INFO] Downloading: https://repository.apache.org/content/repositories/snapshots/org/apache/james/james-server-data-library/3.0-beta5-SNAPSHOT/maven-metadata.xml

[INFO] --- maven-deploy-plugin:2.7:deploy (default-deploy) @ james-server-data-library ---
Downloaded: https://repository.apache.org/content/repositories/snapshots/org/apache/james/james-server-data-library/3.0-beta5-SNAPSHOT/maven-metadata.xml
(1023 B at 4.4 KB/sec)
Uploading: https://repository.apache.org/content/repositories/snapshots/org/apache/james/james-server-data-library/3.0-beta5-SNAPSHOT/james-server-data-library-3.0-beta5-20120311.222445-17.jar
Uploaded: https://repository.apache.org/content/repositories/snapshots/org/apache/james/james-server-data-library/3.0-beta5-SNAPSHOT/james-server-data-library-3.0-beta5-20120311.222445-17.jar
(52 KB at 144.9 KB/sec)
Uploading: https://repository.apache.org/content/repositories/snapshots/org/apache/james/james-server-data-library/3.0-beta5-SNAPSHOT/james-server-data-library-3.0-beta5-20120311.222445-17.pom
Uploaded: https://repository.apache.org/content/repositories/snapshots/org/apache/james/james-server-data-library/3.0-beta5-SNAPSHOT/james-server-data-library-3.0-beta5-20120311.222445-17.pom
(4 KB at 17.9 KB/sec)
Downloading: https://repository.apache.org/content/repositories/snapshots/org/apache/james/james-server-data-library/maven-metadata.xml
Downloaded: https://repository.apache.org/content/repositories/snapshots/org/apache/james/james-server-data-library/maven-metadata.xml
(495 B at 3.1 KB/sec)
Uploading: https://repository.apache.org/content/repositories/snapshots/org/apache/james/james-server-data-library/3.0-beta5-SNAPSHOT/maven-metadata.xml
Uploaded: https://repository.apache.org/content/repositories/snapshots/org/apache/james/james-server-data-library/3.0-beta5-SNAPSHOT/maven-metadata.xml
(1023 B at 4.8 KB/sec)
Uploading: https://repository.apache.org/content/repositories/snapshots/org/apache/james/james-server-data-library/maven-metadata.xml
Uploaded: https://repository.apache.org/content/repositories/snapshots/org/apache/james/james-server-data-library/maven-metadata.xml
(495 B at 3.2 KB/sec)
Uploading: https://repository.apache.org/content/repositories/snapshots/org/apache/james/james-server-data-library/3.0-beta5-SNAPSHOT/james-server-data-library-3.0-beta5-20120311.222445-17-tests.jar
Uploaded: https://repository.apache.org/content/repositories/snapshots/org/apache/james/james-server-data-library/3.0-beta5-SNAPSHOT/james-server-data-library-3.0-beta5-20120311.222445-17-tests.jar
(30 KB at 146.5 KB/sec)
Uploading: https://repository.apache.org/content/repositories/snapshots/org/apache/james/james-server-data-library/3.0-beta5-SNAPSHOT/maven-metadata.xml
Uploaded: https://repository.apache.org/content/repositories/snapshots/org/apache/james/james-server-data-library/3.0-beta5-SNAPSHOT/maven-metadata.xml
(1023 B at 6.4 KB/sec)
[JENKINS] Archiving <https://builds.apache.org/job/james-server-trunk/ws/trunk/data-library/pom.xml>
to /home/hudson/hudson/jobs/james-server-trunk/modules/org.apache.james$james-server-data-library/builds/2012-03-11_22-21-51/archive/org.apache.james/james-server-data-library/3.0-beta5-SNAPSHOT/james-server-data-library-3.0-beta5-SNAPSHOT.pom
[JENKINS] Archiving <https://builds.apache.org/job/james-server-trunk/ws/trunk/data-library/target/james-server-data-library-3.0-beta5-SNAPSHOT.jar>
to /home/hudson/hudson/jobs/james-server-trunk/modules/org.apache.james$james-server-data-library/builds/2012-03-11_22-21-51/archive/org.apache.james/james-server-data-library/3.0-beta5-20120311.222445-17/james-server-data-library-3.0-beta5-20120311.222445-17.jar
[JENKINS] Archiving <https://builds.apache.org/job/james-server-trunk/ws/trunk/data-library/target/james-server-data-library-3.0-beta5-SNAPSHOT-tests.jar>
to /home/hudson/hudson/jobs/james-server-trunk/modules/org.apache.james$james-server-data-library/builds/2012-03-11_22-21-51/archive/org.apache.james/james-server-data-library/3.0-beta5-20120311.222445-17/james-server-data-library-3.0-beta5-20120311.222445-17-tests.jar
[INFO]                                                                         
[INFO] ------------------------------------------------------------------------
[INFO] Building Apache James Server HBase Data Persistence 3.0-beta5-SNAPSHOT
[INFO] ------------------------------------------------------------------------
Downloading: http://download.java.net/maven/2/org/apache/james/apache-james-mailbox-hbase/0.5-SNAPSHOT/maven-metadata.xml
Downloading: http://repository.apache.org/snapshots/org/apache/james/apache-james-mailbox-hbase/0.5-SNAPSHOT/maven-metadata.xml
Downloaded: http://repository.apache.org/snapshots/org/apache/james/apache-james-mailbox-hbase/0.5-SNAPSHOT/maven-metadata.xml
(1000 B at 8.1 KB/sec)
Downloading: http://repository.apache.org/snapshots/org/apache/james/apache-james-mailbox/0.5-SNAPSHOT/maven-metadata.xml
Downloading: http://download.java.net/maven/2/org/apache/james/apache-james-mailbox/0.5-SNAPSHOT/maven-metadata.xml
Downloaded: http://repository.apache.org/snapshots/org/apache/james/apache-james-mailbox/0.5-SNAPSHOT/maven-metadata.xml
(2 KB at 7.5 KB/sec)
[INFO] [INFO] Deleting <https://builds.apache.org/job/james-server-trunk/ws/trunk/data-hbase/target>

[INFO] --- maven-clean-plugin:2.4.1:clean (default-clean) @ james-server-data-hbase ---
[INFO] 
[INFO] --- maven-remote-resources-plugin:1.2.1:process (default) @ james-server-data-hbase
---
Downloading: http://download.java.net/maven/2/org/apache/james/apache-james-mailbox-hbase/0.5-SNAPSHOT/maven-metadata.xml
Downloading: http://repository.apache.org/snapshots/org/apache/james/apache-james-mailbox-hbase/0.5-SNAPSHOT/maven-metadata.xml
Downloaded: http://repository.apache.org/snapshots/org/apache/james/apache-james-mailbox-hbase/0.5-SNAPSHOT/maven-metadata.xml
(1000 B at 8.8 KB/sec)
[debug] execute contextualize
[INFO] [INFO] Using 'UTF-8' encoding to copy filtered resources.
[INFO] skip non existing resourceDirectory <https://builds.apache.org/job/james-server-trunk/ws/trunk/data-hbase/src/main/resources>
[INFO] Copying 3 resources

[INFO] --- maven-resources-plugin:2.5:resources (default-resources) @ james-server-data-hbase
---
[INFO] [INFO] Compiling 7 source files to <https://builds.apache.org/job/james-server-trunk/ws/trunk/data-hbase/target/classes>

[INFO] --- maven-compiler-plugin:2.3.2:compile (default-compile) @ james-server-data-hbase
---
[INFO] 
[INFO] --- maven-bundle-plugin:2.3.5:manifest (bundle-manifest) @ james-server-data-hbase
---
[debug] execute contextualize
[INFO] [INFO] Using 'UTF-8' encoding to copy filtered resources.
[INFO] Copying 3 resources
[INFO] Copying 3 resources

[INFO] --- maven-resources-plugin:2.5:testResources (default-testResources) @ james-server-data-hbase
---
[INFO] [INFO] Compiling 5 source files to <https://builds.apache.org/job/james-server-trunk/ws/trunk/data-hbase/target/test-classes>

[INFO] --- maven-compiler-plugin:2.3.2:testCompile (default-testCompile) @ james-server-data-hbase
---
[INFO] [INFO] Surefire report directory: <https://builds.apache.org/job/james-server-trunk/ws/trunk/data-hbase/target/surefire-reports>

-------------------------------------------------------
 T E S T S
-------------------------------------------------------

-------------------------------------------------------
 T E S T S
-------------------------------------------------------

[INFO] --- maven-surefire-plugin:2.10:test (default-test) @ james-server-data-hbase ---
Running org.apache.james.JamesServerHBaseSuiteTest
2012-03-11 22:24:57,097 [main] WARN  org.apache.hadoop.metrics2.impl.MetricsSystemImpl - Source
name ugi already exists!
2012-03-11 22:24:57,122 [main] WARN  org.apache.hadoop.metrics2.impl.MetricsSystemImpl - Source
name ugi already exists!
Starting DataNode 0 with dfs.data.dir: <https://builds.apache.org/job/james-server-trunk/ws/trunk/data-hbase/target/test-data/094580ee-0604-4f21-b659-3dc432a3d2bc/dfscluster_b2ccef1a-1c73-4328-961e-2c056c9c2b4a/dfs/data/data1,/home/hudson/hudson-slave/workspace/james-server-trunk/trunk/data-hbase/target/test-data/094580ee-0604-4f21-b659-3dc432a3d2bc/dfscluster_b2ccef1a-1c73-4328-961e-2c056c9c2b4a/dfs/data/data2>
2012-03-11 22:24:58,441 [main] WARN  org.apache.hadoop.metrics2.impl.MetricsSystemImpl - NameNode
metrics system already initialized!
2012-03-11 22:24:58,442 [main] WARN  org.apache.hadoop.metrics2.impl.MetricsSystemImpl - Source
name ugi already exists!
2012-03-11 22:24:59,051 [main] WARN  org.apache.hadoop.metrics2.impl.MetricsSystemImpl - Source
name jvm already exists!
2012-03-11 22:25:08,860 [Master:0;vesta.apache.org,58657,1331504699814] WARN  org.apache.hadoop.hbase.zookeeper.RecoverableZooKeeper
- Node /hbase/root-region-server already deleted, and this is not a retry
2012-03-11 22:25:09,997 [main] ERROR org.apache.james.JamesServerHBaseSuiteTest - Cannot connect
to HBase mini-cluster, and so cannot run tests.
2012-03-11 22:25:09,997 [main] ERROR org.apache.james.JamesServerHBaseSuiteTest - Some network
configurations are known to cause this problem. Workarounds are available.
2012-03-11 22:25:09,997 [main] ERROR org.apache.james.JamesServerHBaseSuiteTest - See https://issues.apache.org/jira/browse/JAMES-1309
for more details.
2012-03-11 22:25:09,998 [main] ERROR org.apache.james.JamesServerHBaseSuiteTest - No server
address listed in -ROOT- for region .META.,,1.1028785192
org.apache.hadoop.hbase.client.NoServerForRegionException: No server address listed in -ROOT-
for region .META.,,1.1028785192
	at org.apache.hadoop.hbase.client.HConnectionManager$HConnectionImplementation.locateRegionInMeta(HConnectionManager.java:988)
	at org.apache.hadoop.hbase.client.HConnectionManager$HConnectionImplementation.locateRegion(HConnectionManager.java:814)
	at org.apache.hadoop.hbase.client.HConnectionManager$HConnectionImplementation.locateRegion(HConnectionManager.java:782)
	at org.apache.hadoop.hbase.client.HTable.finishSetup(HTable.java:249)
	at org.apache.hadoop.hbase.client.HTable.<init>(HTable.java:213)
	at org.apache.hadoop.hbase.HBaseTestingUtility.startMiniHBaseCluster(HBaseTestingUtility.java:525)
	at org.apache.hadoop.hbase.HBaseTestingUtility.startMiniCluster(HBaseTestingUtility.java:503)
	at org.apache.hadoop.hbase.HBaseTestingUtility.startMiniCluster(HBaseTestingUtility.java:451)
	at org.apache.hadoop.hbase.HBaseTestingUtility.startMiniCluster(HBaseTestingUtility.java:420)
	at org.apache.james.JamesServerHBaseSuiteTest.setup(JamesServerHBaseSuiteTest.java:74)
	at sun.reflect.NativeMethodAccessorImpl.invoke0(Native Method)
	at sun.reflect.NativeMethodAccessorImpl.invoke(NativeMethodAccessorImpl.java:39)
	at sun.reflect.DelegatingMethodAccessorImpl.invoke(DelegatingMethodAccessorImpl.java:25)
	at java.lang.reflect.Method.invoke(Method.java:597)
	at org.junit.runners.model.FrameworkMethod$1.runReflectiveCall(FrameworkMethod.java:45)
	at org.junit.internal.runners.model.ReflectiveCallable.run(ReflectiveCallable.java:15)
	at org.junit.runners.model.FrameworkMethod.invokeExplosively(FrameworkMethod.java:42)
	at org.junit.internal.runners.statements.RunBefores.evaluate(RunBefores.java:27)
	at org.junit.internal.runners.statements.RunAfters.evaluate(RunAfters.java:30)
	at org.junit.runners.ParentRunner.run(ParentRunner.java:300)
	at org.apache.maven.surefire.junit4.JUnit4TestSet.execute(JUnit4TestSet.java:53)
	at org.apache.maven.surefire.junit4.JUnit4Provider.executeTestSet(JUnit4Provider.java:123)
	at org.apache.maven.surefire.junit4.JUnit4Provider.invoke(JUnit4Provider.java:104)
	at sun.reflect.NativeMethodAccessorImpl.invoke0(Native Method)
	at sun.reflect.NativeMethodAccessorImpl.invoke(NativeMethodAccessorImpl.java:39)
	at sun.reflect.DelegatingMethodAccessorImpl.invoke(DelegatingMethodAccessorImpl.java:25)
	at java.lang.reflect.Method.invoke(Method.java:597)
	at org.apache.maven.surefire.util.ReflectionUtils.invokeMethodWithArray(ReflectionUtils.java:164)
	at org.apache.maven.surefire.booter.ProviderFactory$ProviderProxy.invoke(ProviderFactory.java:110)
	at org.apache.maven.surefire.booter.SurefireStarter.invokeProvider(SurefireStarter.java:175)
	at org.apache.maven.surefire.booter.SurefireStarter.runSuitesInProcessWhenForked(SurefireStarter.java:81)
	at org.apache.maven.surefire.booter.ForkedBooter.main(ForkedBooter.java:68)
Tests run: 1, Failures: 0, Errors: 1, Skipped: 0, Time elapsed: 14.6 sec <<< FAILURE!
2012-03-11 22:25:12,598 [RegionServer:0;vesta.apache.org,39034,1331504700096] WARN  org.apache.hadoop.hbase.regionserver.HRegionServer
- Received close for region we are already opening or closing; 70236052

Results :

Tests in error: 
  org.apache.james.JamesServerHBaseSuiteTest: No server address listed in -ROOT- for region
.META.,,1.1028785192

Tests run: 1, Failures: 0, Errors: 1, Skipped: 0

[JENKINS] Recording test results
[JENKINS] Archiving <https://builds.apache.org/job/james-server-trunk/ws/trunk/data-hbase/pom.xml>
to /home/hudson/hudson/jobs/james-server-trunk/modules/org.apache.james$james-server-data-hbase/builds/2012-03-11_22-21-51/archive/org.apache.james/james-server-data-hbase/3.0-beta5-SNAPSHOT/james-server-data-hbase-3.0-beta5-SNAPSHOT.pom
[INFO] ------------------------------------------------------------------------
[INFO] Reactor Summary:
[INFO] 
[INFO] Apache James Server ............................... SUCCESS [28.462s]
[INFO] Apache James Server Lifecycle API ................. SUCCESS [5.753s]
[INFO] Apache James Server Filesystem API ................ SUCCESS [5.113s]
[INFO] Apache James Server Data API ...................... SUCCESS [5.023s]
[INFO] Apache James Server Lifecycle Spring .............. SUCCESS [7.335s]
[INFO] Apache James Server Mailetcontainer API ........... SUCCESS [5.536s]
[INFO] Apache James Server Common Utilities .............. SUCCESS [16.544s]
[INFO] Apache James Server Protocols Library ............. SUCCESS [6.634s]
[INFO] Apache James Server Core .......................... SUCCESS [13.686s]
[INFO] Apache James Server Container Spring .............. SUCCESS [7.757s]
[INFO] Apache James Server DNS Server API ................ SUCCESS [5.466s]
[INFO] Apache James Server DNSService Implementation ..... SUCCESS [5.315s]
[INFO] Apache James Server DNSService Library ............ SUCCESS [7.217s]
[INFO] Apache James Server Queue API ..................... SUCCESS [4.818s]
[INFO] Apache James Server FetchMail ..................... SUCCESS [4.831s]
[INFO] Apache James Server Data Library .................. SUCCESS [6.357s]
[INFO] Apache James Server HBase Data Persistence ........ FAILURE [24.077s]
[INFO] Apache James Server JPA Data Persistence .......... SKIPPED
[INFO] Apache James Server JCR Data Persistence .......... SKIPPED
[INFO] Apache James Server JDBC Data Persistence ......... SKIPPED
[INFO] Apache James Server File Data Persistence ......... SKIPPED
[INFO] Apache James Server LDAP Data Implementation ...... SKIPPED
[INFO] Apache James Server Mailbox Adapter ............... SKIPPED
[INFO] Apache James Server Mailetcontainer Camel ......... SKIPPED
[INFO] Apache James Server Mailets ....................... SKIPPED
[INFO] Apache James Server IMAP .......................... SKIPPED
[INFO] Apache James Server SMTP .......................... SKIPPED
[INFO] Apache James Server LMTP .......................... SKIPPED
[INFO] Apache James Server POP3 .......................... SKIPPED
[INFO] Apache James Server File Mail Queue ............... SKIPPED
[INFO] Apache James Server JMS Mail Queue ................ SKIPPED
[INFO] Apache James Server ActiveMQ Queue ................ SKIPPED
[INFO] Apache James Server Client ........................ SKIPPED
[INFO] ------------------------------------------------------------------------
[INFO] BUILD FAILURE
[INFO] ------------------------------------------------------------------------
[INFO] Total time: 3:13.713s
[INFO] Finished at: Sun Mar 11 22:25:14 UTC 2012
[INFO] Final Memory: 67M/254M
[INFO] ------------------------------------------------------------------------
Waiting for Jenkins to finish collecting data
mavenExecutionResult exceptions not empty
message : Failed to execute goal org.apache.maven.plugins:maven-surefire-plugin:2.10:test
(default-test) on project james-server-data-hbase: There are test failures.

Please refer to <https://builds.apache.org/job/james-server-trunk/ws/trunk/data-hbase/target/surefire-reports>
for the individual test results.
cause : There are test failures.

Please refer to <https://builds.apache.org/job/james-server-trunk/ws/trunk/data-hbase/target/surefire-reports>
for the individual test results.
Stack trace : 
org.apache.maven.lifecycle.LifecycleExecutionException: Failed to execute goal org.apache.maven.plugins:maven-surefire-plugin:2.10:test
(default-test) on project james-server-data-hbase: There are test failures.

Please refer to <https://builds.apache.org/job/james-server-trunk/ws/trunk/data-hbase/target/surefire-reports>
for the individual test results.
	at org.apache.maven.lifecycle.internal.MojoExecutor.execute(MojoExecutor.java:213)
	at org.apache.maven.lifecycle.internal.MojoExecutor.execute(MojoExecutor.java:153)
	at org.apache.maven.lifecycle.internal.MojoExecutor.execute(MojoExecutor.java:145)
	at org.apache.maven.lifecycle.internal.LifecycleModuleBuilder.buildProject(LifecycleModuleBuilder.java:84)
	at org.apache.maven.lifecycle.internal.LifecycleModuleBuilder.buildProject(LifecycleModuleBuilder.java:59)
	at org.apache.maven.lifecycle.internal.LifecycleStarter.singleThreadedBuild(LifecycleStarter.java:183)
	at org.apache.maven.lifecycle.internal.LifecycleStarter.execute(LifecycleStarter.java:161)
	at org.apache.maven.DefaultMaven.doExecute(DefaultMaven.java:319)
	at org.apache.maven.DefaultMaven.execute(DefaultMaven.java:156)
	at org.jvnet.hudson.maven3.launcher.Maven3Launcher.main(Maven3Launcher.java:79)
	at sun.reflect.NativeMethodAccessorImpl.invoke0(Native Method)
	at sun.reflect.NativeMethodAccessorImpl.invoke(NativeMethodAccessorImpl.java:39)
	at sun.reflect.DelegatingMethodAccessorImpl.invoke(DelegatingMethodAccessorImpl.java:25)
	at java.lang.reflect.Method.invoke(Method.java:597)
	at org.codehaus.plexus.classworlds.launcher.Launcher.launchStandard(Launcher.java:329)
	at org.codehaus.plexus.classworlds.launcher.Launcher.launch(Launcher.java:239)
	at org.jvnet.hudson.maven3.agent.Maven3Main.launch(Maven3Main.java:158)
	at hudson.maven.Maven3Builder.call(Maven3Builder.java:104)
	at hudson.maven.Maven3Builder.call(Maven3Builder.java:70)
	at hudson.remoting.UserRequest.perform(UserRequest.java:118)
	at hudson.remoting.UserRequest.perform(UserRequest.java:48)
	at hudson.remoting.Request$2.run(Request.java:287)
	at hudson.remoting.InterceptingExecutorService$1.call(InterceptingExecutorService.java:72)
	at java.util.concurrent.FutureTask$Sync.innerRun(FutureTask.java:303)
	at java.util.concurrent.FutureTask.run(FutureTask.java:138)
	at java.util.concurrent.ThreadPoolExecutor$Worker.runTask(ThreadPoolExecutor.java:886)
	at java.util.concurrent.ThreadPoolExecutor$Worker.run(ThreadPoolExecutor.java:908)
	at java.lang.Thread.run(Thread.java:662)
Caused by: org.apache.maven.plugin.MojoFailureException: There are test failures.

Please refer to <https://builds.apache.org/job/james-server-trunk/ws/trunk/data-hbase/target/surefire-reports>
for the individual test results.
	at org.apache.maven.plugin.surefire.SurefireHelper.reportExecution(SurefireHelper.java:87)
	at org.apache.maven.plugin.surefire.SurefirePlugin.writeSummary(SurefirePlugin.java:641)
	at org.apache.maven.plugin.surefire.SurefirePlugin.handleSummary(SurefirePlugin.java:615)
	at org.apache.maven.plugin.surefire.AbstractSurefireMojo.executeAfterPreconditionsChecked(AbstractSurefireMojo.java:137)
	at org.apache.maven.plugin.surefire.AbstractSurefireMojo.execute(AbstractSurefireMojo.java:98)
	at org.apache.maven.plugin.DefaultBuildPluginManager.executeMojo(DefaultBuildPluginManager.java:101)
	at org.apache.maven.lifecycle.internal.MojoExecutor.execute(MojoExecutor.java:209)
	... 27 more
channel stopped


---------------------------------------------------------------------
To unsubscribe, e-mail: server-dev-unsubscribe@james.apache.org
For additional commands, e-mail: server-dev-help@james.apache.org


Mime
View raw message